{"text_format":"1","workbook":"xlsx","n_sheets":6,"sheets":["rooster en stand","kalender","export html","spelersstatistieken","Topschutters","Stats"],"not_rendered":{"charts":0,"images":13,"macros":1,"external_links":0,"defined_names":37,"comments":2,"pivot_tables":0},"unopened":[],"bounds":{"document_bytes":16777216,"sheet_cells":100000,"rows_first":2000,"rows_last":500,"rows_between":2000,"halvings":0,"cell_chars":16384,"cell_head_chars":4096},"cells_cut":0,"cells_raw":0,"read":"whole","date_system":"1900"}

{"sheet":"rooster en stand","index":0,"n_rows":49,"n_cols":104,"rows_kept":49,"cut":false,"hidden":false,"merged":[[2,36,3,36],[2,49,3,49],[2,47,3,47],[2,42,3,42],[2,24,3,24],[2,34,3,34],[2,48,3,48],[2,57,3,57],[2,51,3,51],[2,52,3,52],[2,53,3,53],[2,54,3,54],[2,55,3,55],[2,56,3,56],[2,50,3,50],[2,27,3,27],[2,28,3,28],[2,25,3,25],[2,26,3,26],[2,46,3,46],[2,43,3,43],[2,30,3,30],[2,31,3,31],[2,32,3,32],[2,33,3,33],[2,38,3,38],[2,37,3,37],[2,39,3,39],[2,40,3,40],[2,41,3,41],[20,5,20,7],[2,44,3,44],[2,45,3,45],[2,19,3,19],[2,20,3,20],[2,29,3,29],[2,18,3,18],[2,2,2,7],[3,5,3,6],[2,15,3,15],[2,16,3,16],[2,17,3,17],[2,23,3,23],[2,21,3,21],[2,22,3,22],[2,35,3,35]]}
[]
[null,null,"Updated:","2025-04-02T21:35:27",null,"© 2024/2025 - Wim Gielis - wim.gielis@gmail.com - https://www.wimgielis.com"]
[null,null,"LUCYVO",null,null,null,null,null,null,null,null,null,null,null,null,null,{"$f":"P5","v":"Alberta Schilde"},{"$f":"P6","v":"Antwerp Global"},{"$f":"P7","v":"Bar Patron"},{"$f":"P8","v":"Bariton"},{"$f":"P9","v":"Corum"},{"$f":"P10","v":"Daltons"},{"$f":"P11","v":"Goka"},{"$f":"P12","v":"Hombeek"},{"$f":"P13","v":"Jolika"},{"$f":"P14","v":"Lucyvo"},{"$f":"P15","v":"Racing Emblem"},{"$f":"P16","v":"Sint Anneke"},{"$f":"P17","v":"SC Duffel"},{"$f":"P18","v":"Yerevan United"},{"$f":"P5","v":"Alberta Schilde"},{"$f":"P6","v":"Antwerp Global"},{"$f":"P7","v":"Bar Patron"},{"$f":"P8","v":"Bariton"},{"$f":"P9","v":"Corum"},{"$f":"P10","v":"Daltons"},{"$f":"P11","v":"Goka"},{"$f":"P12","v":"Hombeek"},{"$f":"P13","v":"Jolika"},{"$f":"P14","v":"Lucyvo"},{"$f":"P15","v":"Racing Emblem"},{"$f":"P16","v":"Sint Anneke"},{"$f":"P17","v":"SC Duffel"},{"$f":"P18","v":"Yerevan United"},{"$f":"P5","v":"Alberta Schilde"},{"$f":"P6","v":"Antwerp Global"},{"$f":"P7","v":"Bar Patron"},{"$f":"P8","v":"Bariton"},{"$f":"P9","v":"Corum"},{"$f":"P10","v":"Daltons"},{"$f":"P11","v":"Goka"},{"$f":"P12","v":"Hombeek"},{"$f":"P13","v":"Jolika"},{"$f":"P14","v":"Lucyvo"},{"$f":"P15","v":"Racing Emblem"},{"$f":"P16","v":"Sint Anneke"},{"$f":"P17","v":"SC Duffel"},{"$f":"P18","v":"Yerevan United"}]
[null,null,null,"Ploeg","P","M",null,"W","V","G","+","-","S","VP",null,null,null,null,null,null,null,null,null,null,null,null,null,null,null,null,null,null,null,null,null,null,null,null,null,null,null,null,null,null,null,null,null,null,null,null,null,null,null,null,null,null,null,null,null,"Coëfficiënt","Ploeg","Punten","Matchen","W","V","G","D+","D-","DS","Ff","Nr","Coëf sorted",null,null,1,2,3,4,5,6,7,8,9,10,11,12,13,14,null,1,2,3,4,5,6,7,8,9,10,11,12,13,14]
[null,null,1,{"$f":"VLOOKUP(BT5,HulpberekeningenStand,2,FALSE)","v":"Daltons"},{"$f":"3*H5+J5","v":69},{"$f":"SUM(H5:J5)","v":25},{"$f":"REPT(IF(F5-MODE($F$5:$F$18)<0,\"-\",\"+\"),ABS(F5-MODE($F$5:$F$18)))","v":""},{"$f":"VLOOKUP(BT5,HulpberekeningenStand,5,FALSE)","v":22},{"$f":"VLOOKUP(BT5,HulpberekeningenStand,6,FALSE)","v":0},{"$f":"VLOOKUP(BT5,HulpberekeningenStand,7,FALSE)","v":3},{"$f":"VLOOKUP(BT5,HulpberekeningenStand,8,FALSE)","v":113},{"$f":"VLOOKUP(BT5,HulpberekeningenStand,9,FALSE)","v":15},{"$f":"K5-L5","v":98},{"$f":"3*F5-E5","v":6},null,"Alberta Schilde",null,"2-0","3-3","7-1","*5-0","1-2","*5-0","9-2","2-1","4-5","5-0","8-0","3-1","2-2",null,6,8,18,14,13,22,25,10,16,20,2,11,4,null,"2024-10-06","2024-10-20","2025-03-12","2024-12-08","2024-12-01","2025-03-09","2025-03-30","2024-11-10","2025-01-19","2025-02-16","2024-09-08","2024-11-17","2024-09-22",null,{"$f":"RANK( BJ5, $BJ$5:$BJ$18, 0 ) - RANK( BK5, $BK$5:$BK$18, 0 ) / 10^2 + RANK( BL5, $BL$5:$BL$18, 0 ) / 10^4 + RANK( BQ5, $BQ$5:$BQ$18, 0 ) / 10^6 + RANK( BO5, $BO$5:$BO$18, 0 ) / 10^8 + BS5 / 10^10","v":2.9903020401000004},{"$f":"P5","v":"Alberta Schilde"},{"$f":"3 * BL5 + BN5","v":48},{"$f":"SUM( BL5:BN5 )","v":25},{"$f":"CHOOSE(StandBer,COUNTIF(BW35:CJ35,\"t\")+COUNTIF(BW35:BW48,\"u\")+COUNTIF(CL35:CY35,\"t\")+COUNTIF(CL35:CL48,\"u\"),COUNTIF(BW35:CJ35,\"t\")+COUNTIF(BW35:BW48,\"u\"),COUNTIF(CL35:CY35,\"t\")+COUNTIF(CL35:CL48,\"u\"),COUNTIF(BW35:CJ35,\"t\")+COUNTIF(CL35:CY35,\"t\"),COUNTIF(BW35:BW48,\"u\")+COUNTIF(CL35:CL48,\"u\"))","v":15},{"$f":"CHOOSE(StandBer,COUNTIF(BW35:CJ35,\"u\")+COUNTIF(BW35:BW48,\"t\")+COUNTIF(CL35:CY35,\"u\")+COUNTIF(CL35:CL48,\"t\"),COUNTIF(BW35:CJ35,\"u\")+COUNTIF(BW35:BW48,\"t\"),COUNTIF(CL35:CY35,\"u\")+COUNTIF(CL35:CL48,\"t\"),COUNTIF(BW35:CJ35,\"u\")+COUNTIF(CL35:CY35,\"u\"),COUNTIF(BW35:BW48,\"t\")+COUNTIF(CL35:CL48,\"t\"))+BR5","v":7},{"$f":"CHOOSE(StandBer,COUNTIF(BW35:CJ35,\"g\")+COUNTIF(BW35:BW48,\"g\")+COUNTIF(CL35:CY35,\"g\")+COUNTIF(CL35:CL48,\"g\"),COUNTIF(BW35:CJ35,\"g\")+COUNTIF(BW35:BW48,\"g\"),COUNTIF(CL35:CY35,\"g\")+COUNTIF(CL35:CL48,\"g\"),COUNTIF(BW35:CJ35,\"g\")+COUNTIF(CL35:CY35,\"g\"),COUNTIF(BW35:BW48,\"g\")+COUNTIF(CL35:CL48,\"g\"))","v":3},{"$f":"CHOOSE(StandBer,SUM(BW5:CJ5)+SUM(BW20:BW33)+SUM(CL5:CY5)+SUM(CL20:CL33),SUM(BW5:CJ5)+SUM(BW20:BW33),SUM(CL5:CY5)+SUM(CL20:CL33),SUM(BW5:CJ5)+SUM(CL5:CY5),SUM(BW20:BW33)+SUM(CL20:CL33))-5*BR5","v":88},{"$f":"CHOOSE(StandBer,SUM(BW5:BW18)+SUM(BW20:CJ20)+SUM(CL5:CL18)+SUM(CL20:CY20),SUM(BW5:BW18)+SUM(BW20:CJ20),SUM(CL5:CL18)+SUM(CL20:CY20),SUM(BW5:BW18)+SUM(CL5:CL18),SUM(BW20:CJ20)+SUM(CL20:CY20))","v":41},{"$f":"BO5 - BP5","v":47},{"$f":"CHOOSE(StandBer,COUNTIF(BW35:CJ35,\"ff\")+COUNTIF(BW35:BW48,\"ff\")+COUNTIF(CL35:CY35,\"ff\")+COUNTIF(CL35:CL48,\"ff\"),COUNTIF(BW35:CJ35,\"ff\")+COUNTIF(BW35:BW48,\"ff\"),COUNTIF(CL35:CY35,\"ff\")+COUNTIF(CL35:CL48,\"ff\"),COUNTIF(BW35:CJ35,\"ff\")+COUNTIF(CL35:CY35,\"ff\"),COUNTIF(BW35:BW48,\"ff\")+COUNTIF(CL35:CL48,\"ff\"))","v":0},1,{"$f":"SMALL( $BH$5:$BH$18, BS5 )","v":0.99010101060000011},null,1,null,{"$f":"IF(OR(ISERROR(FIND(\"-\",R5)),AF5>'export html'!$AR$7),\"\",SUBSTITUTE(_xlfn.TEXTBEFORE(R5,\"-\"),\"*\",\"\")-0)","v":2},{"$f":"IF(OR(ISERROR(FIND(\"-\",S5)),AG5>'export html'!$AR$7),\"\",SUBSTITUTE(_xlfn.TEXTBEFORE(S5,\"-\"),\"*\",\"\")-0)","v":3},{"$f":"IF(OR(ISERROR(FIND(\"-\",T5)),AH5>'export html'!$AR$7),\"\",SUBSTITUTE(_xlfn.TEXTBEFORE(T5,\"-\"),\"*\",\"\")-0)","v":""},{"$f":"IF(OR(ISERROR(FIND(\"-\",U5)),AI5>'export html'!$AR$7),\"\",SUBSTITUTE(_xlfn.TEXTBEFORE(U5,\"-\"),\"*\",\"\")-0)","v":""},{"$f":"IF(OR(ISERROR(FIND(\"-\",V5)),AJ5>'export html'!$AR$7),\"\",SUBSTITUTE(_xlfn.TEXTBEFORE(V5,\"-\"),\"*\",\"\")-0)","v":1},{"$f":"IF(OR(ISERROR(FIND(\"-\",W5)),AK5>'export html'!$AR$7),\"\",SUBSTITUTE(_xlfn.TEXTBEFORE(W5,\"-\"),\"*\",\"\")-0)","v":""},{"$f":"IF(OR(ISERROR(FIND(\"-\",X5)),AL5>'export html'!$AR$7),\"\",SUBSTITUTE(_xlfn.TEXTBEFORE(X5,\"-\"),\"*\",\"\")-0)","v":""},{"$f":"IF(OR(ISERROR(FIND(\"-\",Y5)),AM5>'export html'!$AR$7),\"\",SUBSTITUTE(_xlfn.TEXTBEFORE(Y5,\"-\"),\"*\",\"\")-0)","v":2},{"$f":"IF(OR(ISERROR(FIND(\"-\",Z5)),AN5>'export html'!$AR$7),\"\",SUBSTITUTE(_xlfn.TEXTBEFORE(Z5,\"-\"),\"*\",\"\")-0)","v":""},{"$f":"IF(OR(ISERROR(FIND(\"-\",AA5)),AO5>'export html'!$AR$7),\"\",SUBSTITUTE(_xlfn.TEXTBEFORE(AA5,\"-\"),\"*\",\"\")-0)","v":""},{"$f":"IF(OR(ISERROR(FIND(\"-\",AB5)),AP5>'export html'!$AR$7),\"\",SUBSTITUTE(_xlfn.TEXTBEFORE(AB5,\"-\"),\"*\",\"\")-0)","v":8},{"$f":"IF(OR(ISERROR(FIND(\"-\",AC5)),AQ5>'export html'!$AR$7),\"\",SUBSTITUTE(_xlfn.TEXTBEFORE(AC5,\"-\"),\"*\",\"\")-0)","v":3},{"$f":"IF(OR(ISERROR(FIND(\"-\",AD5)),AR5>'export html'!$AR$7),\"\",SUBSTITUTE(_xlfn.TEXTBEFORE(AD5,\"-\"),\"*\",\"\")-0)","v":2},1,null,{"$f":"IF(OR(ISERROR(FIND(\"-\",R5)),AF5<='export html'!$AR$7),\"\",SUBSTITUTE(_xlfn.TEXTBEFORE(R5,\"-\"),\"*\",\"\")-0)","v":""},{"$f":"IF(OR(ISERROR(FIND(\"-\",S5)),AG5<='export html'!$AR$7),\"\",SUBSTITUTE(_xlfn.TEXTBEFORE(S5,\"-\"),\"*\",\"\")-0)","v":""},{"$f":"IF(OR(ISERROR(FIND(\"-\",T5)),AH5<='export html'!$AR$7),\"\",SUBSTITUTE(_xlfn.TEXTBEFORE(T5,\"-\"),\"*\",\"\")-0)","v":7},{"$f":"IF(OR(ISERROR(FIND(\"-\",U5)),AI5<='export html'!$AR$7),\"\",SUBSTITUTE(_xlfn.TEXTBEFORE(U5,\"-\"),\"*\",\"\")-0)","v":5},{"$f":"IF(OR(ISERROR(FIND(\"-\",V5)),AJ5<='export html'!$AR$7),\"\",SUBSTITUTE(_xlfn.TEXTBEFORE(V5,\"-\"),\"*\",\"\")-0)","v":""},{"$f":"IF(OR(ISERROR(FIND(\"-\",W5)),AK5<='export html'!$AR$7),\"\",SUBSTITUTE(_xlfn.TEXTBEFORE(W5,\"-\"),\"*\",\"\")-0)","v":5},{"$f":"IF(OR(ISERROR(FIND(\"-\",X5)),AL5<='export html'!$AR$7),\"\",SUBSTITUTE(_xlfn.TEXTBEFORE(X5,\"-\"),\"*\",\"\")-0)","v":9},{"$f":"IF(OR(ISERROR(FIND(\"-\",Y5)),AM5<='export html'!$AR$7),\"\",SUBSTITUTE(_xlfn.TEXTBEFORE(Y5,\"-\"),\"*\",\"\")-0)","v":""},{"$f":"IF(OR(ISERROR(FIND(\"-\",Z5)),AN5<='export html'!$AR$7),\"\",SUBSTITUTE(_xlfn.TEXTBEFORE(Z5,\"-\"),\"*\",\"\")-0)","v":4},{"$f":"IF(OR(ISERROR(FIND(\"-\",AA5)),AO5<='export html'!$AR$7),\"\",SUBSTITUTE(_xlfn.TEXTBEFORE(AA5,\"-\"),\"*\",\"\")-0)","v":5},{"$f":"IF(OR(ISERROR(FIND(\"-\",AB5)),AP5<='export html'!$AR$7),\"\",SUBSTITUTE(_xlfn.TEXTBEFORE(AB5,\"-\"),\"*\",\"\")-0)","v":""},{"$f":"IF(OR(ISERROR(FIND(\"-\",AC5)),AQ5<='export html'!$AR$7),\"\",SUBSTITUTE(_xlfn.TEXTBEFORE(AC5,\"-\"),\"*\",\"\")-0)","v":""},{"$f":"IF(OR(ISERROR(FIND(\"-\",AD5)),AR5<='export html'!$AR$7),\"\",SUBSTITUTE(_xlfn.TEXTBEFORE(AD5,\"-\"),\"*\",\"\")-0)","v":""},1]
[null,null,{"$f":"IF(RANK(E6,$E$5:$E$18,0)>RANK(E5,$E$5:$E$18,0),RANK(E6,$E$5:$E$18,0),\"\")","v":2},{"$f":"VLOOKUP(BT6,HulpberekeningenStand,2,FALSE)","v":"Yerevan United"},51,25,{"$f":"REPT(IF(F6-MODE($F$5:$F$18)<0,\"-\",\"+\"),ABS(F6-MODE($F$5:$F$18)))","v":""},{"$f":"VLOOKUP(BT6,HulpberekeningenStand,5,FALSE)","v":16},{"$f":"VLOOKUP(BT6,HulpberekeningenStand,6,FALSE)","v":6},{"$f":"VLOOKUP(BT6,HulpberekeningenStand,7,FALSE)","v":3},{"$f":"VLOOKUP(BT6,HulpberekeningenStand,8,FALSE)","v":103},{"$f":"VLOOKUP(BT6,HulpberekeningenStand,9,FALSE)","v":62},41,24,null,"Antwerp Global","4-2",null,"2-2","8-1","3-2","0-4","3-1","1-1","*5-0","4-0","4-3","4-4","3-1","2-4",19,null,17,14,23,9,5,21,2,25,3,11,7,13,"2025-02-09",null,"2025-01-26","2024-12-08","2025-03-16","2024-11-03","2024-09-29","2025-02-23","2024-09-08","2025-03-30","2024-09-15","2024-11-17","2024-10-13","2024-12-01",null,{"$f":"RANK( BJ6, $BJ$5:$BJ$18, 0 ) - RANK( BK6, $BK$5:$BK$18, 0 ) / 10^2 + RANK( BL6, $BL$5:$BL$18, 0 ) / 10^4 + RANK( BQ6, $BQ$5:$BQ$18, 0 ) / 10^6 + RANK( BO6, $BO$5:$BO$18, 0 ) / 10^8 + BS6 / 10^10","v":3.9904040602000004},"Antwerp Global",{"$f":"3 * BL6 + BN6","v":47},{"$f":"SUM( BL6:BN6 )","v":25},{"$f":"CHOOSE(StandBer,COUNTIF(BW36:CJ36,\"t\")+COUNTIF(BX35:BX48,\"u\")+COUNTIF(CL36:CY36,\"t\")+COUNTIF(CM35:CM48,\"u\"),COUNTIF(BW36:CJ36,\"t\")+COUNTIF(BX35:BX48,\"u\"),COUNTIF(CL36:CY36,\"t\")+COUNTIF(CM35:CM48,\"u\"),COUNTIF(BW36:CJ36,\"t\")+COUNTIF(CL36:CY36,\"t\"),COUNTIF(BX35:BX48,\"u\")+COUNTIF(CM35:CM48,\"u\"))","v":14},{"$f":"CHOOSE(StandBer,COUNTIF(BW36:CJ36,\"u\")+COUNTIF(BX35:BX48,\"t\")+COUNTIF(CL36:CY36,\"u\")+COUNTIF(CM35:CM48,\"t\"),COUNTIF(BW36:CJ36,\"u\")+COUNTIF(BX35:BX48,\"t\"),COUNTIF(CL36:CY36,\"u\")+COUNTIF(CM35:CM48,\"t\"),COUNTIF(BW36:CJ36,\"u\")+COUNTIF(CL36:CY36,\"u\"),COUNTIF(BX35:BX48,\"t\")+COUNTIF(CM35:CM48,\"t\"))+BR6","v":6},{"$f":"CHOOSE(StandBer,COUNTIF(BW36:CJ36,\"g\")+COUNTIF(BX35:BX48,\"g\")+COUNTIF(CL36:CY36,\"g\")+COUNTIF(CM35:CM48,\"g\"),COUNTIF(BW36:CJ36,\"g\")+COUNTIF(BX35:BX48,\"g\"),COUNTIF(CL36:CY36,\"g\")+COUNTIF(CM35:CM48,\"g\"),COUNTIF(BW36:CJ36,\"g\")+COUNTIF(CL36:CY36,\"g\"),COUNTIF(BX35:BX48,\"g\")+COUNTIF(CM35:CM48,\"g\"))","v":5},{"$f":"CHOOSE(StandBer,SUM(BW6:CJ6)+SUM(BX20:BX33)+SUM(CL6:CY6)+SUM(CM20:CM33),SUM(BW6:CJ6)+SUM(BX20:BX33),SUM(CL6:CY6)+SUM(CM20:CM33),SUM(BW6:CJ6)+SUM(CL6:CY6),SUM(BX20:BX33)+SUM(CM20:CM33))-5*BR6","v":83},{"$f":"CHOOSE(StandBer,SUM(BX5:BX18)+SUM(BW21:CJ21)+SUM(CM5:CM18)+SUM(CL21:CY21),SUM(BX5:BX18)+SUM(BW21:CJ21),SUM(CM5:CM18)+SUM(CL21:CY21),SUM(BX5:BX18)+SUM(CM5:CM18),SUM(BW21:CJ21)+SUM(CL21:CY21))","v":48},{"$f":"BO6 - BP6","v":35},{"$f":"CHOOSE(StandBer,COUNTIF(BW36:CJ36,\"ff\")+COUNTIF(BX35:BX48,\"ff\")+COUNTIF(CL36:CY36,\"ff\")+COUNTIF(CM35:CM48,\"ff\"),COUNTIF(BW36:CJ36,\"ff\")+COUNTIF(BX35:BX48,\"ff\"),COUNTIF(CL36:CY36,\"ff\")+COUNTIF(CM35:CM48,\"ff\"),COUNTIF(BW36:CJ36,\"ff\")+COUNTIF(CL36:CY36,\"ff\"),COUNTIF(BX35:BX48,\"ff\")+COUNTIF(CM35:CM48,\"ff\"))","v":0},2,{"$f":"SMALL( $BH$5:$BH$18, BS6 )","v":1.9902030213999999},null,2,{"$f":"IF(OR(ISERROR(FIND(\"-\",Q6)),AE6>'export html'!$AR$7),\"\",SUBSTITUTE(_xlfn.TEXTBEFORE(Q6,\"-\"),\"*\",\"\")-0)","v":""},null,{"$f":"IF(OR(ISERROR(FIND(\"-\",S6)),AG6>'export html'!$AR$7),\"\",SUBSTITUTE(_xlfn.TEXTBEFORE(S6,\"-\"),\"*\",\"\")-0)","v":""},{"$f":"IF(OR(ISERROR(FIND(\"-\",T6)),AH6>'export html'!$AR$7),\"\",SUBSTITUTE(_xlfn.TEXTBEFORE(T6,\"-\"),\"*\",\"\")-0)","v":""},{"$f":"IF(OR(ISERROR(FIND(\"-\",U6)),AI6>'export html'!$AR$7),\"\",SUBSTITUTE(_xlfn.TEXTBEFORE(U6,\"-\"),\"*\",\"\")-0)","v":""},{"$f":"IF(OR(ISERROR(FIND(\"-\",V6)),AJ6>'export html'!$AR$7),\"\",SUBSTITUTE(_xlfn.TEXTBEFORE(V6,\"-\"),\"*\",\"\")-0)","v":0},{"$f":"IF(OR(ISERROR(FIND(\"-\",W6)),AK6>'export html'!$AR$7),\"\",SUBSTITUTE(_xlfn.TEXTBEFORE(W6,\"-\"),\"*\",\"\")-0)","v":3},{"$f":"IF(OR(ISERROR(FIND(\"-\",X6)),AL6>'export html'!$AR$7),\"\",SUBSTITUTE(_xlfn.TEXTBEFORE(X6,\"-\"),\"*\",\"\")-0)","v":""},{"$f":"IF(OR(ISERROR(FIND(\"-\",Y6)),AM6>'export html'!$AR$7),\"\",SUBSTITUTE(_xlfn.TEXTBEFORE(Y6,\"-\"),\"*\",\"\")-0)","v":5},{"$f":"IF(OR(ISERROR(FIND(\"-\",Z6)),AN6>'export html'!$AR$7),\"\",SUBSTITUTE(_xlfn.TEXTBEFORE(Z6,\"-\"),\"*\",\"\")-0)","v":""},{"$f":"IF(OR(ISERROR(FIND(\"-\",AA6)),AO6>'export html'!$AR$7),\"\",SUBSTITUTE(_xlfn.TEXTBEFORE(AA6,\"-\"),\"*\",\"\")-0)","v":4},{"$f":"IF(OR(ISERROR(FIND(\"-\",AB6)),AP6>'export html'!$AR$7),\"\",SUBSTITUTE(_xlfn.TEXTBEFORE(AB6,\"-\"),\"*\",\"\")-0)","v":4},{"$f":"IF(OR(ISERROR(FIND(\"-\",AC6)),AQ6>'export html'!$AR$7),\"\",SUBSTITUTE(_xlfn.TEXTBEFORE(AC6,\"-\"),\"*\",\"\")-0)","v":3},{"$f":"IF(OR(ISERROR(FIND(\"-\",AD6)),AR6>'export html'!$AR$7),\"\",SUBSTITUTE(_xlfn.TEXTBEFORE(AD6,\"-\"),\"*\",\"\")-0)","v":2},2,{"$f":"IF(OR(ISERROR(FIND(\"-\",Q6)),AE6<='export html'!$AR$7),\"\",SUBSTITUTE(_xlfn.TEXTBEFORE(Q6,\"-\"),\"*\",\"\")-0)","v":4},null,{"$f":"IF(OR(ISERROR(FIND(\"-\",S6)),AG6<='export html'!$AR$7),\"\",SUBSTITUTE(_xlfn.TEXTBEFORE(S6,\"-\"),\"*\",\"\")-0)","v":2},{"$f":"IF(OR(ISERROR(FIND(\"-\",T6)),AH6<='export html'!$AR$7),\"\",SUBSTITUTE(_xlfn.TEXTBEFORE(T6,\"-\"),\"*\",\"\")-0)","v":8},{"$f":"IF(OR(ISERROR(FIND(\"-\",U6)),AI6<='export html'!$AR$7),\"\",SUBSTITUTE(_xlfn.TEXTBEFORE(U6,\"-\"),\"*\",\"\")-0)","v":3},{"$f":"IF(OR(ISERROR(FIND(\"-\",V6)),AJ6<='export html'!$AR$7),\"\",SUBSTITUTE(_xlfn.TEXTBEFORE(V6,\"-\"),\"*\",\"\")-0)","v":""},{"$f":"IF(OR(ISERROR(FIND(\"-\",W6)),AK6<='export html'!$AR$7),\"\",SUBSTITUTE(_xlfn.TEXTBEFORE(W6,\"-\"),\"*\",\"\")-0)","v":""},{"$f":"IF(OR(ISERROR(FIND(\"-\",X6)),AL6<='export html'!$AR$7),\"\",SUBSTITUTE(_xlfn.TEXTBEFORE(X6,\"-\"),\"*\",\"\")-0)","v":1},{"$f":"IF(OR(ISERROR(FIND(\"-\",Y6)),AM6<='export html'!$AR$7),\"\",SUBSTITUTE(_xlfn.TEXTBEFORE(Y6,\"-\"),\"*\",\"\")-0)","v":""},{"$f":"IF(OR(ISERROR(FIND(\"-\",Z6)),AN6<='export html'!$AR$7),\"\",SUBSTITUTE(_xlfn.TEXTBEFORE(Z6,\"-\"),\"*\",\"\")-0)","v":4},{"$f":"IF(OR(ISERROR(FIND(\"-\",AA6)),AO6<='export html'!$AR$7),\"\",SUBSTITUTE(_xlfn.TEXTBEFORE(AA6,\"-\"),\"*\",\"\")-0)","v":""},{"$f":"IF(OR(ISERROR(FIND(\"-\",AB6)),AP6<='export html'!$AR$7),\"\",SUBSTITUTE(_xlfn.TEXTBEFORE(AB6,\"-\"),\"*\",\"\")-0)","v":""},{"$f":"IF(OR(ISERROR(FIND(\"-\",AC6)),AQ6<='export html'!$AR$7),\"\",SUBSTITUTE(_xlfn.TEXTBEFORE(AC6,\"-\"),\"*\",\"\")-0)","v":""},{"$f":"IF(OR(ISERROR(FIND(\"-\",AD6)),AR6<='export html'!$AR$7),\"\",SUBSTITUTE(_xlfn.TEXTBEFORE(AD6,\"-\"),\"*\",\"\")-0)","v":""},2]
[null,null,{"$f":"IF(RANK(E7,$E$5:$E$18,0)>RANK(E6,$E$5:$E$18,0),RANK(E7,$E$5:$E$18,0),\"\")","v":3},{"$f":"VLOOKUP(BT7,HulpberekeningenStand,2,FALSE)","v":"Alberta Schilde"},48,25,{"$f":"REPT(IF(F7-MODE($F$5:$F$18)<0,\"-\",\"+\"),ABS(F7-MODE($F$5:$F$18)))","v":""},{"$f":"VLOOKUP(BT7,HulpberekeningenStand,5,FALSE)","v":15},{"$f":"VLOOKUP(BT7,HulpberekeningenStand,6,FALSE)","v":7},{"$f":"VLOOKUP(BT7,HulpberekeningenStand,7,FALSE)","v":3},{"$f":"VLOOKUP(BT7,HulpberekeningenStand,8,FALSE)","v":88},{"$f":"VLOOKUP(BT7,HulpberekeningenStand,9,FALSE)","v":41},47,27,null,"Bar Patron","2-5","4-2",null,"*5-0","4-1","1-1","4-2","2-1","6-0","3-3","2-2","2-6","2-3","4-4",21,4,null,16,25,11,7,23,6,14,18,13,9,2,"2025-02-23","2024-09-22",null,"2025-01-19","2025-03-30","2024-11-17","2024-10-13","2025-03-16","2024-10-06","2024-12-08","2025-02-02","2024-12-01","2024-11-03","2024-09-08",null,{"$f":"RANK( BJ7, $BJ$5:$BJ$18, 0 ) - RANK( BK7, $BK$5:$BK$18, 0 ) / 10^2 + RANK( BL7, $BL$5:$BL$18, 0 ) / 10^4 + RANK( BQ7, $BQ$5:$BQ$18, 0 ) / 10^6 + RANK( BO7, $BO$5:$BO$18, 0 ) / 10^8 + BS7 / 10^10","v":4.9905060702999995},"Bar Patron",42,25,{"$f":"CHOOSE(StandBer,COUNTIF(BW37:CJ37,\"t\")+COUNTIF(BY35:BY48,\"u\")+COUNTIF(CL37:CY37,\"t\")+COUNTIF(CN35:CN48,\"u\"),COUNTIF(BW37:CJ37,\"t\")+COUNTIF(BY35:BY48,\"u\"),COUNTIF(CL37:CY37,\"t\")+COUNTIF(CN35:CN48,\"u\"),COUNTIF(BW37:CJ37,\"t\")+COUNTIF(CL37:CY37,\"t\"),COUNTIF(BY35:BY48,\"u\")+COUNTIF(CN35:CN48,\"u\"))","v":12},{"$f":"CHOOSE(StandBer,COUNTIF(BW37:CJ37,\"u\")+COUNTIF(BY35:BY48,\"t\")+COUNTIF(CL37:CY37,\"u\")+COUNTIF(CN35:CN48,\"t\"),COUNTIF(BW37:CJ37,\"u\")+COUNTIF(BY35:BY48,\"t\"),COUNTIF(CL37:CY37,\"u\")+COUNTIF(CN35:CN48,\"t\"),COUNTIF(BW37:CJ37,\"u\")+COUNTIF(CL37:CY37,\"u\"),COUNTIF(BY35:BY48,\"t\")+COUNTIF(CN35:CN48,\"t\"))+BR7","v":7},{"$f":"CHOOSE(StandBer,COUNTIF(BW37:CJ37,\"g\")+COUNTIF(BY35:BY48,\"g\")+COUNTIF(CL37:CY37,\"g\")+COUNTIF(CN35:CN48,\"g\"),COUNTIF(BW37:CJ37,\"g\")+COUNTIF(BY35:BY48,\"g\"),COUNTIF(CL37:CY37,\"g\")+COUNTIF(CN35:CN48,\"g\"),COUNTIF(BW37:CJ37,\"g\")+COUNTIF(CL37:CY37,\"g\"),COUNTIF(BY35:BY48,\"g\")+COUNTIF(CN35:CN48,\"g\"))","v":6},{"$f":"CHOOSE(StandBer,SUM(BW7:CJ7)+SUM(BY20:BY33)+SUM(CL7:CY7)+SUM(CN20:CN33),SUM(BW7:CJ7)+SUM(BY20:BY33),SUM(CL7:CY7)+SUM(CN20:CN33),SUM(BW7:CJ7)+SUM(CL7:CY7),SUM(BY20:BY33)+SUM(CN20:CN33))-5*BR7","v":73},{"$f":"CHOOSE(StandBer,SUM(BY5:BY18)+SUM(BW22:CJ22)+SUM(CN5:CN18)+SUM(CL22:CY22),SUM(BY5:BY18)+SUM(BW22:CJ22),SUM(CN5:CN18)+SUM(CL22:CY22),SUM(BY5:BY18)+SUM(CN5:CN18),SUM(BW22:CJ22)+SUM(CL22:CY22))","v":66},7,{"$f":"CHOOSE(StandBer,COUNTIF(BW37:CJ37,\"ff\")+COUNTIF(BY35:BY48,\"ff\")+COUNTIF(CL37:CY37,\"ff\")+COUNTIF(CN35:CN48,\"ff\"),COUNTIF(BW37:CJ37,\"ff\")+COUNTIF(BY35:BY48,\"ff\"),COUNTIF(CL37:CY37,\"ff\")+COUNTIF(CN35:CN48,\"ff\"),COUNTIF(BW37:CJ37,\"ff\")+COUNTIF(CL37:CY37,\"ff\"),COUNTIF(BY35:BY48,\"ff\")+COUNTIF(CN35:CN48,\"ff\"))","v":0},3,{"$f":"SMALL( $BH$5:$BH$18, BS7 )","v":2.9903020401000004},null,3,{"$f":"IF(OR(ISERROR(FIND(\"-\",Q7)),AE7>'export html'!$AR$7),\"\",SUBSTITUTE(_xlfn.TEXTBEFORE(Q7,\"-\"),\"*\",\"\")-0)","v":""},{"$f":"IF(OR(ISERROR(FIND(\"-\",R7)),AF7>'export html'!$AR$7),\"\",SUBSTITUTE(_xlfn.TEXTBEFORE(R7,\"-\"),\"*\",\"\")-0)","v":4},null,{"$f":"IF(OR(ISERROR(FIND(\"-\",T7)),AH7>'export html'!$AR$7),\"\",SUBSTITUTE(_xlfn.TEXTBEFORE(T7,\"-\"),\"*\",\"\")-0)","v":""},{"$f":"IF(OR(ISERROR(FIND(\"-\",U7)),AI7>'export html'!$AR$7),\"\",SUBSTITUTE(_xlfn.TEXTBEFORE(U7,\"-\"),\"*\",\"\")-0)","v":""},{"$f":"IF(OR(ISERROR(FIND(\"-\",V7)),AJ7>'export html'!$AR$7),\"\",SUBSTITUTE(_xlfn.TEXTBEFORE(V7,\"-\"),\"*\",\"\")-0)","v":1},{"$f":"IF(OR(ISERROR(FIND(\"-\",W7)),AK7>'export html'!$AR$7),\"\",SUBSTITUTE(_xlfn.TEXTBEFORE(W7,\"-\"),\"*\",\"\")-0)","v":4},{"$f":"IF(OR(ISERROR(FIND(\"-\",X7)),AL7>'export html'!$AR$7),\"\",SUBSTITUTE(_xlfn.TEXTBEFORE(X7,\"-\"),\"*\",\"\")-0)","v":""},{"$f":"IF(OR(ISERROR(FIND(\"-\",Y7)),AM7>'export html'!$AR$7),\"\",SUBSTITUTE(_xlfn.TEXTBEFORE(Y7,\"-\"),\"*\",\"\")-0)","v":6},{"$f":"IF(OR(ISERROR(FIND(\"-\",Z7)),AN7>'export html'!$AR$7),\"\",SUBSTITUTE(_xlfn.TEXTBEFORE(Z7,\"-\"),\"*\",\"\")-0)","v":""},{"$f":"IF(OR(ISERROR(FIND(\"-\",AA7)),AO7>'export html'!$AR$7),\"\",SUBSTITUTE(_xlfn.TEXTBEFORE(AA7,\"-\"),\"*\",\"\")-0)","v":""},{"$f":"IF(OR(ISERROR(FIND(\"-\",AB7)),AP7>'export html'!$AR$7),\"\",SUBSTITUTE(_xlfn.TEXTBEFORE(AB7,\"-\"),\"*\",\"\")-0)","v":2},{"$f":"IF(OR(ISERROR(FIND(\"-\",AC7)),AQ7>'export html'!$AR$7),\"\",SUBSTITUTE(_xlfn.TEXTBEFORE(AC7,\"-\"),\"*\",\"\")-0)","v":2},{"$f":"IF(OR(ISERROR(FIND(\"-\",AD7)),AR7>'export html'!$AR$7),\"\",SUBSTITUTE(_xlfn.TEXTBEFORE(AD7,\"-\"),\"*\",\"\")-0)","v":4},3,{"$f":"IF(OR(ISERROR(FIND(\"-\",Q7)),AE7<='export html'!$AR$7),\"\",SUBSTITUTE(_xlfn.TEXTBEFORE(Q7,\"-\"),\"*\",\"\")-0)","v":2},{"$f":"IF(OR(ISERROR(FIND(\"-\",R7)),AF7<='export html'!$AR$7),\"\",SUBSTITUTE(_xlfn.TEXTBEFORE(R7,\"-\"),\"*\",\"\")-0)","v":""},null,{"$f":"IF(OR(ISERROR(FIND(\"-\",T7)),AH7<='export html'!$AR$7),\"\",SUBSTITUTE(_xlfn.TEXTBEFORE(T7,\"-\"),\"*\",\"\")-0)","v":5},{"$f":"IF(OR(ISERROR(FIND(\"-\",U7)),AI7<='export html'!$AR$7),\"\",SUBSTITUTE(_xlfn.TEXTBEFORE(U7,\"-\"),\"*\",\"\")-0)","v":4},{"$f":"IF(OR(ISERROR(FIND(\"-\",V7)),AJ7<='export html'!$AR$7),\"\",SUBSTITUTE(_xlfn.TEXTBEFORE(V7,\"-\"),\"*\",\"\")-0)","v":""},{"$f":"IF(OR(ISERROR(FIND(\"-\",W7)),AK7<='export html'!$AR$7),\"\",SUBSTITUTE(_xlfn.TEXTBEFORE(W7,\"-\"),\"*\",\"\")-0)","v":""},{"$f":"IF(OR(ISERROR(FIND(\"-\",X7)),AL7<='export html'!$AR$7),\"\",SUBSTITUTE(_xlfn.TEXTBEFORE(X7,\"-\"),\"*\",\"\")-0)","v":2},{"$f":"IF(OR(ISERROR(FIND(\"-\",Y7)),AM7<='export html'!$AR$7),\"\",SUBSTITUTE(_xlfn.TEXTBEFORE(Y7,\"-\"),\"*\",\"\")-0)","v":""},{"$f":"IF(OR(ISERROR(FIND(\"-\",Z7)),AN7<='export html'!$AR$7),\"\",SUBSTITUTE(_xlfn.TEXTBEFORE(Z7,\"-\"),\"*\",\"\")-0)","v":3},{"$f":"IF(OR(ISERROR(FIND(\"-\",AA7)),AO7<='export html'!$AR$7),\"\",SUBSTITUTE(_xlfn.TEXTBEFORE(AA7,\"-\"),\"*\",\"\")-0)","v":2},{"$f":"IF(OR(ISERROR(FIND(\"-\",AB7)),AP7<='export html'!$AR$7),\"\",SUBSTITUTE(_xlfn.TEXTBEFORE(AB7,\"-\"),\"*\",\"\")-0)","v":""},{"$f":"IF(OR(ISERROR(FIND(\"-\",AC7)),AQ7<='export html'!$AR$7),\"\",SUBSTITUTE(_xlfn.TEXTBEFORE(AC7,\"-\"),\"*\",\"\")-0)","v":""},{"$f":"IF(OR(ISERROR(FIND(\"-\",AD7)),AR7<='export html'!$AR$7),\"\",SUBSTITUTE(_xlfn.TEXTBEFORE(AD7,\"-\"),\"*\",\"\")-0)","v":""},3]
[null,null,4,{"$f":"VLOOKUP(BT8,HulpberekeningenStand,2,FALSE)","v":"Antwerp Global"},{"$f":"3*H8+J8","v":47},{"$f":"SUM(H8:J8)","v":25},{"$f":"REPT(IF(F8-MODE($F$5:$F$18)<0,\"-\",\"+\"),ABS(F8-MODE($F$5:$F$18)))","v":""},{"$f":"VLOOKUP(BT8,HulpberekeningenStand,5,FALSE)","v":14},{"$f":"VLOOKUP(BT8,HulpberekeningenStand,6,FALSE)","v":6},{"$f":"VLOOKUP(BT8,HulpberekeningenStand,7,FALSE)","v":5},{"$f":"VLOOKUP(BT8,HulpberekeningenStand,8,FALSE)","v":83},{"$f":"VLOOKUP(BT8,HulpberekeningenStand,9,FALSE)","v":48},{"$f":"K8-L8","v":35},{"$f":"3*F8-E8","v":28},null,"Bariton","4-1","2-7","3-7",null,"3-2","0-10","1-3","4-5","4-1","1-1","2-4","2-1","3-0","1-4",5,1,3,null,9,21,17,7,13,11,15,23,19,25,"2024-09-29","2024-09-01","2024-09-15",null,"2024-11-03","2025-02-23","2025-01-26","2024-10-13","2024-12-01","2024-11-17","2025-03-02","2025-03-16","2025-02-09","2025-03-30",null,{"$f":"RANK( BJ8, $BJ$5:$BJ$18, 0 ) - RANK( BK8, $BK$5:$BK$18, 0 ) / 10^2 + RANK( BL8, $BL$5:$BL$18, 0 ) / 10^4 + RANK( BQ8, $BQ$5:$BQ$18, 0 ) / 10^6 + RANK( BO8, $BO$5:$BO$18, 0 ) / 10^8 + BS8 / 10^10","v":11.9912131304},"Bariton",20,25,{"$f":"CHOOSE(StandBer,COUNTIF(BW38:CJ38,\"t\")+COUNTIF(BZ35:BZ48,\"u\")+COUNTIF(CL38:CY38,\"t\")+COUNTIF(CO35:CO48,\"u\"),COUNTIF(BW38:CJ38,\"t\")+COUNTIF(BZ35:BZ48,\"u\"),COUNTIF(CL38:CY38,\"t\")+COUNTIF(CO35:CO48,\"u\"),COUNTIF(BW38:CJ38,\"t\")+COUNTIF(CL38:CY38,\"t\"),COUNTIF(BZ35:BZ48,\"u\")+COUNTIF(CO35:CO48,\"u\"))","v":6},{"$f":"CHOOSE(StandBer,COUNTIF(BW38:CJ38,\"u\")+COUNTIF(BZ35:BZ48,\"t\")+COUNTIF(CL38:CY38,\"u\")+COUNTIF(CO35:CO48,\"t\"),COUNTIF(BW38:CJ38,\"u\")+COUNTIF(BZ35:BZ48,\"t\"),COUNTIF(CL38:CY38,\"u\")+COUNTIF(CO35:CO48,\"t\"),COUNTIF(BW38:CJ38,\"u\")+COUNTIF(CL38:CY38,\"u\"),COUNTIF(BZ35:BZ48,\"t\")+COUNTIF(CO35:CO48,\"t\"))+BR8","v":17},{"$f":"CHOOSE(StandBer,COUNTIF(BW38:CJ38,\"g\")+COUNTIF(BZ35:BZ48,\"g\")+COUNTIF(CL38:CY38,\"g\")+COUNTIF(CO35:CO48,\"g\"),COUNTIF(BW38:CJ38,\"g\")+COUNTIF(BZ35:BZ48,\"g\"),COUNTIF(CL38:CY38,\"g\")+COUNTIF(CO35:CO48,\"g\"),COUNTIF(BW38:CJ38,\"g\")+COUNTIF(CL38:CY38,\"g\"),COUNTIF(BZ35:BZ48,\"g\")+COUNTIF(CO35:CO48,\"g\"))","v":2},{"$f":"CHOOSE(StandBer,SUM(BW8:CJ8)+SUM(BZ20:BZ33)+SUM(CL8:CY8)+SUM(CO20:CO33),SUM(BW8:CJ8)+SUM(BZ20:BZ33),SUM(CL8:CY8)+SUM(CO20:CO33),SUM(BW8:CJ8)+SUM(CL8:CY8),SUM(BZ20:BZ33)+SUM(CO20:CO33))-5*BR8","v":45},{"$f":"CHOOSE(StandBer,SUM(BZ5:BZ18)+SUM(BW23:CJ23)+SUM(CO5:CO18)+SUM(CL23:CY23),SUM(BZ5:BZ18)+SUM(BW23:CJ23),SUM(CO5:CO18)+SUM(CL23:CY23),SUM(BZ5:BZ18)+SUM(CO5:CO18),SUM(BW23:CJ23)+SUM(CL23:CY23))","v":102},-57,{"$f":"CHOOSE(StandBer,COUNTIF(BW38:CJ38,\"ff\")+COUNTIF(BZ35:BZ48,\"ff\")+COUNTIF(CL38:CY38,\"ff\")+COUNTIF(CO35:CO48,\"ff\"),COUNTIF(BW38:CJ38,\"ff\")+COUNTIF(BZ35:BZ48,\"ff\"),COUNTIF(CL38:CY38,\"ff\")+COUNTIF(CO35:CO48,\"ff\"),COUNTIF(BW38:CJ38,\"ff\")+COUNTIF(CL38:CY38,\"ff\"),COUNTIF(BZ35:BZ48,\"ff\")+COUNTIF(CO35:CO48,\"ff\"))","v":0},4,{"$f":"SMALL( $BH$5:$BH$18, BS8 )","v":3.9904040602000004},null,4,{"$f":"IF(OR(ISERROR(FIND(\"-\",Q8)),AE8>'export html'!$AR$7),\"\",SUBSTITUTE(_xlfn.TEXTBEFORE(Q8,\"-\"),\"*\",\"\")-0)","v":4},{"$f":"IF(OR(ISERROR(FIND(\"-\",R8)),AF8>'export html'!$AR$7),\"\",SUBSTITUTE(_xlfn.TEXTBEFORE(R8,\"-\"),\"*\",\"\")-0)","v":2},{"$f":"IF(OR(ISERROR(FIND(\"-\",S8)),AG8>'export html'!$AR$7),\"\",SUBSTITUTE(_xlfn.TEXTBEFORE(S8,\"-\"),\"*\",\"\")-0)","v":3},null,{"$f":"IF(OR(ISERROR(FIND(\"-\",U8)),AI8>'export html'!$AR$7),\"\",SUBSTITUTE(_xlfn.TEXTBEFORE(U8,\"-\"),\"*\",\"\")-0)","v":3},{"$f":"IF(OR(ISERROR(FIND(\"-\",V8)),AJ8>'export html'!$AR$7),\"\",SUBSTITUTE(_xlfn.TEXTBEFORE(V8,\"-\"),\"*\",\"\")-0)","v":""},{"$f":"IF(OR(ISERROR(FIND(\"-\",W8)),AK8>'export html'!$AR$7),\"\",SUBSTITUTE(_xlfn.TEXTBEFORE(W8,\"-\"),\"*\",\"\")-0)","v":""},{"$f":"IF(OR(ISERROR(FIND(\"-\",X8)),AL8>'export html'!$AR$7),\"\",SUBSTITUTE(_xlfn.TEXTBEFORE(X8,\"-\"),\"*\",\"\")-0)","v":4},{"$f":"IF(OR(ISERROR(FIND(\"-\",Y8)),AM8>'export html'!$AR$7),\"\",SUBSTITUTE(_xlfn.TEXTBEFORE(Y8,\"-\"),\"*\",\"\")-0)","v":4},{"$f":"IF(OR(ISERROR(FIND(\"-\",Z8)),AN8>'export html'!$AR$7),\"\",SUBSTITUTE(_xlfn.TEXTBEFORE(Z8,\"-\"),\"*\",\"\")-0)","v":1},{"$f":"IF(OR(ISERROR(FIND(\"-\",AA8)),AO8>'export html'!$AR$7),\"\",SUBSTITUTE(_xlfn.TEXTBEFORE(AA8,\"-\"),\"*\",\"\")-0)","v":""},{"$f":"IF(OR(ISERROR(FIND(\"-\",AB8)),AP8>'export html'!$AR$7),\"\",SUBSTITUTE(_xlfn.TEXTBEFORE(AB8,\"-\"),\"*\",\"\")-0)","v":""},{"$f":"IF(OR(ISERROR(FIND(\"-\",AC8)),AQ8>'export html'!$AR$7),\"\",SUBSTITUTE(_xlfn.TEXTBEFORE(AC8,\"-\"),\"*\",\"\")-0)","v":""},{"$f":"IF(OR(ISERROR(FIND(\"-\",AD8)),AR8>'export html'!$AR$7),\"\",SUBSTITUTE(_xlfn.TEXTBEFORE(AD8,\"-\"),\"*\",\"\")-0)","v":""},4,{"$f":"IF(OR(ISERROR(FIND(\"-\",Q8)),AE8<='export html'!$AR$7),\"\",SUBSTITUTE(_xlfn.TEXTBEFORE(Q8,\"-\"),\"*\",\"\")-0)","v":""},{"$f":"IF(OR(ISERROR(FIND(\"-\",R8)),AF8<='export html'!$AR$7),\"\",SUBSTITUTE(_xlfn.TEXTBEFORE(R8,\"-\"),\"*\",\"\")-0)","v":""},{"$f":"IF(OR(ISERROR(FIND(\"-\",S8)),AG8<='export html'!$AR$7),\"\",SUBSTITUTE(_xlfn.TEXTBEFORE(S8,\"-\"),\"*\",\"\")-0)","v":""},null,{"$f":"IF(OR(ISERROR(FIND(\"-\",U8)),AI8<='export html'!$AR$7),\"\",SUBSTITUTE(_xlfn.TEXTBEFORE(U8,\"-\"),\"*\",\"\")-0)","v":""},{"$f":"IF(OR(ISERROR(FIND(\"-\",V8)),AJ8<='export html'!$AR$7),\"\",SUBSTITUTE(_xlfn.TEXTBEFORE(V8,\"-\"),\"*\",\"\")-0)","v":0},{"$f":"IF(OR(ISERROR(FIND(\"-\",W8)),AK8<='export html'!$AR$7),\"\",SUBSTITUTE(_xlfn.TEXTBEFORE(W8,\"-\"),\"*\",\"\")-0)","v":1},{"$f":"IF(OR(ISERROR(FIND(\"-\",X8)),AL8<='export html'!$AR$7),\"\",SUBSTITUTE(_xlfn.TEXTBEFORE(X8,\"-\"),\"*\",\"\")-0)","v":""},{"$f":"IF(OR(ISERROR(FIND(\"-\",Y8)),AM8<='export html'!$AR$7),\"\",SUBSTITUTE(_xlfn.TEXTBEFORE(Y8,\"-\"),\"*\",\"\")-0)","v":""},{"$f":"IF(OR(ISERROR(FIND(\"-\",Z8)),AN8<='export html'!$AR$7),\"\",SUBSTITUTE(_xlfn.TEXTBEFORE(Z8,\"-\"),\"*\",\"\")-0)","v":""},{"$f":"IF(OR(ISERROR(FIND(\"-\",AA8)),AO8<='export html'!$AR$7),\"\",SUBSTITUTE(_xlfn.TEXTBEFORE(AA8,\"-\"),\"*\",\"\")-0)","v":2},{"$f":"IF(OR(ISERROR(FIND(\"-\",AB8)),AP8<='export html'!$AR$7),\"\",SUBSTITUTE(_xlfn.TEXTBEFORE(AB8,\"-\"),\"*\",\"\")-0)","v":2},{"$f":"IF(OR(ISERROR(FIND(\"-\",AC8)),AQ8<='export html'!$AR$7),\"\",SUBSTITUTE(_xlfn.TEXTBEFORE(AC8,\"-\"),\"*\",\"\")-0)","v":3},{"$f":"IF(OR(ISERROR(FIND(\"-\",AD8)),AR8<='export html'!$AR$7),\"\",SUBSTITUTE(_xlfn.TEXTBEFORE(AD8,\"-\"),\"*\",\"\")-0)","v":1},4]
[null,null,5,"Bar Patron",42,25,{"$f":"REPT(IF(F9-MODE($F$5:$F$18)<0,\"-\",\"+\"),ABS(F9-MODE($F$5:$F$18)))","v":""},12,7,6,73,66,7,33,null,"Corum","2-3","4-4","4-1","8-1",null,"0-9",null,"4-5","8-1","9-0","2-5","2-10","3-2","2-6",1,10,12,22,null,17,26,3,18,20,24,6,15,8,"2024-09-01","2024-11-10","2024-11-24","2025-03-09",null,"2025-01-26","2025-04-06","2024-09-15","2025-02-02","2025-02-16","2025-03-23","2024-10-06","2024-10-27","2024-10-20",null,{"$f":"RANK( BJ9, $BJ$5:$BJ$18, 0 ) - RANK( BK9, $BK$5:$BK$18, 0 ) / 10^2 + RANK( BL9, $BL$5:$BL$18, 0 ) / 10^4 + RANK( BQ9, $BQ$5:$BQ$18, 0 ) / 10^6 + RANK( BO9, $BO$5:$BO$18, 0 ) / 10^8 + BS9 / 10^10","v":10.9910100505},"Corum",25,25,{"$f":"CHOOSE(StandBer,COUNTIF(BW39:CJ39,\"t\")+COUNTIF(CA35:CA48,\"u\")+COUNTIF(CL39:CY39,\"t\")+COUNTIF(CP35:CP48,\"u\"),COUNTIF(BW39:CJ39,\"t\")+COUNTIF(CA35:CA48,\"u\"),COUNTIF(CL39:CY39,\"t\")+COUNTIF(CP35:CP48,\"u\"),COUNTIF(BW39:CJ39,\"t\")+COUNTIF(CL39:CY39,\"t\"),COUNTIF(CA35:CA48,\"u\")+COUNTIF(CP35:CP48,\"u\"))","v":7},{"$f":"CHOOSE(StandBer,COUNTIF(BW39:CJ39,\"u\")+COUNTIF(CA35:CA48,\"t\")+COUNTIF(CL39:CY39,\"u\")+COUNTIF(CP35:CP48,\"t\"),COUNTIF(BW39:CJ39,\"u\")+COUNTIF(CA35:CA48,\"t\"),COUNTIF(CL39:CY39,\"u\")+COUNTIF(CP35:CP48,\"t\"),COUNTIF(BW39:CJ39,\"u\")+COUNTIF(CL39:CY39,\"u\"),COUNTIF(CA35:CA48,\"t\")+COUNTIF(CP35:CP48,\"t\"))+BR9","v":14},{"$f":"CHOOSE(StandBer,COUNTIF(BW39:CJ39,\"g\")+COUNTIF(CA35:CA48,\"g\")+COUNTIF(CL39:CY39,\"g\")+COUNTIF(CP35:CP48,\"g\"),COUNTIF(BW39:CJ39,\"g\")+COUNTIF(CA35:CA48,\"g\"),COUNTIF(CL39:CY39,\"g\")+COUNTIF(CP35:CP48,\"g\"),COUNTIF(BW39:CJ39,\"g\")+COUNTIF(CL39:CY39,\"g\"),COUNTIF(CA35:CA48,\"g\")+COUNTIF(CP35:CP48,\"g\"))","v":4},{"$f":"CHOOSE(StandBer,SUM(BW9:CJ9)+SUM(CA20:CA33)+SUM(CL9:CY9)+SUM(CP20:CP33),SUM(BW9:CJ9)+SUM(CA20:CA33),SUM(CL9:CY9)+SUM(CP20:CP33),SUM(BW9:CJ9)+SUM(CL9:CY9),SUM(CA20:CA33)+SUM(CP20:CP33))-5*BR9","v":87},{"$f":"CHOOSE(StandBer,SUM(CA5:CA18)+SUM(BW24:CJ24)+SUM(CP5:CP18)+SUM(CL24:CY24),SUM(CA5:CA18)+SUM(BW24:CJ24),SUM(CP5:CP18)+SUM(CL24:CY24),SUM(CA5:CA18)+SUM(CP5:CP18),SUM(BW24:CJ24)+SUM(CL24:CY24))","v":102},-15,{"$f":"CHOOSE(StandBer,COUNTIF(BW39:CJ39,\"ff\")+COUNTIF(CA35:CA48,\"ff\")+COUNTIF(CL39:CY39,\"ff\")+COUNTIF(CP35:CP48,\"ff\"),COUNTIF(BW39:CJ39,\"ff\")+COUNTIF(CA35:CA48,\"ff\"),COUNTIF(CL39:CY39,\"ff\")+COUNTIF(CP35:CP48,\"ff\"),COUNTIF(BW39:CJ39,\"ff\")+COUNTIF(CL39:CY39,\"ff\"),COUNTIF(CA35:CA48,\"ff\")+COUNTIF(CP35:CP48,\"ff\"))","v":0},5,{"$f":"SMALL( $BH$5:$BH$18, BS9 )","v":4.9905060702999995},null,5,{"$f":"IF(OR(ISERROR(FIND(\"-\",Q9)),AE9>'export html'!$AR$7),\"\",SUBSTITUTE(_xlfn.TEXTBEFORE(Q9,\"-\"),\"*\",\"\")-0)","v":2},{"$f":"IF(OR(ISERROR(FIND(\"-\",R9)),AF9>'export html'!$AR$7),\"\",SUBSTITUTE(_xlfn.TEXTBEFORE(R9,\"-\"),\"*\",\"\")-0)","v":4},{"$f":"IF(OR(ISERROR(FIND(\"-\",S9)),AG9>'export html'!$AR$7),\"\",SUBSTITUTE(_xlfn.TEXTBEFORE(S9,\"-\"),\"*\",\"\")-0)","v":4},{"$f":"IF(OR(ISERROR(FIND(\"-\",T9)),AH9>'export html'!$AR$7),\"\",SUBSTITUTE(_xlfn.TEXTBEFORE(T9,\"-\"),\"*\",\"\")-0)","v":""},null,{"$f":"IF(OR(ISERROR(FIND(\"-\",V9)),AJ9>'export html'!$AR$7),\"\",SUBSTITUTE(_xlfn.TEXTBEFORE(V9,\"-\"),\"*\",\"\")-0)","v":""},{"$f":"IF(OR(ISERROR(FIND(\"-\",W9)),AK9>'export html'!$AR$7),\"\",SUBSTITUTE(_xlfn.TEXTBEFORE(W9,\"-\"),\"*\",\"\")-0)","v":""},{"$f":"IF(OR(ISERROR(FIND(\"-\",X9)),AL9>'export html'!$AR$7),\"\",SUBSTITUTE(_xlfn.TEXTBEFORE(X9,\"-\"),\"*\",\"\")-0)","v":4},{"$f":"IF(OR(ISERROR(FIND(\"-\",Y9)),AM9>'export html'!$AR$7),\"\",SUBSTITUTE(_xlfn.TEXTBEFORE(Y9,\"-\"),\"*\",\"\")-0)","v":""},{"$f":"IF(OR(ISERROR(FIND(\"-\",Z9)),AN9>'export html'!$AR$7),\"\",SUBSTITUTE(_xlfn.TEXTBEFORE(Z9,\"-\"),\"*\",\"\")-0)","v":""},{"$f":"IF(OR(ISERROR(FIND(\"-\",AA9)),AO9>'export html'!$AR$7),\"\",SUBSTITUTE(_xlfn.TEXTBEFORE(AA9,\"-\"),\"*\",\"\")-0)","v":""},{"$f":"IF(OR(ISERROR(FIND(\"-\",AB9)),AP9>'export html'!$AR$7),\"\",SUBSTITUTE(_xlfn.TEXTBEFORE(AB9,\"-\"),\"*\",\"\")-0)","v":2},{"$f":"IF(OR(ISERROR(FIND(\"-\",AC9)),AQ9>'export html'!$AR$7),\"\",SUBSTITUTE(_xlfn.TEXTBEFORE(AC9,\"-\"),\"*\",\"\")-0)","v":""},{"$f":"IF(OR(ISERROR(FIND(\"-\",AD9)),AR9>'export html'!$AR$7),\"\",SUBSTITUTE(_xlfn.TEXTBEFORE(AD9,\"-\"),\"*\",\"\")-0)","v":2},5,{"$f":"IF(OR(ISERROR(FIND(\"-\",Q9)),AE9<='export html'!$AR$7),\"\",SUBSTITUTE(_xlfn.TEXTBEFORE(Q9,\"-\"),\"*\",\"\")-0)","v":""},{"$f":"IF(OR(ISERROR(FIND(\"-\",R9)),AF9<='export html'!$AR$7),\"\",SUBSTITUTE(_xlfn.TEXTBEFORE(R9,\"-\"),\"*\",\"\")-0)","v":""},{"$f":"IF(OR(ISERROR(FIND(\"-\",S9)),AG9<='export html'!$AR$7),\"\",SUBSTITUTE(_xlfn.TEXTBEFORE(S9,\"-\"),\"*\",\"\")-0)","v":""},{"$f":"IF(OR(ISERROR(FIND(\"-\",T9)),AH9<='export html'!$AR$7),\"\",SUBSTITUTE(_xlfn.TEXTBEFORE(T9,\"-\"),\"*\",\"\")-0)","v":8},null,{"$f":"IF(OR(ISERROR(FIND(\"-\",V9)),AJ9<='export html'!$AR$7),\"\",SUBSTITUTE(_xlfn.TEXTBEFORE(V9,\"-\"),\"*\",\"\")-0)","v":0},{"$f":"IF(OR(ISERROR(FIND(\"-\",W9)),AK9<='export html'!$AR$7),\"\",SUBSTITUTE(_xlfn.TEXTBEFORE(W9,\"-\"),\"*\",\"\")-0)","v":""},{"$f":"IF(OR(ISERROR(FIND(\"-\",X9)),AL9<='export html'!$AR$7),\"\",SUBSTITUTE(_xlfn.TEXTBEFORE(X9,\"-\"),\"*\",\"\")-0)","v":""},{"$f":"IF(OR(ISERROR(FIND(\"-\",Y9)),AM9<='export html'!$AR$7),\"\",SUBSTITUTE(_xlfn.TEXTBEFORE(Y9,\"-\"),\"*\",\"\")-0)","v":8},{"$f":"IF(OR(ISERROR(FIND(\"-\",Z9)),AN9<='export html'!$AR$7),\"\",SUBSTITUTE(_xlfn.TEXTBEFORE(Z9,\"-\"),\"*\",\"\")-0)","v":9},{"$f":"IF(OR(ISERROR(FIND(\"-\",AA9)),AO9<='export html'!$AR$7),\"\",SUBSTITUTE(_xlfn.TEXTBEFORE(AA9,\"-\"),\"*\",\"\")-0)","v":2},{"$f":"IF(OR(ISERROR(FIND(\"-\",AB9)),AP9<='export html'!$AR$7),\"\",SUBSTITUTE(_xlfn.TEXTBEFORE(AB9,\"-\"),\"*\",\"\")-0)","v":""},{"$f":"IF(OR(ISERROR(FIND(\"-\",AC9)),AQ9<='export html'!$AR$7),\"\",SUBSTITUTE(_xlfn.TEXTBEFORE(AC9,\"-\"),\"*\",\"\")-0)","v":3},{"$f":"IF(OR(ISERROR(FIND(\"-\",AD9)),AR9<='export html'!$AR$7),\"\",SUBSTITUTE(_xlfn.TEXTBEFORE(AD9,\"-\"),\"*\",\"\")-0)","v":""},5]
[null,null,6,{"$f":"VLOOKUP(BT10,HulpberekeningenStand,2,FALSE)","v":"Racing Emblem"},{"$f":"3*H10+J10","v":39},{"$f":"SUM(H10:J10)","v":24},{"$f":"REPT(IF(F10-MODE($F$5:$F$18)<0,\"-\",\"+\"),ABS(F10-MODE($F$5:$F$18)))","v":"-"},{"$f":"VLOOKUP(BT10,HulpberekeningenStand,5,FALSE)","v":12},{"$f":"VLOOKUP(BT10,HulpberekeningenStand,6,FALSE)","v":9},{"$f":"VLOOKUP(BT10,HulpberekeningenStand,7,FALSE)","v":3},{"$f":"VLOOKUP(BT10,HulpberekeningenStand,8,FALSE)","v":65},{"$f":"VLOOKUP(BT10,HulpberekeningenStand,9,FALSE)","v":61},{"$f":"K10-L10","v":4},{"$f":"3*F10-E10","v":33},null,"Daltons",null,"2-0","7-1","2-0","*5-0",null,"*5-0","8-1","7-0","3-0","6-2","6-1","4-1","6-0",26,22,24,8,4,null,12,15,16,6,10,18,1,20,"2025-04-06","2025-03-09","2025-03-23","2024-10-20","2024-09-22",null,"2024-11-24","2025-03-02","2025-01-19","2024-10-06","2024-11-10","2024-12-04","2024-09-01","2025-02-16",null,{"$f":"RANK( BJ10, $BJ$5:$BJ$18, 0 ) - RANK( BK10, $BK$5:$BK$18, 0 ) / 10^2 + RANK( BL10, $BL$5:$BL$18, 0 ) / 10^4 + RANK( BQ10, $BQ$5:$BQ$18, 0 ) / 10^6 + RANK( BO10, $BO$5:$BO$18, 0 ) / 10^8 + BS10 / 10^10","v":0.99010101060000011},{"$f":"P10","v":"Daltons"},{"$f":"3 * BL10 + BN10","v":69},{"$f":"SUM( BL10:BN10 )","v":25},{"$f":"CHOOSE(StandBer,COUNTIF(BW40:CJ40,\"t\")+COUNTIF(CB35:CB48,\"u\")+COUNTIF(CL40:CY40,\"t\")+COUNTIF(CQ35:CQ48,\"u\"),COUNTIF(BW40:CJ40,\"t\")+COUNTIF(CB35:CB48,\"u\"),COUNTIF(CL40:CY40,\"t\")+COUNTIF(CQ35:CQ48,\"u\"),COUNTIF(BW40:CJ40,\"t\")+COUNTIF(CL40:CY40,\"t\"),COUNTIF(CB35:CB48,\"u\")+COUNTIF(CQ35:CQ48,\"u\"))","v":22},{"$f":"CHOOSE(StandBer,COUNTIF(BW40:CJ40,\"u\")+COUNTIF(CB35:CB48,\"t\")+COUNTIF(CL40:CY40,\"u\")+COUNTIF(CQ35:CQ48,\"t\"),COUNTIF(BW40:CJ40,\"u\")+COUNTIF(CB35:CB48,\"t\"),COUNTIF(CL40:CY40,\"u\")+COUNTIF(CQ35:CQ48,\"t\"),COUNTIF(BW40:CJ40,\"u\")+COUNTIF(CL40:CY40,\"u\"),COUNTIF(CB35:CB48,\"t\")+COUNTIF(CQ35:CQ48,\"t\"))+BR10","v":0},{"$f":"CHOOSE(StandBer,COUNTIF(BW40:CJ40,\"g\")+COUNTIF(CB35:CB48,\"g\")+COUNTIF(CL40:CY40,\"g\")+COUNTIF(CQ35:CQ48,\"g\"),COUNTIF(BW40:CJ40,\"g\")+COUNTIF(CB35:CB48,\"g\"),COUNTIF(CL40:CY40,\"g\")+COUNTIF(CQ35:CQ48,\"g\"),COUNTIF(BW40:CJ40,\"g\")+COUNTIF(CL40:CY40,\"g\"),COUNTIF(CB35:CB48,\"g\")+COUNTIF(CQ35:CQ48,\"g\"))","v":3},{"$f":"CHOOSE(StandBer,SUM(BW10:CJ10)+SUM(CB20:CB33)+SUM(CL10:CY10)+SUM(CQ20:CQ33),SUM(BW10:CJ10)+SUM(CB20:CB33),SUM(CL10:CY10)+SUM(CQ20:CQ33),SUM(BW10:CJ10)+SUM(CL10:CY10),SUM(CB20:CB33)+SUM(CQ20:CQ33))-5*BR10","v":113},{"$f":"CHOOSE(StandBer,SUM(CB5:CB18)+SUM(BW25:CJ25)+SUM(CQ5:CQ18)+SUM(CL25:CY25),SUM(CB5:CB18)+SUM(BW25:CJ25),SUM(CQ5:CQ18)+SUM(CL25:CY25),SUM(CB5:CB18)+SUM(CQ5:CQ18),SUM(BW25:CJ25)+SUM(CL25:CY25))","v":15},{"$f":"BO10 - BP10","v":98},{"$f":"CHOOSE(StandBer,COUNTIF(BW40:CJ40,\"ff\")+COUNTIF(CB35:CB48,\"ff\")+COUNTIF(CL40:CY40,\"ff\")+COUNTIF(CQ35:CQ48,\"ff\"),COUNTIF(BW40:CJ40,\"ff\")+COUNTIF(CB35:CB48,\"ff\"),COUNTIF(CL40:CY40,\"ff\")+COUNTIF(CQ35:CQ48,\"ff\"),COUNTIF(BW40:CJ40,\"ff\")+COUNTIF(CL40:CY40,\"ff\"),COUNTIF(CB35:CB48,\"ff\")+COUNTIF(CQ35:CQ48,\"ff\"))","v":0},6,{"$f":"SMALL( $BH$5:$BH$18, BS10 )","v":5.8905080911000001},null,6,{"$f":"IF(OR(ISERROR(FIND(\"-\",Q10)),AE10>'export html'!$AR$7),\"\",SUBSTITUTE(_xlfn.TEXTBEFORE(Q10,\"-\"),\"*\",\"\")-0)","v":""},{"$f":"IF(OR(ISERROR(FIND(\"-\",R10)),AF10>'export html'!$AR$7),\"\",SUBSTITUTE(_xlfn.TEXTBEFORE(R10,\"-\"),\"*\",\"\")-0)","v":""},{"$f":"IF(OR(ISERROR(FIND(\"-\",S10)),AG10>'export html'!$AR$7),\"\",SUBSTITUTE(_xlfn.TEXTBEFORE(S10,\"-\"),\"*\",\"\")-0)","v":""},{"$f":"IF(OR(ISERROR(FIND(\"-\",T10)),AH10>'export html'!$AR$7),\"\",SUBSTITUTE(_xlfn.TEXTBEFORE(T10,\"-\"),\"*\",\"\")-0)","v":2},{"$f":"IF(OR(ISERROR(FIND(\"-\",U10)),AI10>'export html'!$AR$7),\"\",SUBSTITUTE(_xlfn.TEXTBEFORE(U10,\"-\"),\"*\",\"\")-0)","v":5},null,{"$f":"IF(OR(ISERROR(FIND(\"-\",W10)),AK10>'export html'!$AR$7),\"\",SUBSTITUTE(_xlfn.TEXTBEFORE(W10,\"-\"),\"*\",\"\")-0)","v":5},{"$f":"IF(OR(ISERROR(FIND(\"-\",X10)),AL10>'export html'!$AR$7),\"\",SUBSTITUTE(_xlfn.TEXTBEFORE(X10,\"-\"),\"*\",\"\")-0)","v":""},{"$f":"IF(OR(ISERROR(FIND(\"-\",Y10)),AM10>'export html'!$AR$7),\"\",SUBSTITUTE(_xlfn.TEXTBEFORE(Y10,\"-\"),\"*\",\"\")-0)","v":""},{"$f":"IF(OR(ISERROR(FIND(\"-\",Z10)),AN10>'export html'!$AR$7),\"\",SUBSTITUTE(_xlfn.TEXTBEFORE(Z10,\"-\"),\"*\",\"\")-0)","v":3},{"$f":"IF(OR(ISERROR(FIND(\"-\",AA10)),AO10>'export html'!$AR$7),\"\",SUBSTITUTE(_xlfn.TEXTBEFORE(AA10,\"-\"),\"*\",\"\")-0)","v":6},{"$f":"IF(OR(ISERROR(FIND(\"-\",AB10)),AP10>'export html'!$AR$7),\"\",SUBSTITUTE(_xlfn.TEXTBEFORE(AB10,\"-\"),\"*\",\"\")-0)","v":""},{"$f":"IF(OR(ISERROR(FIND(\"-\",AC10)),AQ10>'export html'!$AR$7),\"\",SUBSTITUTE(_xlfn.TEXTBEFORE(AC10,\"-\"),\"*\",\"\")-0)","v":4},{"$f":"IF(OR(ISERROR(FIND(\"-\",AD10)),AR10>'export html'!$AR$7),\"\",SUBSTITUTE(_xlfn.TEXTBEFORE(AD10,\"-\"),\"*\",\"\")-0)","v":""},6,{"$f":"IF(OR(ISERROR(FIND(\"-\",Q10)),AE10<='export html'!$AR$7),\"\",SUBSTITUTE(_xlfn.TEXTBEFORE(Q10,\"-\"),\"*\",\"\")-0)","v":""},{"$f":"IF(OR(ISERROR(FIND(\"-\",R10)),AF10<='export html'!$AR$7),\"\",SUBSTITUTE(_xlfn.TEXTBEFORE(R10,\"-\"),\"*\",\"\")-0)","v":2},{"$f":"IF(OR(ISERROR(FIND(\"-\",S10)),AG10<='export html'!$AR$7),\"\",SUBSTITUTE(_xlfn.TEXTBEFORE(S10,\"-\"),\"*\",\"\")-0)","v":7},{"$f":"IF(OR(ISERROR(FIND(\"-\",T10)),AH10<='export html'!$AR$7),\"\",SUBSTITUTE(_xlfn.TEXTBEFORE(T10,\"-\"),\"*\",\"\")-0)","v":""},{"$f":"IF(OR(ISERROR(FIND(\"-\",U10)),AI10<='export html'!$AR$7),\"\",SUBSTITUTE(_xlfn.TEXTBEFORE(U10,\"-\"),\"*\",\"\")-0)","v":""},null,{"$f":"IF(OR(ISERROR(FIND(\"-\",W10)),AK10<='export html'!$AR$7),\"\",SUBSTITUTE(_xlfn.TEXTBEFORE(W10,\"-\"),\"*\",\"\")-0)","v":""},{"$f":"IF(OR(ISERROR(FIND(\"-\",X10)),AL10<='export html'!$AR$7),\"\",SUBSTITUTE(_xlfn.TEXTBEFORE(X10,\"-\"),\"*\",\"\")-0)","v":8},{"$f":"IF(OR(ISERROR(FIND(\"-\",Y10)),AM10<='export html'!$AR$7),\"\",SUBSTITUTE(_xlfn.TEXTBEFORE(Y10,\"-\"),\"*\",\"\")-0)","v":7},{"$f":"IF(OR(ISERROR(FIND(\"-\",Z10)),AN10<='export html'!$AR$7),\"\",SUBSTITUTE(_xlfn.TEXTBEFORE(Z10,\"-\"),\"*\",\"\")-0)","v":""},{"$f":"IF(OR(ISERROR(FIND(\"-\",AA10)),AO10<='export html'!$AR$7),\"\",SUBSTITUTE(_xlfn.TEXTBEFORE(AA10,\"-\"),\"*\",\"\")-0)","v":""},{"$f":"IF(OR(ISERROR(FIND(\"-\",AB10)),AP10<='export html'!$AR$7),\"\",SUBSTITUTE(_xlfn.TEXTBEFORE(AB10,\"-\"),\"*\",\"\")-0)","v":6},{"$f":"IF(OR(ISERROR(FIND(\"-\",AC10)),AQ10<='export html'!$AR$7),\"\",SUBSTITUTE(_xlfn.TEXTBEFORE(AC10,\"-\"),\"*\",\"\")-0)","v":""},{"$f":"IF(OR(ISERROR(FIND(\"-\",AD10)),AR10<='export html'!$AR$7),\"\",SUBSTITUTE(_xlfn.TEXTBEFORE(AD10,\"-\"),\"*\",\"\")-0)","v":6},6]
[null,null,7,"Sint Anneke",37,25,"",11,10,4,91,79,12,38,null,"Goka","5-2","0-5*","1-2","3-1","5-5","0-2",null,"4-4","*5-0","3-0","2-5","3-3","1-4","0-1",9,18,20,4,13,25,null,11,8,2,6,14,23,16,"2024-11-03","2025-02-02","2025-02-16","2024-09-22","2024-12-01","2025-03-30",null,"2024-11-17","2024-10-20","2024-09-08","2024-10-06","2024-12-08","2025-03-16","2025-01-19",null,12.9913121207,"Goka",19,25,{"$f":"CHOOSE(StandBer,COUNTIF(BW41:CJ41,\"t\")+COUNTIF(CC35:CC48,\"u\")+COUNTIF(CL41:CY41,\"t\")+COUNTIF(CR35:CR48,\"u\"),COUNTIF(BW41:CJ41,\"t\")+COUNTIF(CC35:CC48,\"u\"),COUNTIF(CL41:CY41,\"t\")+COUNTIF(CR35:CR48,\"u\"),COUNTIF(BW41:CJ41,\"t\")+COUNTIF(CL41:CY41,\"t\"),COUNTIF(CC35:CC48,\"u\")+COUNTIF(CR35:CR48,\"u\"))","v":5},{"$f":"CHOOSE(StandBer,COUNTIF(BW41:CJ41,\"u\")+COUNTIF(CC35:CC48,\"t\")+COUNTIF(CL41:CY41,\"u\")+COUNTIF(CR35:CR48,\"t\"),COUNTIF(BW41:CJ41,\"u\")+COUNTIF(CC35:CC48,\"t\"),COUNTIF(CL41:CY41,\"u\")+COUNTIF(CR35:CR48,\"t\"),COUNTIF(BW41:CJ41,\"u\")+COUNTIF(CL41:CY41,\"u\"),COUNTIF(CC35:CC48,\"t\")+COUNTIF(CR35:CR48,\"t\"))+BR11","v":16},{"$f":"CHOOSE(StandBer,COUNTIF(BW41:CJ41,\"g\")+COUNTIF(CC35:CC48,\"g\")+COUNTIF(CL41:CY41,\"g\")+COUNTIF(CR35:CR48,\"g\"),COUNTIF(BW41:CJ41,\"g\")+COUNTIF(CC35:CC48,\"g\"),COUNTIF(CL41:CY41,\"g\")+COUNTIF(CR35:CR48,\"g\"),COUNTIF(BW41:CJ41,\"g\")+COUNTIF(CL41:CY41,\"g\"),COUNTIF(CC35:CC48,\"g\")+COUNTIF(CR35:CR48,\"g\"))","v":4},{"$f":"CHOOSE(StandBer,SUM(BW11:CJ11)+SUM(CC20:CC33)+SUM(CL11:CY11)+SUM(CR20:CR33),SUM(BW11:CJ11)+SUM(CC20:CC33),SUM(CL11:CY11)+SUM(CR20:CR33),SUM(BW11:CJ11)+SUM(CL11:CY11),SUM(CC20:CC33)+SUM(CR20:CR33))-5*BR11","v":47},{"$f":"CHOOSE(StandBer,SUM(CC5:CC18)+SUM(BW26:CJ26)+SUM(CR5:CR18)+SUM(CL26:CY26),SUM(CC5:CC18)+SUM(BW26:CJ26),SUM(CR5:CR18)+SUM(CL26:CY26),SUM(CC5:CC18)+SUM(CR5:CR18),SUM(BW26:CJ26)+SUM(CL26:CY26))","v":81},-34,{"$f":"CHOOSE(StandBer,COUNTIF(BW41:CJ41,\"ff\")+COUNTIF(CC35:CC48,\"ff\")+COUNTIF(CL41:CY41,\"ff\")+COUNTIF(CR35:CR48,\"ff\"),COUNTIF(BW41:CJ41,\"ff\")+COUNTIF(CC35:CC48,\"ff\"),COUNTIF(CL41:CY41,\"ff\")+COUNTIF(CR35:CR48,\"ff\"),COUNTIF(BW41:CJ41,\"ff\")+COUNTIF(CL41:CY41,\"ff\"),COUNTIF(CC35:CC48,\"ff\")+COUNTIF(CR35:CR48,\"ff\"))","v":0},7,6.9907050312000001,null,7,{"$f":"IF(OR(ISERROR(FIND(\"-\",Q11)),AE11>'export html'!$AR$7),\"\",SUBSTITUTE(_xlfn.TEXTBEFORE(Q11,\"-\"),\"*\",\"\")-0)","v":5},{"$f":"IF(OR(ISERROR(FIND(\"-\",R11)),AF11>'export html'!$AR$7),\"\",SUBSTITUTE(_xlfn.TEXTBEFORE(R11,\"-\"),\"*\",\"\")-0)","v":""},{"$f":"IF(OR(ISERROR(FIND(\"-\",S11)),AG11>'export html'!$AR$7),\"\",SUBSTITUTE(_xlfn.TEXTBEFORE(S11,\"-\"),\"*\",\"\")-0)","v":""},{"$f":"IF(OR(ISERROR(FIND(\"-\",T11)),AH11>'export html'!$AR$7),\"\",SUBSTITUTE(_xlfn.TEXTBEFORE(T11,\"-\"),\"*\",\"\")-0)","v":3},{"$f":"IF(OR(ISERROR(FIND(\"-\",U11)),AI11>'export html'!$AR$7),\"\",SUBSTITUTE(_xlfn.TEXTBEFORE(U11,\"-\"),\"*\",\"\")-0)","v":5},{"$f":"IF(OR(ISERROR(FIND(\"-\",V11)),AJ11>'export html'!$AR$7),\"\",SUBSTITUTE(_xlfn.TEXTBEFORE(V11,\"-\"),\"*\",\"\")-0)","v":""},null,{"$f":"IF(OR(ISERROR(FIND(\"-\",X11)),AL11>'export html'!$AR$7),\"\",SUBSTITUTE(_xlfn.TEXTBEFORE(X11,\"-\"),\"*\",\"\")-0)","v":4},{"$f":"IF(OR(ISERROR(FIND(\"-\",Y11)),AM11>'export html'!$AR$7),\"\",SUBSTITUTE(_xlfn.TEXTBEFORE(Y11,\"-\"),\"*\",\"\")-0)","v":5},{"$f":"IF(OR(ISERROR(FIND(\"-\",Z11)),AN11>'export html'!$AR$7),\"\",SUBSTITUTE(_xlfn.TEXTBEFORE(Z11,\"-\"),\"*\",\"\")-0)","v":3},{"$f":"IF(OR(ISERROR(FIND(\"-\",AA11)),AO11>'export html'!$AR$7),\"\",SUBSTITUTE(_xlfn.TEXTBEFORE(AA11,\"-\"),\"*\",\"\")-0)","v":2},{"$f":"IF(OR(ISERROR(FIND(\"-\",AB11)),AP11>'export html'!$AR$7),\"\",SUBSTITUTE(_xlfn.TEXTBEFORE(AB11,\"-\"),\"*\",\"\")-0)","v":""},{"$f":"IF(OR(ISERROR(FIND(\"-\",AC11)),AQ11>'export html'!$AR$7),\"\",SUBSTITUTE(_xlfn.TEXTBEFORE(AC11,\"-\"),\"*\",\"\")-0)","v":""},{"$f":"IF(OR(ISERROR(FIND(\"-\",AD11)),AR11>'export html'!$AR$7),\"\",SUBSTITUTE(_xlfn.TEXTBEFORE(AD11,\"-\"),\"*\",\"\")-0)","v":""},7,{"$f":"IF(OR(ISERROR(FIND(\"-\",Q11)),AE11<='export html'!$AR$7),\"\",SUBSTITUTE(_xlfn.TEXTBEFORE(Q11,\"-\"),\"*\",\"\")-0)","v":""},{"$f":"IF(OR(ISERROR(FIND(\"-\",R11)),AF11<='export html'!$AR$7),\"\",SUBSTITUTE(_xlfn.TEXTBEFORE(R11,\"-\"),\"*\",\"\")-0)","v":0},{"$f":"IF(OR(ISERROR(FIND(\"-\",S11)),AG11<='export html'!$AR$7),\"\",SUBSTITUTE(_xlfn.TEXTBEFORE(S11,\"-\"),\"*\",\"\")-0)","v":1},{"$f":"IF(OR(ISERROR(FIND(\"-\",T11)),AH11<='export html'!$AR$7),\"\",SUBSTITUTE(_xlfn.TEXTBEFORE(T11,\"-\"),\"*\",\"\")-0)","v":""},{"$f":"IF(OR(ISERROR(FIND(\"-\",U11)),AI11<='export html'!$AR$7),\"\",SUBSTITUTE(_xlfn.TEXTBEFORE(U11,\"-\"),\"*\",\"\")-0)","v":""},{"$f":"IF(OR(ISERROR(FIND(\"-\",V11)),AJ11<='export html'!$AR$7),\"\",SUBSTITUTE(_xlfn.TEXTBEFORE(V11,\"-\"),\"*\",\"\")-0)","v":0},null,{"$f":"IF(OR(ISERROR(FIND(\"-\",X11)),AL11<='export html'!$AR$7),\"\",SUBSTITUTE(_xlfn.TEXTBEFORE(X11,\"-\"),\"*\",\"\")-0)","v":""},{"$f":"IF(OR(ISERROR(FIND(\"-\",Y11)),AM11<='export html'!$AR$7),\"\",SUBSTITUTE(_xlfn.TEXTBEFORE(Y11,\"-\"),\"*\",\"\")-0)","v":""},{"$f":"IF(OR(ISERROR(FIND(\"-\",Z11)),AN11<='export html'!$AR$7),\"\",SUBSTITUTE(_xlfn.TEXTBEFORE(Z11,\"-\"),\"*\",\"\")-0)","v":""},{"$f":"IF(OR(ISERROR(FIND(\"-\",AA11)),AO11<='export html'!$AR$7),\"\",SUBSTITUTE(_xlfn.TEXTBEFORE(AA11,\"-\"),\"*\",\"\")-0)","v":""},{"$f":"IF(OR(ISERROR(FIND(\"-\",AB11)),AP11<='export html'!$AR$7),\"\",SUBSTITUTE(_xlfn.TEXTBEFORE(AB11,\"-\"),\"*\",\"\")-0)","v":3},{"$f":"IF(OR(ISERROR(FIND(\"-\",AC11)),AQ11<='export html'!$AR$7),\"\",SUBSTITUTE(_xlfn.TEXTBEFORE(AC11,\"-\"),\"*\",\"\")-0)","v":1},{"$f":"IF(OR(ISERROR(FIND(\"-\",AD11)),AR11<='export html'!$AR$7),\"\",SUBSTITUTE(_xlfn.TEXTBEFORE(AD11,\"-\"),\"*\",\"\")-0)","v":0},7]
[null,null,8,"SC Duffel",33,25,{"$f":"REPT(IF(F12-MODE($F$5:$F$18)<0,\"-\",\"+\"),ABS(F12-MODE($F$5:$F$18)))","v":""},9,10,6,70,65,5,42,null,"Hombeek","0-4","4-3","0-4","*5-0","5-6","2-3","3-2",null,"4-0",null,"0-1","2-6",null,"1-1",12,8,10,20,16,2,24,null,14,18,22,4,26,6,"2024-11-24","2024-10-20","2024-11-10","2025-02-16","2025-01-19","2024-09-08","2025-03-23",null,"2024-12-08","2025-04-13","2025-03-09","2024-09-22","2025-04-06","2024-10-06",null,{"$f":"RANK( BJ12, $BJ$5:$BJ$18, 0 ) - RANK( BK12, $BK$5:$BK$18, 0 ) / 10^2 + RANK( BL12, $BL$5:$BL$18, 0 ) / 10^4 + RANK( BQ12, $BQ$5:$BQ$18, 0 ) / 10^6 + RANK( BO12, $BO$5:$BO$18, 0 ) / 10^8 + BS12 / 10^10","v":8.8908091008000003},"Hombeek",30,24,{"$f":"CHOOSE(StandBer,COUNTIF(BW42:CJ42,\"t\")+COUNTIF(CD35:CD48,\"u\")+COUNTIF(CL42:CY42,\"t\")+COUNTIF(CS35:CS48,\"u\"),COUNTIF(BW42:CJ42,\"t\")+COUNTIF(CD35:CD48,\"u\"),COUNTIF(CL42:CY42,\"t\")+COUNTIF(CS35:CS48,\"u\"),COUNTIF(BW42:CJ42,\"t\")+COUNTIF(CL42:CY42,\"t\"),COUNTIF(CD35:CD48,\"u\")+COUNTIF(CS35:CS48,\"u\"))","v":9},{"$f":"CHOOSE(StandBer,COUNTIF(BW42:CJ42,\"u\")+COUNTIF(CD35:CD48,\"t\")+COUNTIF(CL42:CY42,\"u\")+COUNTIF(CS35:CS48,\"t\"),COUNTIF(BW42:CJ42,\"u\")+COUNTIF(CD35:CD48,\"t\"),COUNTIF(CL42:CY42,\"u\")+COUNTIF(CS35:CS48,\"t\"),COUNTIF(BW42:CJ42,\"u\")+COUNTIF(CL42:CY42,\"u\"),COUNTIF(CD35:CD48,\"t\")+COUNTIF(CS35:CS48,\"t\"))+BR12","v":12},{"$f":"CHOOSE(StandBer,COUNTIF(BW42:CJ42,\"g\")+COUNTIF(CD35:CD48,\"g\")+COUNTIF(CL42:CY42,\"g\")+COUNTIF(CS35:CS48,\"g\"),COUNTIF(BW42:CJ42,\"g\")+COUNTIF(CD35:CD48,\"g\"),COUNTIF(CL42:CY42,\"g\")+COUNTIF(CS35:CS48,\"g\"),COUNTIF(BW42:CJ42,\"g\")+COUNTIF(CL42:CY42,\"g\"),COUNTIF(CD35:CD48,\"g\")+COUNTIF(CS35:CS48,\"g\"))","v":3},{"$f":"CHOOSE(StandBer,SUM(BW12:CJ12)+SUM(CD20:CD33)+SUM(CL12:CY12)+SUM(CS20:CS33),SUM(BW12:CJ12)+SUM(CD20:CD33),SUM(CL12:CY12)+SUM(CS20:CS33),SUM(BW12:CJ12)+SUM(CL12:CY12),SUM(CD20:CD33)+SUM(CS20:CS33))-5*BR12","v":60},{"$f":"CHOOSE(StandBer,SUM(CD5:CD18)+SUM(BW27:CJ27)+SUM(CS5:CS18)+SUM(CL27:CY27),SUM(CD5:CD18)+SUM(BW27:CJ27),SUM(CS5:CS18)+SUM(CL27:CY27),SUM(CD5:CD18)+SUM(CS5:CS18),SUM(BW27:CJ27)+SUM(CL27:CY27))","v":72},-12,{"$f":"CHOOSE(StandBer,COUNTIF(BW42:CJ42,\"ff\")+COUNTIF(CD35:CD48,\"ff\")+COUNTIF(CL42:CY42,\"ff\")+COUNTIF(CS35:CS48,\"ff\"),COUNTIF(BW42:CJ42,\"ff\")+COUNTIF(CD35:CD48,\"ff\"),COUNTIF(CL42:CY42,\"ff\")+COUNTIF(CS35:CS48,\"ff\"),COUNTIF(BW42:CJ42,\"ff\")+COUNTIF(CL42:CY42,\"ff\"),COUNTIF(CD35:CD48,\"ff\")+COUNTIF(CS35:CS48,\"ff\"))","v":0},8,{"$f":"SMALL( $BH$5:$BH$18, BS12 )","v":7.9908070813000007},null,8,{"$f":"IF(OR(ISERROR(FIND(\"-\",Q12)),AE12>'export html'!$AR$7),\"\",SUBSTITUTE(_xlfn.TEXTBEFORE(Q12,\"-\"),\"*\",\"\")-0)","v":0},{"$f":"IF(OR(ISERROR(FIND(\"-\",R12)),AF12>'export html'!$AR$7),\"\",SUBSTITUTE(_xlfn.TEXTBEFORE(R12,\"-\"),\"*\",\"\")-0)","v":4},{"$f":"IF(OR(ISERROR(FIND(\"-\",S12)),AG12>'export html'!$AR$7),\"\",SUBSTITUTE(_xlfn.TEXTBEFORE(S12,\"-\"),\"*\",\"\")-0)","v":0},{"$f":"IF(OR(ISERROR(FIND(\"-\",T12)),AH12>'export html'!$AR$7),\"\",SUBSTITUTE(_xlfn.TEXTBEFORE(T12,\"-\"),\"*\",\"\")-0)","v":""},{"$f":"IF(OR(ISERROR(FIND(\"-\",U12)),AI12>'export html'!$AR$7),\"\",SUBSTITUTE(_xlfn.TEXTBEFORE(U12,\"-\"),\"*\",\"\")-0)","v":""},{"$f":"IF(OR(ISERROR(FIND(\"-\",V12)),AJ12>'export html'!$AR$7),\"\",SUBSTITUTE(_xlfn.TEXTBEFORE(V12,\"-\"),\"*\",\"\")-0)","v":2},{"$f":"IF(OR(ISERROR(FIND(\"-\",W12)),AK12>'export html'!$AR$7),\"\",SUBSTITUTE(_xlfn.TEXTBEFORE(W12,\"-\"),\"*\",\"\")-0)","v":""},null,{"$f":"IF(OR(ISERROR(FIND(\"-\",Y12)),AM12>'export html'!$AR$7),\"\",SUBSTITUTE(_xlfn.TEXTBEFORE(Y12,\"-\"),\"*\",\"\")-0)","v":""},{"$f":"IF(OR(ISERROR(FIND(\"-\",Z12)),AN12>'export html'!$AR$7),\"\",SUBSTITUTE(_xlfn.TEXTBEFORE(Z12,\"-\"),\"*\",\"\")-0)","v":""},{"$f":"IF(OR(ISERROR(FIND(\"-\",AA12)),AO12>'export html'!$AR$7),\"\",SUBSTITUTE(_xlfn.TEXTBEFORE(AA12,\"-\"),\"*\",\"\")-0)","v":""},{"$f":"IF(OR(ISERROR(FIND(\"-\",AB12)),AP12>'export html'!$AR$7),\"\",SUBSTITUTE(_xlfn.TEXTBEFORE(AB12,\"-\"),\"*\",\"\")-0)","v":2},{"$f":"IF(OR(ISERROR(FIND(\"-\",AC12)),AQ12>'export html'!$AR$7),\"\",SUBSTITUTE(_xlfn.TEXTBEFORE(AC12,\"-\"),\"*\",\"\")-0)","v":""},{"$f":"IF(OR(ISERROR(FIND(\"-\",AD12)),AR12>'export html'!$AR$7),\"\",SUBSTITUTE(_xlfn.TEXTBEFORE(AD12,\"-\"),\"*\",\"\")-0)","v":1},8,{"$f":"IF(OR(ISERROR(FIND(\"-\",Q12)),AE12<='export html'!$AR$7),\"\",SUBSTITUTE(_xlfn.TEXTBEFORE(Q12,\"-\"),\"*\",\"\")-0)","v":""},{"$f":"IF(OR(ISERROR(FIND(\"-\",R12)),AF12<='export html'!$AR$7),\"\",SUBSTITUTE(_xlfn.TEXTBEFORE(R12,\"-\"),\"*\",\"\")-0)","v":""},{"$f":"IF(OR(ISERROR(FIND(\"-\",S12)),AG12<='export html'!$AR$7),\"\",SUBSTITUTE(_xlfn.TEXTBEFORE(S12,\"-\"),\"*\",\"\")-0)","v":""},{"$f":"IF(OR(ISERROR(FIND(\"-\",T12)),AH12<='export html'!$AR$7),\"\",SUBSTITUTE(_xlfn.TEXTBEFORE(T12,\"-\"),\"*\",\"\")-0)","v":5},{"$f":"IF(OR(ISERROR(FIND(\"-\",U12)),AI12<='export html'!$AR$7),\"\",SUBSTITUTE(_xlfn.TEXTBEFORE(U12,\"-\"),\"*\",\"\")-0)","v":5},{"$f":"IF(OR(ISERROR(FIND(\"-\",V12)),AJ12<='export html'!$AR$7),\"\",SUBSTITUTE(_xlfn.TEXTBEFORE(V12,\"-\"),\"*\",\"\")-0)","v":""},{"$f":"IF(OR(ISERROR(FIND(\"-\",W12)),AK12<='export html'!$AR$7),\"\",SUBSTITUTE(_xlfn.TEXTBEFORE(W12,\"-\"),\"*\",\"\")-0)","v":3},null,{"$f":"IF(OR(ISERROR(FIND(\"-\",Y12)),AM12<='export html'!$AR$7),\"\",SUBSTITUTE(_xlfn.TEXTBEFORE(Y12,\"-\"),\"*\",\"\")-0)","v":4},{"$f":"IF(OR(ISERROR(FIND(\"-\",Z12)),AN12<='export html'!$AR$7),\"\",SUBSTITUTE(_xlfn.TEXTBEFORE(Z12,\"-\"),\"*\",\"\")-0)","v":""},{"$f":"IF(OR(ISERROR(FIND(\"-\",AA12)),AO12<='export html'!$AR$7),\"\",SUBSTITUTE(_xlfn.TEXTBEFORE(AA12,\"-\"),\"*\",\"\")-0)","v":0},{"$f":"IF(OR(ISERROR(FIND(\"-\",AB12)),AP12<='export html'!$AR$7),\"\",SUBSTITUTE(_xlfn.TEXTBEFORE(AB12,\"-\"),\"*\",\"\")-0)","v":""},{"$f":"IF(OR(ISERROR(FIND(\"-\",AC12)),AQ12<='export html'!$AR$7),\"\",SUBSTITUTE(_xlfn.TEXTBEFORE(AC12,\"-\"),\"*\",\"\")-0)","v":""},{"$f":"IF(OR(ISERROR(FIND(\"-\",AD12)),AR12<='export html'!$AR$7),\"\",SUBSTITUTE(_xlfn.TEXTBEFORE(AD12,\"-\"),\"*\",\"\")-0)","v":""},8]
[null,null,9,{"$f":"VLOOKUP(BT13,HulpberekeningenStand,2,FALSE)","v":"Hombeek"},30,24,"-",{"$f":"VLOOKUP(BT13,HulpberekeningenStand,5,FALSE)","v":9},{"$f":"VLOOKUP(BT13,HulpberekeningenStand,6,FALSE)","v":12},{"$f":"VLOOKUP(BT13,HulpberekeningenStand,7,FALSE)","v":3},{"$f":"VLOOKUP(BT13,HulpberekeningenStand,8,FALSE)","v":60},{"$f":"VLOOKUP(BT13,HulpberekeningenStand,9,FALSE)","v":72},-12,42,null,"Jolika","0-5","0-5","0-2",null,"1-8","0-7","1-1","0-6",null,"1-1",null,"0-8","7-0","0-5",23,15,19,26,5,3,21,1,null,9,17,7,12,11,"2025-03-16","2025-03-02","2025-02-09","2025-04-06","2024-09-29","2024-09-15","2025-02-23","2024-09-01",null,"2024-11-03","2025-04-13","2024-10-13","2024-11-24","2024-11-17",null,13.8914141409,"Jolika",6,24,{"$f":"CHOOSE(StandBer,COUNTIF(BW43:CJ43,\"t\")+COUNTIF(CE35:CE48,\"u\")+COUNTIF(CL43:CY43,\"t\")+COUNTIF(CT35:CT48,\"u\"),COUNTIF(BW43:CJ43,\"t\")+COUNTIF(CE35:CE48,\"u\"),COUNTIF(CL43:CY43,\"t\")+COUNTIF(CT35:CT48,\"u\"),COUNTIF(BW43:CJ43,\"t\")+COUNTIF(CL43:CY43,\"t\"),COUNTIF(CE35:CE48,\"u\")+COUNTIF(CT35:CT48,\"u\"))","v":1},{"$f":"CHOOSE(StandBer,COUNTIF(BW43:CJ43,\"u\")+COUNTIF(CE35:CE48,\"t\")+COUNTIF(CL43:CY43,\"u\")+COUNTIF(CT35:CT48,\"t\"),COUNTIF(BW43:CJ43,\"u\")+COUNTIF(CE35:CE48,\"t\"),COUNTIF(CL43:CY43,\"u\")+COUNTIF(CT35:CT48,\"t\"),COUNTIF(BW43:CJ43,\"u\")+COUNTIF(CL43:CY43,\"u\"),COUNTIF(CE35:CE48,\"t\")+COUNTIF(CT35:CT48,\"t\"))+BR13","v":20},{"$f":"CHOOSE(StandBer,COUNTIF(BW43:CJ43,\"g\")+COUNTIF(CE35:CE48,\"g\")+COUNTIF(CL43:CY43,\"g\")+COUNTIF(CT35:CT48,\"g\"),COUNTIF(BW43:CJ43,\"g\")+COUNTIF(CE35:CE48,\"g\"),COUNTIF(CL43:CY43,\"g\")+COUNTIF(CT35:CT48,\"g\"),COUNTIF(BW43:CJ43,\"g\")+COUNTIF(CL43:CY43,\"g\"),COUNTIF(CE35:CE48,\"g\")+COUNTIF(CT35:CT48,\"g\"))","v":3},{"$f":"CHOOSE(StandBer,SUM(BW13:CJ13)+SUM(CE20:CE33)+SUM(CL13:CY13)+SUM(CT20:CT33),SUM(BW13:CJ13)+SUM(CE20:CE33),SUM(CL13:CY13)+SUM(CT20:CT33),SUM(BW13:CJ13)+SUM(CL13:CY13),SUM(CE20:CE33)+SUM(CT20:CT33))-5*BR13","v":21},{"$f":"CHOOSE(StandBer,SUM(CE5:CE18)+SUM(BW28:CJ28)+SUM(CT5:CT18)+SUM(CL28:CY28),SUM(CE5:CE18)+SUM(BW28:CJ28),SUM(CT5:CT18)+SUM(CL28:CY28),SUM(CE5:CE18)+SUM(CT5:CT18),SUM(BW28:CJ28)+SUM(CL28:CY28))","v":122},-101,{"$f":"CHOOSE(StandBer,COUNTIF(BW43:CJ43,\"ff\")+COUNTIF(CE35:CE48,\"ff\")+COUNTIF(CL43:CY43,\"ff\")+COUNTIF(CT35:CT48,\"ff\"),COUNTIF(BW43:CJ43,\"ff\")+COUNTIF(CE35:CE48,\"ff\"),COUNTIF(CL43:CY43,\"ff\")+COUNTIF(CT35:CT48,\"ff\"),COUNTIF(BW43:CJ43,\"ff\")+COUNTIF(CL43:CY43,\"ff\"),COUNTIF(CE35:CE48,\"ff\")+COUNTIF(CT35:CT48,\"ff\"))","v":0},9,8.8908091008000003,null,9,{"$f":"IF(OR(ISERROR(FIND(\"-\",Q13)),AE13>'export html'!$AR$7),\"\",SUBSTITUTE(_xlfn.TEXTBEFORE(Q13,\"-\"),\"*\",\"\")-0)","v":""},{"$f":"IF(OR(ISERROR(FIND(\"-\",R13)),AF13>'export html'!$AR$7),\"\",SUBSTITUTE(_xlfn.TEXTBEFORE(R13,\"-\"),\"*\",\"\")-0)","v":""},{"$f":"IF(OR(ISERROR(FIND(\"-\",S13)),AG13>'export html'!$AR$7),\"\",SUBSTITUTE(_xlfn.TEXTBEFORE(S13,\"-\"),\"*\",\"\")-0)","v":""},{"$f":"IF(OR(ISERROR(FIND(\"-\",T13)),AH13>'export html'!$AR$7),\"\",SUBSTITUTE(_xlfn.TEXTBEFORE(T13,\"-\"),\"*\",\"\")-0)","v":""},{"$f":"IF(OR(ISERROR(FIND(\"-\",U13)),AI13>'export html'!$AR$7),\"\",SUBSTITUTE(_xlfn.TEXTBEFORE(U13,\"-\"),\"*\",\"\")-0)","v":1},{"$f":"IF(OR(ISERROR(FIND(\"-\",V13)),AJ13>'export html'!$AR$7),\"\",SUBSTITUTE(_xlfn.TEXTBEFORE(V13,\"-\"),\"*\",\"\")-0)","v":0},{"$f":"IF(OR(ISERROR(FIND(\"-\",W13)),AK13>'export html'!$AR$7),\"\",SUBSTITUTE(_xlfn.TEXTBEFORE(W13,\"-\"),\"*\",\"\")-0)","v":""},{"$f":"IF(OR(ISERROR(FIND(\"-\",X13)),AL13>'export html'!$AR$7),\"\",SUBSTITUTE(_xlfn.TEXTBEFORE(X13,\"-\"),\"*\",\"\")-0)","v":0},null,{"$f":"IF(OR(ISERROR(FIND(\"-\",Z13)),AN13>'export html'!$AR$7),\"\",SUBSTITUTE(_xlfn.TEXTBEFORE(Z13,\"-\"),\"*\",\"\")-0)","v":1},{"$f":"IF(OR(ISERROR(FIND(\"-\",AA13)),AO13>'export html'!$AR$7),\"\",SUBSTITUTE(_xlfn.TEXTBEFORE(AA13,\"-\"),\"*\",\"\")-0)","v":""},{"$f":"IF(OR(ISERROR(FIND(\"-\",AB13)),AP13>'export html'!$AR$7),\"\",SUBSTITUTE(_xlfn.TEXTBEFORE(AB13,\"-\"),\"*\",\"\")-0)","v":0},{"$f":"IF(OR(ISERROR(FIND(\"-\",AC13)),AQ13>'export html'!$AR$7),\"\",SUBSTITUTE(_xlfn.TEXTBEFORE(AC13,\"-\"),\"*\",\"\")-0)","v":7},{"$f":"IF(OR(ISERROR(FIND(\"-\",AD13)),AR13>'export html'!$AR$7),\"\",SUBSTITUTE(_xlfn.TEXTBEFORE(AD13,\"-\"),\"*\",\"\")-0)","v":0},9,{"$f":"IF(OR(ISERROR(FIND(\"-\",Q13)),AE13<='export html'!$AR$7),\"\",SUBSTITUTE(_xlfn.TEXTBEFORE(Q13,\"-\"),\"*\",\"\")-0)","v":0},{"$f":"IF(OR(ISERROR(FIND(\"-\",R13)),AF13<='export html'!$AR$7),\"\",SUBSTITUTE(_xlfn.TEXTBEFORE(R13,\"-\"),\"*\",\"\")-0)","v":0},{"$f":"IF(OR(ISERROR(FIND(\"-\",S13)),AG13<='export html'!$AR$7),\"\",SUBSTITUTE(_xlfn.TEXTBEFORE(S13,\"-\"),\"*\",\"\")-0)","v":0},{"$f":"IF(OR(ISERROR(FIND(\"-\",T13)),AH13<='export html'!$AR$7),\"\",SUBSTITUTE(_xlfn.TEXTBEFORE(T13,\"-\"),\"*\",\"\")-0)","v":""},{"$f":"IF(OR(ISERROR(FIND(\"-\",U13)),AI13<='export html'!$AR$7),\"\",SUBSTITUTE(_xlfn.TEXTBEFORE(U13,\"-\"),\"*\",\"\")-0)","v":""},{"$f":"IF(OR(ISERROR(FIND(\"-\",V13)),AJ13<='export html'!$AR$7),\"\",SUBSTITUTE(_xlfn.TEXTBEFORE(V13,\"-\"),\"*\",\"\")-0)","v":""},{"$f":"IF(OR(ISERROR(FIND(\"-\",W13)),AK13<='export html'!$AR$7),\"\",SUBSTITUTE(_xlfn.TEXTBEFORE(W13,\"-\"),\"*\",\"\")-0)","v":1},{"$f":"IF(OR(ISERROR(FIND(\"-\",X13)),AL13<='export html'!$AR$7),\"\",SUBSTITUTE(_xlfn.TEXTBEFORE(X13,\"-\"),\"*\",\"\")-0)","v":""},null,{"$f":"IF(OR(ISERROR(FIND(\"-\",Z13)),AN13<='export html'!$AR$7),\"\",SUBSTITUTE(_xlfn.TEXTBEFORE(Z13,\"-\"),\"*\",\"\")-0)","v":""},{"$f":"IF(OR(ISERROR(FIND(\"-\",AA13)),AO13<='export html'!$AR$7),\"\",SUBSTITUTE(_xlfn.TEXTBEFORE(AA13,\"-\"),\"*\",\"\")-0)","v":""},{"$f":"IF(OR(ISERROR(FIND(\"-\",AB13)),AP13<='export html'!$AR$7),\"\",SUBSTITUTE(_xlfn.TEXTBEFORE(AB13,\"-\"),\"*\",\"\")-0)","v":""},{"$f":"IF(OR(ISERROR(FIND(\"-\",AC13)),AQ13<='export html'!$AR$7),\"\",SUBSTITUTE(_xlfn.TEXTBEFORE(AC13,\"-\"),\"*\",\"\")-0)","v":""},{"$f":"IF(OR(ISERROR(FIND(\"-\",AD13)),AR13<='export html'!$AR$7),\"\",SUBSTITUTE(_xlfn.TEXTBEFORE(AD13,\"-\"),\"*\",\"\")-0)","v":""},9]
[null,null,10,"Lucyvo",{"$f":"3*H14+J14","v":26},{"$f":"SUM(H14:J14)","v":24},"-",7,12,5,56,86,{"$f":"K14-L14","v":-30},{"$f":"3*F14-E14","v":46},null,"Lucyvo","1-5","1-7","2-4","2-1","5-5","0-5*","3-0","5-1","2-2",null,null,"5-2","4-8","6-2",3,12,1,24,7,19,15,5,22,null,26,21,17,10,"2024-09-15","2024-11-24","2024-09-01","2025-03-23","2024-10-13","2025-02-09","2025-03-02","2024-09-29","2025-03-09",null,"2025-04-06","2025-02-23","2024-12-22","2024-11-10",null,9.891011111000001,"Lucyvo",26,24,{"$f":"CHOOSE(StandBer,COUNTIF(BW44:CJ44,\"t\")+COUNTIF(CF35:CF48,\"u\")+COUNTIF(CL44:CY44,\"t\")+COUNTIF(CU35:CU48,\"u\"),COUNTIF(BW44:CJ44,\"t\")+COUNTIF(CF35:CF48,\"u\"),COUNTIF(CL44:CY44,\"t\")+COUNTIF(CU35:CU48,\"u\"),COUNTIF(BW44:CJ44,\"t\")+COUNTIF(CL44:CY44,\"t\"),COUNTIF(CF35:CF48,\"u\")+COUNTIF(CU35:CU48,\"u\"))","v":7},{"$f":"CHOOSE(StandBer,COUNTIF(BW44:CJ44,\"u\")+COUNTIF(CF35:CF48,\"t\")+COUNTIF(CL44:CY44,\"u\")+COUNTIF(CU35:CU48,\"t\"),COUNTIF(BW44:CJ44,\"u\")+COUNTIF(CF35:CF48,\"t\"),COUNTIF(CL44:CY44,\"u\")+COUNTIF(CU35:CU48,\"t\"),COUNTIF(BW44:CJ44,\"u\")+COUNTIF(CL44:CY44,\"u\"),COUNTIF(CF35:CF48,\"t\")+COUNTIF(CU35:CU48,\"t\"))+BR14","v":12},{"$f":"CHOOSE(StandBer,COUNTIF(BW44:CJ44,\"g\")+COUNTIF(CF35:CF48,\"g\")+COUNTIF(CL44:CY44,\"g\")+COUNTIF(CU35:CU48,\"g\"),COUNTIF(BW44:CJ44,\"g\")+COUNTIF(CF35:CF48,\"g\"),COUNTIF(CL44:CY44,\"g\")+COUNTIF(CU35:CU48,\"g\"),COUNTIF(BW44:CJ44,\"g\")+COUNTIF(CL44:CY44,\"g\"),COUNTIF(CF35:CF48,\"g\")+COUNTIF(CU35:CU48,\"g\"))","v":5},{"$f":"CHOOSE(StandBer,SUM(BW14:CJ14)+SUM(CF20:CF33)+SUM(CL14:CY14)+SUM(CU20:CU33),SUM(BW14:CJ14)+SUM(CF20:CF33),SUM(CL14:CY14)+SUM(CU20:CU33),SUM(BW14:CJ14)+SUM(CL14:CY14),SUM(CF20:CF33)+SUM(CU20:CU33))-5*BR14","v":56},{"$f":"CHOOSE(StandBer,SUM(CF5:CF18)+SUM(BW29:CJ29)+SUM(CU5:CU18)+SUM(CL29:CY29),SUM(CF5:CF18)+SUM(BW29:CJ29),SUM(CU5:CU18)+SUM(CL29:CY29),SUM(CF5:CF18)+SUM(CU5:CU18),SUM(BW29:CJ29)+SUM(CL29:CY29))","v":86},-30,{"$f":"CHOOSE(StandBer,COUNTIF(BW44:CJ44,\"ff\")+COUNTIF(CF35:CF48,\"ff\")+COUNTIF(CL44:CY44,\"ff\")+COUNTIF(CU35:CU48,\"ff\"),COUNTIF(BW44:CJ44,\"ff\")+COUNTIF(CF35:CF48,\"ff\"),COUNTIF(CL44:CY44,\"ff\")+COUNTIF(CU35:CU48,\"ff\"),COUNTIF(BW44:CJ44,\"ff\")+COUNTIF(CL44:CY44,\"ff\"),COUNTIF(CF35:CF48,\"ff\")+COUNTIF(CU35:CU48,\"ff\"))","v":0},10,9.891011111000001,null,10,{"$f":"IF(OR(ISERROR(FIND(\"-\",Q14)),AE14>'export html'!$AR$7),\"\",SUBSTITUTE(_xlfn.TEXTBEFORE(Q14,\"-\"),\"*\",\"\")-0)","v":1},{"$f":"IF(OR(ISERROR(FIND(\"-\",R14)),AF14>'export html'!$AR$7),\"\",SUBSTITUTE(_xlfn.TEXTBEFORE(R14,\"-\"),\"*\",\"\")-0)","v":1},{"$f":"IF(OR(ISERROR(FIND(\"-\",S14)),AG14>'export html'!$AR$7),\"\",SUBSTITUTE(_xlfn.TEXTBEFORE(S14,\"-\"),\"*\",\"\")-0)","v":2},{"$f":"IF(OR(ISERROR(FIND(\"-\",T14)),AH14>'export html'!$AR$7),\"\",SUBSTITUTE(_xlfn.TEXTBEFORE(T14,\"-\"),\"*\",\"\")-0)","v":""},{"$f":"IF(OR(ISERROR(FIND(\"-\",U14)),AI14>'export html'!$AR$7),\"\",SUBSTITUTE(_xlfn.TEXTBEFORE(U14,\"-\"),\"*\",\"\")-0)","v":5},{"$f":"IF(OR(ISERROR(FIND(\"-\",V14)),AJ14>'export html'!$AR$7),\"\",SUBSTITUTE(_xlfn.TEXTBEFORE(V14,\"-\"),\"*\",\"\")-0)","v":""},{"$f":"IF(OR(ISERROR(FIND(\"-\",W14)),AK14>'export html'!$AR$7),\"\",SUBSTITUTE(_xlfn.TEXTBEFORE(W14,\"-\"),\"*\",\"\")-0)","v":""},{"$f":"IF(OR(ISERROR(FIND(\"-\",X14)),AL14>'export html'!$AR$7),\"\",SUBSTITUTE(_xlfn.TEXTBEFORE(X14,\"-\"),\"*\",\"\")-0)","v":5},{"$f":"IF(OR(ISERROR(FIND(\"-\",Y14)),AM14>'export html'!$AR$7),\"\",SUBSTITUTE(_xlfn.TEXTBEFORE(Y14,\"-\"),\"*\",\"\")-0)","v":""},null,{"$f":"IF(OR(ISERROR(FIND(\"-\",AA14)),AO14>'export html'!$AR$7),\"\",SUBSTITUTE(_xlfn.TEXTBEFORE(AA14,\"-\"),\"*\",\"\")-0)","v":""},{"$f":"IF(OR(ISERROR(FIND(\"-\",AB14)),AP14>'export html'!$AR$7),\"\",SUBSTITUTE(_xlfn.TEXTBEFORE(AB14,\"-\"),\"*\",\"\")-0)","v":""},{"$f":"IF(OR(ISERROR(FIND(\"-\",AC14)),AQ14>'export html'!$AR$7),\"\",SUBSTITUTE(_xlfn.TEXTBEFORE(AC14,\"-\"),\"*\",\"\")-0)","v":""},{"$f":"IF(OR(ISERROR(FIND(\"-\",AD14)),AR14>'export html'!$AR$7),\"\",SUBSTITUTE(_xlfn.TEXTBEFORE(AD14,\"-\"),\"*\",\"\")-0)","v":6},10,{"$f":"IF(OR(ISERROR(FIND(\"-\",Q14)),AE14<='export html'!$AR$7),\"\",SUBSTITUTE(_xlfn.TEXTBEFORE(Q14,\"-\"),\"*\",\"\")-0)","v":""},{"$f":"IF(OR(ISERROR(FIND(\"-\",R14)),AF14<='export html'!$AR$7),\"\",SUBSTITUTE(_xlfn.TEXTBEFORE(R14,\"-\"),\"*\",\"\")-0)","v":""},{"$f":"IF(OR(ISERROR(FIND(\"-\",S14)),AG14<='export html'!$AR$7),\"\",SUBSTITUTE(_xlfn.TEXTBEFORE(S14,\"-\"),\"*\",\"\")-0)","v":""},{"$f":"IF(OR(ISERROR(FIND(\"-\",T14)),AH14<='export html'!$AR$7),\"\",SUBSTITUTE(_xlfn.TEXTBEFORE(T14,\"-\"),\"*\",\"\")-0)","v":2},{"$f":"IF(OR(ISERROR(FIND(\"-\",U14)),AI14<='export html'!$AR$7),\"\",SUBSTITUTE(_xlfn.TEXTBEFORE(U14,\"-\"),\"*\",\"\")-0)","v":""},{"$f":"IF(OR(ISERROR(FIND(\"-\",V14)),AJ14<='export html'!$AR$7),\"\",SUBSTITUTE(_xlfn.TEXTBEFORE(V14,\"-\"),\"*\",\"\")-0)","v":0},{"$f":"IF(OR(ISERROR(FIND(\"-\",W14)),AK14<='export html'!$AR$7),\"\",SUBSTITUTE(_xlfn.TEXTBEFORE(W14,\"-\"),\"*\",\"\")-0)","v":3},{"$f":"IF(OR(ISERROR(FIND(\"-\",X14)),AL14<='export html'!$AR$7),\"\",SUBSTITUTE(_xlfn.TEXTBEFORE(X14,\"-\"),\"*\",\"\")-0)","v":""},{"$f":"IF(OR(ISERROR(FIND(\"-\",Y14)),AM14<='export html'!$AR$7),\"\",SUBSTITUTE(_xlfn.TEXTBEFORE(Y14,\"-\"),\"*\",\"\")-0)","v":2},null,{"$f":"IF(OR(ISERROR(FIND(\"-\",AA14)),AO14<='export html'!$AR$7),\"\",SUBSTITUTE(_xlfn.TEXTBEFORE(AA14,\"-\"),\"*\",\"\")-0)","v":""},{"$f":"IF(OR(ISERROR(FIND(\"-\",AB14)),AP14<='export html'!$AR$7),\"\",SUBSTITUTE(_xlfn.TEXTBEFORE(AB14,\"-\"),\"*\",\"\")-0)","v":5},{"$f":"IF(OR(ISERROR(FIND(\"-\",AC14)),AQ14<='export html'!$AR$7),\"\",SUBSTITUTE(_xlfn.TEXTBEFORE(AC14,\"-\"),\"*\",\"\")-0)","v":4},{"$f":"IF(OR(ISERROR(FIND(\"-\",AD14)),AR14<='export html'!$AR$7),\"\",SUBSTITUTE(_xlfn.TEXTBEFORE(AD14,\"-\"),\"*\",\"\")-0)","v":""},10]
[null,null,11,"Corum",25,25,"",7,14,4,87,102,-15,50,null,"Racing Emblem","2-1","2-3","2-0","0-5*","4-1","1-1","5-0","0-2","4-1","8-2",null,"1-1","3-6","0-5*",7,16,5,2,11,23,19,9,4,13,null,25,21,14,"2024-10-13","2025-01-19","2024-09-29","2024-09-08","2024-11-17","2025-03-16","2025-02-09","2024-11-03","2024-09-22","2024-12-01",null,"2025-03-30","2025-02-23","2025-04-02",null,5.8905080911000001,"Racing Emblem",39,24,{"$f":"CHOOSE(StandBer,COUNTIF(BW45:CJ45,\"t\")+COUNTIF(CG35:CG48,\"u\")+COUNTIF(CL45:CY45,\"t\")+COUNTIF(CV35:CV48,\"u\"),COUNTIF(BW45:CJ45,\"t\")+COUNTIF(CG35:CG48,\"u\"),COUNTIF(CL45:CY45,\"t\")+COUNTIF(CV35:CV48,\"u\"),COUNTIF(BW45:CJ45,\"t\")+COUNTIF(CL45:CY45,\"t\"),COUNTIF(CG35:CG48,\"u\")+COUNTIF(CV35:CV48,\"u\"))","v":12},{"$f":"CHOOSE(StandBer,COUNTIF(BW45:CJ45,\"u\")+COUNTIF(CG35:CG48,\"t\")+COUNTIF(CL45:CY45,\"u\")+COUNTIF(CV35:CV48,\"t\"),COUNTIF(BW45:CJ45,\"u\")+COUNTIF(CG35:CG48,\"t\"),COUNTIF(CL45:CY45,\"u\")+COUNTIF(CV35:CV48,\"t\"),COUNTIF(BW45:CJ45,\"u\")+COUNTIF(CL45:CY45,\"u\"),COUNTIF(CG35:CG48,\"t\")+COUNTIF(CV35:CV48,\"t\"))+BR15","v":9},{"$f":"CHOOSE(StandBer,COUNTIF(BW45:CJ45,\"g\")+COUNTIF(CG35:CG48,\"g\")+COUNTIF(CL45:CY45,\"g\")+COUNTIF(CV35:CV48,\"g\"),COUNTIF(BW45:CJ45,\"g\")+COUNTIF(CG35:CG48,\"g\"),COUNTIF(CL45:CY45,\"g\")+COUNTIF(CV35:CV48,\"g\"),COUNTIF(BW45:CJ45,\"g\")+COUNTIF(CL45:CY45,\"g\"),COUNTIF(CG35:CG48,\"g\")+COUNTIF(CV35:CV48,\"g\"))","v":3},{"$f":"CHOOSE(StandBer,SUM(BW15:CJ15)+SUM(CG20:CG33)+SUM(CL15:CY15)+SUM(CV20:CV33),SUM(BW15:CJ15)+SUM(CG20:CG33),SUM(CL15:CY15)+SUM(CV20:CV33),SUM(BW15:CJ15)+SUM(CL15:CY15),SUM(CG20:CG33)+SUM(CV20:CV33))-5*BR15","v":65},{"$f":"CHOOSE(StandBer,SUM(CG5:CG18)+SUM(BW30:CJ30)+SUM(CV5:CV18)+SUM(CL30:CY30),SUM(CG5:CG18)+SUM(BW30:CJ30),SUM(CV5:CV18)+SUM(CL30:CY30),SUM(CG5:CG18)+SUM(CV5:CV18),SUM(BW30:CJ30)+SUM(CL30:CY30))","v":61},4,{"$f":"CHOOSE(StandBer,COUNTIF(BW45:CJ45,\"ff\")+COUNTIF(CG35:CG48,\"ff\")+COUNTIF(CL45:CY45,\"ff\")+COUNTIF(CV35:CV48,\"ff\"),COUNTIF(BW45:CJ45,\"ff\")+COUNTIF(CG35:CG48,\"ff\"),COUNTIF(CL45:CY45,\"ff\")+COUNTIF(CV35:CV48,\"ff\"),COUNTIF(BW45:CJ45,\"ff\")+COUNTIF(CL45:CY45,\"ff\"),COUNTIF(CG35:CG48,\"ff\")+COUNTIF(CV35:CV48,\"ff\"))","v":0},11,10.9910100505,null,11,{"$f":"IF(OR(ISERROR(FIND(\"-\",Q15)),AE15>'export html'!$AR$7),\"\",SUBSTITUTE(_xlfn.TEXTBEFORE(Q15,\"-\"),\"*\",\"\")-0)","v":2},{"$f":"IF(OR(ISERROR(FIND(\"-\",R15)),AF15>'export html'!$AR$7),\"\",SUBSTITUTE(_xlfn.TEXTBEFORE(R15,\"-\"),\"*\",\"\")-0)","v":""},{"$f":"IF(OR(ISERROR(FIND(\"-\",S15)),AG15>'export html'!$AR$7),\"\",SUBSTITUTE(_xlfn.TEXTBEFORE(S15,\"-\"),\"*\",\"\")-0)","v":2},{"$f":"IF(OR(ISERROR(FIND(\"-\",T15)),AH15>'export html'!$AR$7),\"\",SUBSTITUTE(_xlfn.TEXTBEFORE(T15,\"-\"),\"*\",\"\")-0)","v":0},{"$f":"IF(OR(ISERROR(FIND(\"-\",U15)),AI15>'export html'!$AR$7),\"\",SUBSTITUTE(_xlfn.TEXTBEFORE(U15,\"-\"),\"*\",\"\")-0)","v":4},{"$f":"IF(OR(ISERROR(FIND(\"-\",V15)),AJ15>'export html'!$AR$7),\"\",SUBSTITUTE(_xlfn.TEXTBEFORE(V15,\"-\"),\"*\",\"\")-0)","v":""},{"$f":"IF(OR(ISERROR(FIND(\"-\",W15)),AK15>'export html'!$AR$7),\"\",SUBSTITUTE(_xlfn.TEXTBEFORE(W15,\"-\"),\"*\",\"\")-0)","v":""},{"$f":"IF(OR(ISERROR(FIND(\"-\",X15)),AL15>'export html'!$AR$7),\"\",SUBSTITUTE(_xlfn.TEXTBEFORE(X15,\"-\"),\"*\",\"\")-0)","v":0},{"$f":"IF(OR(ISERROR(FIND(\"-\",Y15)),AM15>'export html'!$AR$7),\"\",SUBSTITUTE(_xlfn.TEXTBEFORE(Y15,\"-\"),\"*\",\"\")-0)","v":4},{"$f":"IF(OR(ISERROR(FIND(\"-\",Z15)),AN15>'export html'!$AR$7),\"\",SUBSTITUTE(_xlfn.TEXTBEFORE(Z15,\"-\"),\"*\",\"\")-0)","v":8},null,{"$f":"IF(OR(ISERROR(FIND(\"-\",AB15)),AP15>'export html'!$AR$7),\"\",SUBSTITUTE(_xlfn.TEXTBEFORE(AB15,\"-\"),\"*\",\"\")-0)","v":""},{"$f":"IF(OR(ISERROR(FIND(\"-\",AC15)),AQ15>'export html'!$AR$7),\"\",SUBSTITUTE(_xlfn.TEXTBEFORE(AC15,\"-\"),\"*\",\"\")-0)","v":""},{"$f":"IF(OR(ISERROR(FIND(\"-\",AD15)),AR15>'export html'!$AR$7),\"\",SUBSTITUTE(_xlfn.TEXTBEFORE(AD15,\"-\"),\"*\",\"\")-0)","v":""},11,{"$f":"IF(OR(ISERROR(FIND(\"-\",Q15)),AE15<='export html'!$AR$7),\"\",SUBSTITUTE(_xlfn.TEXTBEFORE(Q15,\"-\"),\"*\",\"\")-0)","v":""},{"$f":"IF(OR(ISERROR(FIND(\"-\",R15)),AF15<='export html'!$AR$7),\"\",SUBSTITUTE(_xlfn.TEXTBEFORE(R15,\"-\"),\"*\",\"\")-0)","v":2},{"$f":"IF(OR(ISERROR(FIND(\"-\",S15)),AG15<='export html'!$AR$7),\"\",SUBSTITUTE(_xlfn.TEXTBEFORE(S15,\"-\"),\"*\",\"\")-0)","v":""},{"$f":"IF(OR(ISERROR(FIND(\"-\",T15)),AH15<='export html'!$AR$7),\"\",SUBSTITUTE(_xlfn.TEXTBEFORE(T15,\"-\"),\"*\",\"\")-0)","v":""},{"$f":"IF(OR(ISERROR(FIND(\"-\",U15)),AI15<='export html'!$AR$7),\"\",SUBSTITUTE(_xlfn.TEXTBEFORE(U15,\"-\"),\"*\",\"\")-0)","v":""},{"$f":"IF(OR(ISERROR(FIND(\"-\",V15)),AJ15<='export html'!$AR$7),\"\",SUBSTITUTE(_xlfn.TEXTBEFORE(V15,\"-\"),\"*\",\"\")-0)","v":1},{"$f":"IF(OR(ISERROR(FIND(\"-\",W15)),AK15<='export html'!$AR$7),\"\",SUBSTITUTE(_xlfn.TEXTBEFORE(W15,\"-\"),\"*\",\"\")-0)","v":5},{"$f":"IF(OR(ISERROR(FIND(\"-\",X15)),AL15<='export html'!$AR$7),\"\",SUBSTITUTE(_xlfn.TEXTBEFORE(X15,\"-\"),\"*\",\"\")-0)","v":""},{"$f":"IF(OR(ISERROR(FIND(\"-\",Y15)),AM15<='export html'!$AR$7),\"\",SUBSTITUTE(_xlfn.TEXTBEFORE(Y15,\"-\"),\"*\",\"\")-0)","v":""},{"$f":"IF(OR(ISERROR(FIND(\"-\",Z15)),AN15<='export html'!$AR$7),\"\",SUBSTITUTE(_xlfn.TEXTBEFORE(Z15,\"-\"),\"*\",\"\")-0)","v":""},null,{"$f":"IF(OR(ISERROR(FIND(\"-\",AB15)),AP15<='export html'!$AR$7),\"\",SUBSTITUTE(_xlfn.TEXTBEFORE(AB15,\"-\"),\"*\",\"\")-0)","v":1},{"$f":"IF(OR(ISERROR(FIND(\"-\",AC15)),AQ15<='export html'!$AR$7),\"\",SUBSTITUTE(_xlfn.TEXTBEFORE(AC15,\"-\"),\"*\",\"\")-0)","v":3},{"$f":"IF(OR(ISERROR(FIND(\"-\",AD15)),AR15<='export html'!$AR$7),\"\",SUBSTITUTE(_xlfn.TEXTBEFORE(AD15,\"-\"),\"*\",\"\")-0)","v":0},11]
[null,null,12,"Bariton",20,25,"",6,17,2,45,102,-57,55,null,"Sint Anneke","1-2","0-2",null,"10-2","7-3","2-3","5-2","2-0","4-2","4-0","2-8",null,"6-3","0-9",15,24,26,10,19,5,1,17,20,8,12,null,3,22,"2025-03-02","2025-03-23","2025-04-06","2024-11-10","2025-02-09","2024-09-29","2024-09-01","2025-01-26","2025-02-16","2024-10-20","2024-11-24",null,"2024-09-15","2025-03-09",null,6.9907050312000001,"Sint Anneke",37,25,{"$f":"CHOOSE(StandBer,COUNTIF(BW46:CJ46,\"t\")+COUNTIF(CH35:CH48,\"u\")+COUNTIF(CL46:CY46,\"t\")+COUNTIF(CW35:CW48,\"u\"),COUNTIF(BW46:CJ46,\"t\")+COUNTIF(CH35:CH48,\"u\"),COUNTIF(CL46:CY46,\"t\")+COUNTIF(CW35:CW48,\"u\"),COUNTIF(BW46:CJ46,\"t\")+COUNTIF(CL46:CY46,\"t\"),COUNTIF(CH35:CH48,\"u\")+COUNTIF(CW35:CW48,\"u\"))","v":11},{"$f":"CHOOSE(StandBer,COUNTIF(BW46:CJ46,\"u\")+COUNTIF(CH35:CH48,\"t\")+COUNTIF(CL46:CY46,\"u\")+COUNTIF(CW35:CW48,\"t\"),COUNTIF(BW46:CJ46,\"u\")+COUNTIF(CH35:CH48,\"t\"),COUNTIF(CL46:CY46,\"u\")+COUNTIF(CW35:CW48,\"t\"),COUNTIF(BW46:CJ46,\"u\")+COUNTIF(CL46:CY46,\"u\"),COUNTIF(CH35:CH48,\"t\")+COUNTIF(CW35:CW48,\"t\"))+BR16","v":10},{"$f":"CHOOSE(StandBer,COUNTIF(BW46:CJ46,\"g\")+COUNTIF(CH35:CH48,\"g\")+COUNTIF(CL46:CY46,\"g\")+COUNTIF(CW35:CW48,\"g\"),COUNTIF(BW46:CJ46,\"g\")+COUNTIF(CH35:CH48,\"g\"),COUNTIF(CL46:CY46,\"g\")+COUNTIF(CW35:CW48,\"g\"),COUNTIF(BW46:CJ46,\"g\")+COUNTIF(CL46:CY46,\"g\"),COUNTIF(CH35:CH48,\"g\")+COUNTIF(CW35:CW48,\"g\"))","v":4},{"$f":"CHOOSE(StandBer,SUM(BW16:CJ16)+SUM(CH20:CH33)+SUM(CL16:CY16)+SUM(CW20:CW33),SUM(BW16:CJ16)+SUM(CH20:CH33),SUM(CL16:CY16)+SUM(CW20:CW33),SUM(BW16:CJ16)+SUM(CL16:CY16),SUM(CH20:CH33)+SUM(CW20:CW33))-5*BR16","v":91},{"$f":"CHOOSE(StandBer,SUM(CH5:CH18)+SUM(BW31:CJ31)+SUM(CW5:CW18)+SUM(CL31:CY31),SUM(CH5:CH18)+SUM(BW31:CJ31),SUM(CW5:CW18)+SUM(CL31:CY31),SUM(CH5:CH18)+SUM(CW5:CW18),SUM(BW31:CJ31)+SUM(CL31:CY31))","v":79},12,{"$f":"CHOOSE(StandBer,COUNTIF(BW46:CJ46,\"ff\")+COUNTIF(CH35:CH48,\"ff\")+COUNTIF(CL46:CY46,\"ff\")+COUNTIF(CW35:CW48,\"ff\"),COUNTIF(BW46:CJ46,\"ff\")+COUNTIF(CH35:CH48,\"ff\"),COUNTIF(CL46:CY46,\"ff\")+COUNTIF(CW35:CW48,\"ff\"),COUNTIF(BW46:CJ46,\"ff\")+COUNTIF(CL46:CY46,\"ff\"),COUNTIF(CH35:CH48,\"ff\")+COUNTIF(CW35:CW48,\"ff\"))","v":0},12,11.9912131304,null,12,{"$f":"IF(OR(ISERROR(FIND(\"-\",Q16)),AE16>'export html'!$AR$7),\"\",SUBSTITUTE(_xlfn.TEXTBEFORE(Q16,\"-\"),\"*\",\"\")-0)","v":""},{"$f":"IF(OR(ISERROR(FIND(\"-\",R16)),AF16>'export html'!$AR$7),\"\",SUBSTITUTE(_xlfn.TEXTBEFORE(R16,\"-\"),\"*\",\"\")-0)","v":""},{"$f":"IF(OR(ISERROR(FIND(\"-\",S16)),AG16>'export html'!$AR$7),\"\",SUBSTITUTE(_xlfn.TEXTBEFORE(S16,\"-\"),\"*\",\"\")-0)","v":""},{"$f":"IF(OR(ISERROR(FIND(\"-\",T16)),AH16>'export html'!$AR$7),\"\",SUBSTITUTE(_xlfn.TEXTBEFORE(T16,\"-\"),\"*\",\"\")-0)","v":10},{"$f":"IF(OR(ISERROR(FIND(\"-\",U16)),AI16>'export html'!$AR$7),\"\",SUBSTITUTE(_xlfn.TEXTBEFORE(U16,\"-\"),\"*\",\"\")-0)","v":""},{"$f":"IF(OR(ISERROR(FIND(\"-\",V16)),AJ16>'export html'!$AR$7),\"\",SUBSTITUTE(_xlfn.TEXTBEFORE(V16,\"-\"),\"*\",\"\")-0)","v":2},{"$f":"IF(OR(ISERROR(FIND(\"-\",W16)),AK16>'export html'!$AR$7),\"\",SUBSTITUTE(_xlfn.TEXTBEFORE(W16,\"-\"),\"*\",\"\")-0)","v":5},{"$f":"IF(OR(ISERROR(FIND(\"-\",X16)),AL16>'export html'!$AR$7),\"\",SUBSTITUTE(_xlfn.TEXTBEFORE(X16,\"-\"),\"*\",\"\")-0)","v":""},{"$f":"IF(OR(ISERROR(FIND(\"-\",Y16)),AM16>'export html'!$AR$7),\"\",SUBSTITUTE(_xlfn.TEXTBEFORE(Y16,\"-\"),\"*\",\"\")-0)","v":""},{"$f":"IF(OR(ISERROR(FIND(\"-\",Z16)),AN16>'export html'!$AR$7),\"\",SUBSTITUTE(_xlfn.TEXTBEFORE(Z16,\"-\"),\"*\",\"\")-0)","v":4},{"$f":"IF(OR(ISERROR(FIND(\"-\",AA16)),AO16>'export html'!$AR$7),\"\",SUBSTITUTE(_xlfn.TEXTBEFORE(AA16,\"-\"),\"*\",\"\")-0)","v":2},null,{"$f":"IF(OR(ISERROR(FIND(\"-\",AC16)),AQ16>'export html'!$AR$7),\"\",SUBSTITUTE(_xlfn.TEXTBEFORE(AC16,\"-\"),\"*\",\"\")-0)","v":6},{"$f":"IF(OR(ISERROR(FIND(\"-\",AD16)),AR16>'export html'!$AR$7),\"\",SUBSTITUTE(_xlfn.TEXTBEFORE(AD16,\"-\"),\"*\",\"\")-0)","v":""},12,{"$f":"IF(OR(ISERROR(FIND(\"-\",Q16)),AE16<='export html'!$AR$7),\"\",SUBSTITUTE(_xlfn.TEXTBEFORE(Q16,\"-\"),\"*\",\"\")-0)","v":1},{"$f":"IF(OR(ISERROR(FIND(\"-\",R16)),AF16<='export html'!$AR$7),\"\",SUBSTITUTE(_xlfn.TEXTBEFORE(R16,\"-\"),\"*\",\"\")-0)","v":0},{"$f":"IF(OR(ISERROR(FIND(\"-\",S16)),AG16<='export html'!$AR$7),\"\",SUBSTITUTE(_xlfn.TEXTBEFORE(S16,\"-\"),\"*\",\"\")-0)","v":""},{"$f":"IF(OR(ISERROR(FIND(\"-\",T16)),AH16<='export html'!$AR$7),\"\",SUBSTITUTE(_xlfn.TEXTBEFORE(T16,\"-\"),\"*\",\"\")-0)","v":""},{"$f":"IF(OR(ISERROR(FIND(\"-\",U16)),AI16<='export html'!$AR$7),\"\",SUBSTITUTE(_xlfn.TEXTBEFORE(U16,\"-\"),\"*\",\"\")-0)","v":7},{"$f":"IF(OR(ISERROR(FIND(\"-\",V16)),AJ16<='export html'!$AR$7),\"\",SUBSTITUTE(_xlfn.TEXTBEFORE(V16,\"-\"),\"*\",\"\")-0)","v":""},{"$f":"IF(OR(ISERROR(FIND(\"-\",W16)),AK16<='export html'!$AR$7),\"\",SUBSTITUTE(_xlfn.TEXTBEFORE(W16,\"-\"),\"*\",\"\")-0)","v":""},{"$f":"IF(OR(ISERROR(FIND(\"-\",X16)),AL16<='export html'!$AR$7),\"\",SUBSTITUTE(_xlfn.TEXTBEFORE(X16,\"-\"),\"*\",\"\")-0)","v":2},{"$f":"IF(OR(ISERROR(FIND(\"-\",Y16)),AM16<='export html'!$AR$7),\"\",SUBSTITUTE(_xlfn.TEXTBEFORE(Y16,\"-\"),\"*\",\"\")-0)","v":4},{"$f":"IF(OR(ISERROR(FIND(\"-\",Z16)),AN16<='export html'!$AR$7),\"\",SUBSTITUTE(_xlfn.TEXTBEFORE(Z16,\"-\"),\"*\",\"\")-0)","v":""},{"$f":"IF(OR(ISERROR(FIND(\"-\",AA16)),AO16<='export html'!$AR$7),\"\",SUBSTITUTE(_xlfn.TEXTBEFORE(AA16,\"-\"),\"*\",\"\")-0)","v":""},null,{"$f":"IF(OR(ISERROR(FIND(\"-\",AC16)),AQ16<='export html'!$AR$7),\"\",SUBSTITUTE(_xlfn.TEXTBEFORE(AC16,\"-\"),\"*\",\"\")-0)","v":""},{"$f":"IF(OR(ISERROR(FIND(\"-\",AD16)),AR16<='export html'!$AR$7),\"\",SUBSTITUTE(_xlfn.TEXTBEFORE(AD16,\"-\"),\"*\",\"\")-0)","v":0},12]
[null,null,13,"Goka",{"$f":"3*H17+J17","v":19},{"$f":"SUM(H17:J17)","v":25},"",5,16,4,47,81,{"$f":"K17-L17","v":-34},{"$f":"3*F17-E17","v":56},null,"SC Duffel","1-1","2-2","11-3","1-1","3-3","1-1","3-1","3-1","10-0","3-1","0-1","2-2",null,"0-5*",24,20,22,6,2,14,10,13,25,4,8,16,null,18,"2025-03-22","2025-02-15","2025-03-08","2024-10-05","2024-09-07","2025-01-04","2024-11-09","2024-11-30","2025-03-29","2024-09-21","2024-10-19","2024-12-14",null,"2025-02-01",null,7.9908070813000007,"SC Duffel",33,25,{"$f":"CHOOSE(StandBer,COUNTIF(BW47:CJ47,\"t\")+COUNTIF(CI35:CI48,\"u\")+COUNTIF(CL47:CY47,\"t\")+COUNTIF(CX35:CX48,\"u\"),COUNTIF(BW47:CJ47,\"t\")+COUNTIF(CI35:CI48,\"u\"),COUNTIF(CL47:CY47,\"t\")+COUNTIF(CX35:CX48,\"u\"),COUNTIF(BW47:CJ47,\"t\")+COUNTIF(CL47:CY47,\"t\"),COUNTIF(CI35:CI48,\"u\")+COUNTIF(CX35:CX48,\"u\"))","v":9},{"$f":"CHOOSE(StandBer,COUNTIF(BW47:CJ47,\"u\")+COUNTIF(CI35:CI48,\"t\")+COUNTIF(CL47:CY47,\"u\")+COUNTIF(CX35:CX48,\"t\"),COUNTIF(BW47:CJ47,\"u\")+COUNTIF(CI35:CI48,\"t\"),COUNTIF(CL47:CY47,\"u\")+COUNTIF(CX35:CX48,\"t\"),COUNTIF(BW47:CJ47,\"u\")+COUNTIF(CL47:CY47,\"u\"),COUNTIF(CI35:CI48,\"t\")+COUNTIF(CX35:CX48,\"t\"))+BR17","v":10},{"$f":"CHOOSE(StandBer,COUNTIF(BW47:CJ47,\"g\")+COUNTIF(CI35:CI48,\"g\")+COUNTIF(CL47:CY47,\"g\")+COUNTIF(CX35:CX48,\"g\"),COUNTIF(BW47:CJ47,\"g\")+COUNTIF(CI35:CI48,\"g\"),COUNTIF(CL47:CY47,\"g\")+COUNTIF(CX35:CX48,\"g\"),COUNTIF(BW47:CJ47,\"g\")+COUNTIF(CL47:CY47,\"g\"),COUNTIF(CI35:CI48,\"g\")+COUNTIF(CX35:CX48,\"g\"))","v":6},{"$f":"CHOOSE(StandBer,SUM(BW17:CJ17)+SUM(CI20:CI33)+SUM(CL17:CY17)+SUM(CX20:CX33),SUM(BW17:CJ17)+SUM(CI20:CI33),SUM(CL17:CY17)+SUM(CX20:CX33),SUM(BW17:CJ17)+SUM(CL17:CY17),SUM(CI20:CI33)+SUM(CX20:CX33))-5*BR17","v":70},{"$f":"CHOOSE(StandBer,SUM(CI5:CI18)+SUM(BW32:CJ32)+SUM(CX5:CX18)+SUM(CL32:CY32),SUM(CI5:CI18)+SUM(BW32:CJ32),SUM(CX5:CX18)+SUM(CL32:CY32),SUM(CI5:CI18)+SUM(CX5:CX18),SUM(BW32:CJ32)+SUM(CL32:CY32))","v":65},5,{"$f":"CHOOSE(StandBer,COUNTIF(BW47:CJ47,\"ff\")+COUNTIF(CI35:CI48,\"ff\")+COUNTIF(CL47:CY47,\"ff\")+COUNTIF(CX35:CX48,\"ff\"),COUNTIF(BW47:CJ47,\"ff\")+COUNTIF(CI35:CI48,\"ff\"),COUNTIF(CL47:CY47,\"ff\")+COUNTIF(CX35:CX48,\"ff\"),COUNTIF(BW47:CJ47,\"ff\")+COUNTIF(CL47:CY47,\"ff\"),COUNTIF(CI35:CI48,\"ff\")+COUNTIF(CX35:CX48,\"ff\"))","v":0},13,12.9913121207,null,13,{"$f":"IF(OR(ISERROR(FIND(\"-\",Q17)),AE17>'export html'!$AR$7),\"\",SUBSTITUTE(_xlfn.TEXTBEFORE(Q17,\"-\"),\"*\",\"\")-0)","v":""},{"$f":"IF(OR(ISERROR(FIND(\"-\",R17)),AF17>'export html'!$AR$7),\"\",SUBSTITUTE(_xlfn.TEXTBEFORE(R17,\"-\"),\"*\",\"\")-0)","v":""},{"$f":"IF(OR(ISERROR(FIND(\"-\",S17)),AG17>'export html'!$AR$7),\"\",SUBSTITUTE(_xlfn.TEXTBEFORE(S17,\"-\"),\"*\",\"\")-0)","v":""},{"$f":"IF(OR(ISERROR(FIND(\"-\",T17)),AH17>'export html'!$AR$7),\"\",SUBSTITUTE(_xlfn.TEXTBEFORE(T17,\"-\"),\"*\",\"\")-0)","v":1},{"$f":"IF(OR(ISERROR(FIND(\"-\",U17)),AI17>'export html'!$AR$7),\"\",SUBSTITUTE(_xlfn.TEXTBEFORE(U17,\"-\"),\"*\",\"\")-0)","v":3},{"$f":"IF(OR(ISERROR(FIND(\"-\",V17)),AJ17>'export html'!$AR$7),\"\",SUBSTITUTE(_xlfn.TEXTBEFORE(V17,\"-\"),\"*\",\"\")-0)","v":""},{"$f":"IF(OR(ISERROR(FIND(\"-\",W17)),AK17>'export html'!$AR$7),\"\",SUBSTITUTE(_xlfn.TEXTBEFORE(W17,\"-\"),\"*\",\"\")-0)","v":3},{"$f":"IF(OR(ISERROR(FIND(\"-\",X17)),AL17>'export html'!$AR$7),\"\",SUBSTITUTE(_xlfn.TEXTBEFORE(X17,\"-\"),\"*\",\"\")-0)","v":3},{"$f":"IF(OR(ISERROR(FIND(\"-\",Y17)),AM17>'export html'!$AR$7),\"\",SUBSTITUTE(_xlfn.TEXTBEFORE(Y17,\"-\"),\"*\",\"\")-0)","v":""},{"$f":"IF(OR(ISERROR(FIND(\"-\",Z17)),AN17>'export html'!$AR$7),\"\",SUBSTITUTE(_xlfn.TEXTBEFORE(Z17,\"-\"),\"*\",\"\")-0)","v":3},{"$f":"IF(OR(ISERROR(FIND(\"-\",AA17)),AO17>'export html'!$AR$7),\"\",SUBSTITUTE(_xlfn.TEXTBEFORE(AA17,\"-\"),\"*\",\"\")-0)","v":0},{"$f":"IF(OR(ISERROR(FIND(\"-\",AB17)),AP17>'export html'!$AR$7),\"\",SUBSTITUTE(_xlfn.TEXTBEFORE(AB17,\"-\"),\"*\",\"\")-0)","v":""},null,{"$f":"IF(OR(ISERROR(FIND(\"-\",AD17)),AR17>'export html'!$AR$7),\"\",SUBSTITUTE(_xlfn.TEXTBEFORE(AD17,\"-\"),\"*\",\"\")-0)","v":""},13,{"$f":"IF(OR(ISERROR(FIND(\"-\",Q17)),AE17<='export html'!$AR$7),\"\",SUBSTITUTE(_xlfn.TEXTBEFORE(Q17,\"-\"),\"*\",\"\")-0)","v":1},{"$f":"IF(OR(ISERROR(FIND(\"-\",R17)),AF17<='export html'!$AR$7),\"\",SUBSTITUTE(_xlfn.TEXTBEFORE(R17,\"-\"),\"*\",\"\")-0)","v":2},{"$f":"IF(OR(ISERROR(FIND(\"-\",S17)),AG17<='export html'!$AR$7),\"\",SUBSTITUTE(_xlfn.TEXTBEFORE(S17,\"-\"),\"*\",\"\")-0)","v":11},{"$f":"IF(OR(ISERROR(FIND(\"-\",T17)),AH17<='export html'!$AR$7),\"\",SUBSTITUTE(_xlfn.TEXTBEFORE(T17,\"-\"),\"*\",\"\")-0)","v":""},{"$f":"IF(OR(ISERROR(FIND(\"-\",U17)),AI17<='export html'!$AR$7),\"\",SUBSTITUTE(_xlfn.TEXTBEFORE(U17,\"-\"),\"*\",\"\")-0)","v":""},{"$f":"IF(OR(ISERROR(FIND(\"-\",V17)),AJ17<='export html'!$AR$7),\"\",SUBSTITUTE(_xlfn.TEXTBEFORE(V17,\"-\"),\"*\",\"\")-0)","v":1},{"$f":"IF(OR(ISERROR(FIND(\"-\",W17)),AK17<='export html'!$AR$7),\"\",SUBSTITUTE(_xlfn.TEXTBEFORE(W17,\"-\"),\"*\",\"\")-0)","v":""},{"$f":"IF(OR(ISERROR(FIND(\"-\",X17)),AL17<='export html'!$AR$7),\"\",SUBSTITUTE(_xlfn.TEXTBEFORE(X17,\"-\"),\"*\",\"\")-0)","v":""},{"$f":"IF(OR(ISERROR(FIND(\"-\",Y17)),AM17<='export html'!$AR$7),\"\",SUBSTITUTE(_xlfn.TEXTBEFORE(Y17,\"-\"),\"*\",\"\")-0)","v":10},{"$f":"IF(OR(ISERROR(FIND(\"-\",Z17)),AN17<='export html'!$AR$7),\"\",SUBSTITUTE(_xlfn.TEXTBEFORE(Z17,\"-\"),\"*\",\"\")-0)","v":""},{"$f":"IF(OR(ISERROR(FIND(\"-\",AA17)),AO17<='export html'!$AR$7),\"\",SUBSTITUTE(_xlfn.TEXTBEFORE(AA17,\"-\"),\"*\",\"\")-0)","v":""},{"$f":"IF(OR(ISERROR(FIND(\"-\",AB17)),AP17<='export html'!$AR$7),\"\",SUBSTITUTE(_xlfn.TEXTBEFORE(AB17,\"-\"),\"*\",\"\")-0)","v":2},null,{"$f":"IF(OR(ISERROR(FIND(\"-\",AD17)),AR17<='export html'!$AR$7),\"\",SUBSTITUTE(_xlfn.TEXTBEFORE(AD17,\"-\"),\"*\",\"\")-0)","v":0},13]
[null,null,14,"Jolika",6,24,"-",1,20,3,21,122,-101,66,null,"Yerevan United","2-1",null,"1-3","5-2","5-3","1-4","9-3","0-5*","13-3","1-7","8-2","6-4","4-1",null,17,26,15,12,21,7,3,19,24,23,1,9,5,null,"2025-01-26","2025-04-06","2025-03-02","2024-11-24","2025-02-23","2024-10-13","2024-09-15","2025-02-09","2025-03-23","2025-03-16","2024-09-01","2024-11-03","2024-09-29",null,null,1.9902030213999999,"Yerevan United",51,25,{"$f":"CHOOSE(StandBer,COUNTIF(BW48:CJ48,\"t\")+COUNTIF(CJ35:CJ48,\"u\")+COUNTIF(CL48:CY48,\"t\")+COUNTIF(CY35:CY48,\"u\"),COUNTIF(BW48:CJ48,\"t\")+COUNTIF(CJ35:CJ48,\"u\"),COUNTIF(CL48:CY48,\"t\")+COUNTIF(CY35:CY48,\"u\"),COUNTIF(BW48:CJ48,\"t\")+COUNTIF(CL48:CY48,\"t\"),COUNTIF(CJ35:CJ48,\"u\")+COUNTIF(CY35:CY48,\"u\"))","v":16},{"$f":"CHOOSE(StandBer,COUNTIF(BW48:CJ48,\"u\")+COUNTIF(CJ35:CJ48,\"t\")+COUNTIF(CL48:CY48,\"u\")+COUNTIF(CY35:CY48,\"t\"),COUNTIF(BW48:CJ48,\"u\")+COUNTIF(CJ35:CJ48,\"t\"),COUNTIF(CL48:CY48,\"u\")+COUNTIF(CY35:CY48,\"t\"),COUNTIF(BW48:CJ48,\"u\")+COUNTIF(CL48:CY48,\"u\"),COUNTIF(CJ35:CJ48,\"t\")+COUNTIF(CY35:CY48,\"t\"))+BR18","v":6},{"$f":"CHOOSE(StandBer,COUNTIF(BW48:CJ48,\"g\")+COUNTIF(CJ35:CJ48,\"g\")+COUNTIF(CL48:CY48,\"g\")+COUNTIF(CY35:CY48,\"g\"),COUNTIF(BW48:CJ48,\"g\")+COUNTIF(CJ35:CJ48,\"g\"),COUNTIF(CL48:CY48,\"g\")+COUNTIF(CY35:CY48,\"g\"),COUNTIF(BW48:CJ48,\"g\")+COUNTIF(CL48:CY48,\"g\"),COUNTIF(CJ35:CJ48,\"g\")+COUNTIF(CY35:CY48,\"g\"))","v":3},{"$f":"CHOOSE(StandBer,SUM(BW18:CJ18)+SUM(CJ20:CJ33)+SUM(CL18:CY18)+SUM(CY20:CY33),SUM(BW18:CJ18)+SUM(CJ20:CJ33),SUM(CL18:CY18)+SUM(CY20:CY33),SUM(BW18:CJ18)+SUM(CL18:CY18),SUM(CJ20:CJ33)+SUM(CY20:CY33))-5*BR18","v":103},{"$f":"CHOOSE(StandBer,SUM(CJ5:CJ18)+SUM(BW33:CJ33)+SUM(CY5:CY18)+SUM(CL33:CY33),SUM(CJ5:CJ18)+SUM(BW33:CJ33),SUM(CY5:CY18)+SUM(CL33:CY33),SUM(CJ5:CJ18)+SUM(CY5:CY18),SUM(BW33:CJ33)+SUM(CL33:CY33))","v":62},41,{"$f":"CHOOSE(StandBer,COUNTIF(BW48:CJ48,\"ff\")+COUNTIF(CJ35:CJ48,\"ff\")+COUNTIF(CL48:CY48,\"ff\")+COUNTIF(CY35:CY48,\"ff\"),COUNTIF(BW48:CJ48,\"ff\")+COUNTIF(CJ35:CJ48,\"ff\"),COUNTIF(CL48:CY48,\"ff\")+COUNTIF(CY35:CY48,\"ff\"),COUNTIF(BW48:CJ48,\"ff\")+COUNTIF(CL48:CY48,\"ff\"),COUNTIF(CJ35:CJ48,\"ff\")+COUNTIF(CY35:CY48,\"ff\"))","v":0},14,13.8914141409,null,14,{"$f":"IF(OR(ISERROR(FIND(\"-\",Q18)),AE18>'export html'!$AR$7),\"\",SUBSTITUTE(_xlfn.TEXTBEFORE(Q18,\"-\"),\"*\",\"\")-0)","v":""},{"$f":"IF(OR(ISERROR(FIND(\"-\",R18)),AF18>'export html'!$AR$7),\"\",SUBSTITUTE(_xlfn.TEXTBEFORE(R18,\"-\"),\"*\",\"\")-0)","v":""},{"$f":"IF(OR(ISERROR(FIND(\"-\",S18)),AG18>'export html'!$AR$7),\"\",SUBSTITUTE(_xlfn.TEXTBEFORE(S18,\"-\"),\"*\",\"\")-0)","v":""},{"$f":"IF(OR(ISERROR(FIND(\"-\",T18)),AH18>'export html'!$AR$7),\"\",SUBSTITUTE(_xlfn.TEXTBEFORE(T18,\"-\"),\"*\",\"\")-0)","v":5},{"$f":"IF(OR(ISERROR(FIND(\"-\",U18)),AI18>'export html'!$AR$7),\"\",SUBSTITUTE(_xlfn.TEXTBEFORE(U18,\"-\"),\"*\",\"\")-0)","v":""},{"$f":"IF(OR(ISERROR(FIND(\"-\",V18)),AJ18>'export html'!$AR$7),\"\",SUBSTITUTE(_xlfn.TEXTBEFORE(V18,\"-\"),\"*\",\"\")-0)","v":1},{"$f":"IF(OR(ISERROR(FIND(\"-\",W18)),AK18>'export html'!$AR$7),\"\",SUBSTITUTE(_xlfn.TEXTBEFORE(W18,\"-\"),\"*\",\"\")-0)","v":9},{"$f":"IF(OR(ISERROR(FIND(\"-\",X18)),AL18>'export html'!$AR$7),\"\",SUBSTITUTE(_xlfn.TEXTBEFORE(X18,\"-\"),\"*\",\"\")-0)","v":""},{"$f":"IF(OR(ISERROR(FIND(\"-\",Y18)),AM18>'export html'!$AR$7),\"\",SUBSTITUTE(_xlfn.TEXTBEFORE(Y18,\"-\"),\"*\",\"\")-0)","v":""},{"$f":"IF(OR(ISERROR(FIND(\"-\",Z18)),AN18>'export html'!$AR$7),\"\",SUBSTITUTE(_xlfn.TEXTBEFORE(Z18,\"-\"),\"*\",\"\")-0)","v":""},{"$f":"IF(OR(ISERROR(FIND(\"-\",AA18)),AO18>'export html'!$AR$7),\"\",SUBSTITUTE(_xlfn.TEXTBEFORE(AA18,\"-\"),\"*\",\"\")-0)","v":8},{"$f":"IF(OR(ISERROR(FIND(\"-\",AB18)),AP18>'export html'!$AR$7),\"\",SUBSTITUTE(_xlfn.TEXTBEFORE(AB18,\"-\"),\"*\",\"\")-0)","v":6},{"$f":"IF(OR(ISERROR(FIND(\"-\",AC18)),AQ18>'export html'!$AR$7),\"\",SUBSTITUTE(_xlfn.TEXTBEFORE(AC18,\"-\"),\"*\",\"\")-0)","v":4},null,14,{"$f":"IF(OR(ISERROR(FIND(\"-\",Q18)),AE18<='export html'!$AR$7),\"\",SUBSTITUTE(_xlfn.TEXTBEFORE(Q18,\"-\"),\"*\",\"\")-0)","v":2},{"$f":"IF(OR(ISERROR(FIND(\"-\",R18)),AF18<='export html'!$AR$7),\"\",SUBSTITUTE(_xlfn.TEXTBEFORE(R18,\"-\"),\"*\",\"\")-0)","v":""},{"$f":"IF(OR(ISERROR(FIND(\"-\",S18)),AG18<='export html'!$AR$7),\"\",SUBSTITUTE(_xlfn.TEXTBEFORE(S18,\"-\"),\"*\",\"\")-0)","v":1},{"$f":"IF(OR(ISERROR(FIND(\"-\",T18)),AH18<='export html'!$AR$7),\"\",SUBSTITUTE(_xlfn.TEXTBEFORE(T18,\"-\"),\"*\",\"\")-0)","v":""},{"$f":"IF(OR(ISERROR(FIND(\"-\",U18)),AI18<='export html'!$AR$7),\"\",SUBSTITUTE(_xlfn.TEXTBEFORE(U18,\"-\"),\"*\",\"\")-0)","v":5},{"$f":"IF(OR(ISERROR(FIND(\"-\",V18)),AJ18<='export html'!$AR$7),\"\",SUBSTITUTE(_xlfn.TEXTBEFORE(V18,\"-\"),\"*\",\"\")-0)","v":""},{"$f":"IF(OR(ISERROR(FIND(\"-\",W18)),AK18<='export html'!$AR$7),\"\",SUBSTITUTE(_xlfn.TEXTBEFORE(W18,\"-\"),\"*\",\"\")-0)","v":""},{"$f":"IF(OR(ISERROR(FIND(\"-\",X18)),AL18<='export html'!$AR$7),\"\",SUBSTITUTE(_xlfn.TEXTBEFORE(X18,\"-\"),\"*\",\"\")-0)","v":0},{"$f":"IF(OR(ISERROR(FIND(\"-\",Y18)),AM18<='export html'!$AR$7),\"\",SUBSTITUTE(_xlfn.TEXTBEFORE(Y18,\"-\"),\"*\",\"\")-0)","v":13},{"$f":"IF(OR(ISERROR(FIND(\"-\",Z18)),AN18<='export html'!$AR$7),\"\",SUBSTITUTE(_xlfn.TEXTBEFORE(Z18,\"-\"),\"*\",\"\")-0)","v":1},{"$f":"IF(OR(ISERROR(FIND(\"-\",AA18)),AO18<='export html'!$AR$7),\"\",SUBSTITUTE(_xlfn.TEXTBEFORE(AA18,\"-\"),\"*\",\"\")-0)","v":""},{"$f":"IF(OR(ISERROR(FIND(\"-\",AB18)),AP18<='export html'!$AR$7),\"\",SUBSTITUTE(_xlfn.TEXTBEFORE(AB18,\"-\"),\"*\",\"\")-0)","v":""},{"$f":"IF(OR(ISERROR(FIND(\"-\",AC18)),AQ18<='export html'!$AR$7),\"\",SUBSTITUTE(_xlfn.TEXTBEFORE(AC18,\"-\"),\"*\",\"\")-0)","v":""},null,14]
[null,null,null,null,null,null,null,null,null,null,null,null,null,null,null,null,null,"* regeling forfaits",null,null,null,null,null,null,null,null,null,null,null,null,null,null,null,null,null,null,null,null,null,null,null,null,null,null,null,null,null,null,null,null,null,null,null,null,null,null,null,null,null,null,null,null,null,null,null,null,null,null,null,null,null,null,null,null,1,2,3,4,5,6,7,8,9,10,11,12,13,14,null,1,2,3,4,5,6,7,8,9,10,11,12,13,14]
[null,null,null,null,null,null,null,null,null,null,null,null,null,null,null,null,null,null,null,null,null,null,null,null,null,null,null,null,null,null,null,null,null,null,null,null,null,null,null,null,null,null,null,null,null,null,null,null,null,null,null,null,null,null,null,null,null,null,null,null,null,null,null,null,null,null,null,null,null,null,null,null,null,1,null,{"$f":"IF(OR(ISERROR(FIND(\"-\",R5)),AF5>'export html'!$AR$7),\"\",SUBSTITUTE(_xlfn.TEXTAFTER(R5,\"-\"),\"*\",\"\")-0)","v":0},{"$f":"IF(OR(ISERROR(FIND(\"-\",S5)),AG5>'export html'!$AR$7),\"\",SUBSTITUTE(_xlfn.TEXTAFTER(S5,\"-\"),\"*\",\"\")-0)","v":3},{"$f":"IF(OR(ISERROR(FIND(\"-\",T5)),AH5>'export html'!$AR$7),\"\",SUBSTITUTE(_xlfn.TEXTAFTER(T5,\"-\"),\"*\",\"\")-0)","v":""},{"$f":"IF(OR(ISERROR(FIND(\"-\",U5)),AI5>'export html'!$AR$7),\"\",SUBSTITUTE(_xlfn.TEXTAFTER(U5,\"-\"),\"*\",\"\")-0)","v":""},{"$f":"IF(OR(ISERROR(FIND(\"-\",V5)),AJ5>'export html'!$AR$7),\"\",SUBSTITUTE(_xlfn.TEXTAFTER(V5,\"-\"),\"*\",\"\")-0)","v":2},{"$f":"IF(OR(ISERROR(FIND(\"-\",W5)),AK5>'export html'!$AR$7),\"\",SUBSTITUTE(_xlfn.TEXTAFTER(W5,\"-\"),\"*\",\"\")-0)","v":""},{"$f":"IF(OR(ISERROR(FIND(\"-\",X5)),AL5>'export html'!$AR$7),\"\",SUBSTITUTE(_xlfn.TEXTAFTER(X5,\"-\"),\"*\",\"\")-0)","v":""},{"$f":"IF(OR(ISERROR(FIND(\"-\",Y5)),AM5>'export html'!$AR$7),\"\",SUBSTITUTE(_xlfn.TEXTAFTER(Y5,\"-\"),\"*\",\"\")-0)","v":1},{"$f":"IF(OR(ISERROR(FIND(\"-\",Z5)),AN5>'export html'!$AR$7),\"\",SUBSTITUTE(_xlfn.TEXTAFTER(Z5,\"-\"),\"*\",\"\")-0)","v":""},{"$f":"IF(OR(ISERROR(FIND(\"-\",AA5)),AO5>'export html'!$AR$7),\"\",SUBSTITUTE(_xlfn.TEXTAFTER(AA5,\"-\"),\"*\",\"\")-0)","v":""},{"$f":"IF(OR(ISERROR(FIND(\"-\",AB5)),AP5>'export html'!$AR$7),\"\",SUBSTITUTE(_xlfn.TEXTAFTER(AB5,\"-\"),\"*\",\"\")-0)","v":0},{"$f":"IF(OR(ISERROR(FIND(\"-\",AC5)),AQ5>'export html'!$AR$7),\"\",SUBSTITUTE(_xlfn.TEXTAFTER(AC5,\"-\"),\"*\",\"\")-0)","v":1},{"$f":"IF(OR(ISERROR(FIND(\"-\",AD5)),AR5>'export html'!$AR$7),\"\",SUBSTITUTE(_xlfn.TEXTAFTER(AD5,\"-\"),\"*\",\"\")-0)","v":2},1,null,{"$f":"IF(OR(ISERROR(FIND(\"-\",R5)),AF5<='export html'!$AR$7),\"\",SUBSTITUTE(_xlfn.TEXTAFTER(R5,\"-\"),\"*\",\"\")-0)","v":""},{"$f":"IF(OR(ISERROR(FIND(\"-\",S5)),AG5<='export html'!$AR$7),\"\",SUBSTITUTE(_xlfn.TEXTAFTER(S5,\"-\"),\"*\",\"\")-0)","v":""},{"$f":"IF(OR(ISERROR(FIND(\"-\",T5)),AH5<='export html'!$AR$7),\"\",SUBSTITUTE(_xlfn.TEXTAFTER(T5,\"-\"),\"*\",\"\")-0)","v":1},{"$f":"IF(OR(ISERROR(FIND(\"-\",U5)),AI5<='export html'!$AR$7),\"\",SUBSTITUTE(_xlfn.TEXTAFTER(U5,\"-\"),\"*\",\"\")-0)","v":0},{"$f":"IF(OR(ISERROR(FIND(\"-\",V5)),AJ5<='export html'!$AR$7),\"\",SUBSTITUTE(_xlfn.TEXTAFTER(V5,\"-\"),\"*\",\"\")-0)","v":""},{"$f":"IF(OR(ISERROR(FIND(\"-\",W5)),AK5<='export html'!$AR$7),\"\",SUBSTITUTE(_xlfn.TEXTAFTER(W5,\"-\"),\"*\",\"\")-0)","v":0},{"$f":"IF(OR(ISERROR(FIND(\"-\",X5)),AL5<='export html'!$AR$7),\"\",SUBSTITUTE(_xlfn.TEXTAFTER(X5,\"-\"),\"*\",\"\")-0)","v":2},{"$f":"IF(OR(ISERROR(FIND(\"-\",Y5)),AM5<='export html'!$AR$7),\"\",SUBSTITUTE(_xlfn.TEXTAFTER(Y5,\"-\"),\"*\",\"\")-0)","v":""},{"$f":"IF(OR(ISERROR(FIND(\"-\",Z5)),AN5<='export html'!$AR$7),\"\",SUBSTITUTE(_xlfn.TEXTAFTER(Z5,\"-\"),\"*\",\"\")-0)","v":5},{"$f":"IF(OR(ISERROR(FIND(\"-\",AA5)),AO5<='export html'!$AR$7),\"\",SUBSTITUTE(_xlfn.TEXTAFTER(AA5,\"-\"),\"*\",\"\")-0)","v":0},{"$f":"IF(OR(ISERROR(FIND(\"-\",AB5)),AP5<='export html'!$AR$7),\"\",SUBSTITUTE(_xlfn.TEXTAFTER(AB5,\"-\"),\"*\",\"\")-0)","v":""},{"$f":"IF(OR(ISERROR(FIND(\"-\",AC5)),AQ5<='export html'!$AR$7),\"\",SUBSTITUTE(_xlfn.TEXTAFTER(AC5,\"-\"),\"*\",\"\")-0)","v":""},{"$f":"IF(OR(ISERROR(FIND(\"-\",AD5)),AR5<='export html'!$AR$7),\"\",SUBSTITUTE(_xlfn.TEXTAFTER(AD5,\"-\"),\"*\",\"\")-0)","v":""},1]
[null,null,null,null,{"$f":"'export html'!V1","v":"Recentste duels op "},"2025-04-02",null,null,null,null,null,null,null,null,null,null,"Topschutters:",null,null,{"$f":"\"(na \" & COUNTIF( spelersstatistieken!AP49:BO49, \">0\" ) & \" match\" & IF( COUNTIF( spelersstatistieken!AP49:BO49, \">0\" ) = 1, \"\", \"en\" ) & \")\"","v":"(na 21 matchen)"},null,null,null,null,null,"Man van het Seizoen:",null,null,null,{"$f":"T21","v":"(na 21 matchen)"},null,null,null,null,null,null,null,null,null,null,null,null,null,null,null,null,null,null,null,null,null,null,null,null,null,null,null,null,null,null,null,null,null,null,null,null,null,null,null,null,null,null,null,2,{"$f":"IF(OR(ISERROR(FIND(\"-\",Q6)),AE6>'export html'!$AR$7),\"\",SUBSTITUTE(_xlfn.TEXTAFTER(Q6,\"-\"),\"*\",\"\")-0)","v":""},null,{"$f":"IF(OR(ISERROR(FIND(\"-\",S6)),AG6>'export html'!$AR$7),\"\",SUBSTITUTE(_xlfn.TEXTAFTER(S6,\"-\"),\"*\",\"\")-0)","v":""},{"$f":"IF(OR(ISERROR(FIND(\"-\",T6)),AH6>'export html'!$AR$7),\"\",SUBSTITUTE(_xlfn.TEXTAFTER(T6,\"-\"),\"*\",\"\")-0)","v":""},{"$f":"IF(OR(ISERROR(FIND(\"-\",U6)),AI6>'export html'!$AR$7),\"\",SUBSTITUTE(_xlfn.TEXTAFTER(U6,\"-\"),\"*\",\"\")-0)","v":""},{"$f":"IF(OR(ISERROR(FIND(\"-\",V6)),AJ6>'export html'!$AR$7),\"\",SUBSTITUTE(_xlfn.TEXTAFTER(V6,\"-\"),\"*\",\"\")-0)","v":4},{"$f":"IF(OR(ISERROR(FIND(\"-\",W6)),AK6>'export html'!$AR$7),\"\",SUBSTITUTE(_xlfn.TEXTAFTER(W6,\"-\"),\"*\",\"\")-0)","v":1},{"$f":"IF(OR(ISERROR(FIND(\"-\",X6)),AL6>'export html'!$AR$7),\"\",SUBSTITUTE(_xlfn.TEXTAFTER(X6,\"-\"),\"*\",\"\")-0)","v":""},{"$f":"IF(OR(ISERROR(FIND(\"-\",Y6)),AM6>'export html'!$AR$7),\"\",SUBSTITUTE(_xlfn.TEXTAFTER(Y6,\"-\"),\"*\",\"\")-0)","v":0},{"$f":"IF(OR(ISERROR(FIND(\"-\",Z6)),AN6>'export html'!$AR$7),\"\",SUBSTITUTE(_xlfn.TEXTAFTER(Z6,\"-\"),\"*\",\"\")-0)","v":""},{"$f":"IF(OR(ISERROR(FIND(\"-\",AA6)),AO6>'export html'!$AR$7),\"\",SUBSTITUTE(_xlfn.TEXTAFTER(AA6,\"-\"),\"*\",\"\")-0)","v":3},{"$f":"IF(OR(ISERROR(FIND(\"-\",AB6)),AP6>'export html'!$AR$7),\"\",SUBSTITUTE(_xlfn.TEXTAFTER(AB6,\"-\"),\"*\",\"\")-0)","v":4},{"$f":"IF(OR(ISERROR(FIND(\"-\",AC6)),AQ6>'export html'!$AR$7),\"\",SUBSTITUTE(_xlfn.TEXTAFTER(AC6,\"-\"),\"*\",\"\")-0)","v":1},{"$f":"IF(OR(ISERROR(FIND(\"-\",AD6)),AR6>'export html'!$AR$7),\"\",SUBSTITUTE(_xlfn.TEXTAFTER(AD6,\"-\"),\"*\",\"\")-0)","v":4},2,{"$f":"IF(OR(ISERROR(FIND(\"-\",Q6)),AE6<='export html'!$AR$7),\"\",SUBSTITUTE(_xlfn.TEXTAFTER(Q6,\"-\"),\"*\",\"\")-0)","v":2},null,{"$f":"IF(OR(ISERROR(FIND(\"-\",S6)),AG6<='export html'!$AR$7),\"\",SUBSTITUTE(_xlfn.TEXTAFTER(S6,\"-\"),\"*\",\"\")-0)","v":2},{"$f":"IF(OR(ISERROR(FIND(\"-\",T6)),AH6<='export html'!$AR$7),\"\",SUBSTITUTE(_xlfn.TEXTAFTER(T6,\"-\"),\"*\",\"\")-0)","v":1},{"$f":"IF(OR(ISERROR(FIND(\"-\",U6)),AI6<='export html'!$AR$7),\"\",SUBSTITUTE(_xlfn.TEXTAFTER(U6,\"-\"),\"*\",\"\")-0)","v":2},{"$f":"IF(OR(ISERROR(FIND(\"-\",V6)),AJ6<='export html'!$AR$7),\"\",SUBSTITUTE(_xlfn.TEXTAFTER(V6,\"-\"),\"*\",\"\")-0)","v":""},{"$f":"IF(OR(ISERROR(FIND(\"-\",W6)),AK6<='export html'!$AR$7),\"\",SUBSTITUTE(_xlfn.TEXTAFTER(W6,\"-\"),\"*\",\"\")-0)","v":""},{"$f":"IF(OR(ISERROR(FIND(\"-\",X6)),AL6<='export html'!$AR$7),\"\",SUBSTITUTE(_xlfn.TEXTAFTER(X6,\"-\"),\"*\",\"\")-0)","v":1},{"$f":"IF(OR(ISERROR(FIND(\"-\",Y6)),AM6<='export html'!$AR$7),\"\",SUBSTITUTE(_xlfn.TEXTAFTER(Y6,\"-\"),\"*\",\"\")-0)","v":""},{"$f":"IF(OR(ISERROR(FIND(\"-\",Z6)),AN6<='export html'!$AR$7),\"\",SUBSTITUTE(_xlfn.TEXTAFTER(Z6,\"-\"),\"*\",\"\")-0)","v":0},{"$f":"IF(OR(ISERROR(FIND(\"-\",AA6)),AO6<='export html'!$AR$7),\"\",SUBSTITUTE(_xlfn.TEXTAFTER(AA6,\"-\"),\"*\",\"\")-0)","v":""},{"$f":"IF(OR(ISERROR(FIND(\"-\",AB6)),AP6<='export html'!$AR$7),\"\",SUBSTITUTE(_xlfn.TEXTAFTER(AB6,\"-\"),\"*\",\"\")-0)","v":""},{"$f":"IF(OR(ISERROR(FIND(\"-\",AC6)),AQ6<='export html'!$AR$7),\"\",SUBSTITUTE(_xlfn.TEXTAFTER(AC6,\"-\"),\"*\",\"\")-0)","v":""},{"$f":"IF(OR(ISERROR(FIND(\"-\",AD6)),AR6<='export html'!$AR$7),\"\",SUBSTITUTE(_xlfn.TEXTAFTER(AD6,\"-\"),\"*\",\"\")-0)","v":""},2]
[null,null,null,null,null,null,null,null,null,null,null,null,null,null,null,null,null,null,null,null,null,null,null,null,null,null,null,null,null,null,null,null,null,null,null,null,null,null,null,null,null,null,null,null,null,null,null,null,null,null,null,null,null,null,null,null,null,null,null,null,null,null,null,null,null,null,null,null,null,null,null,null,null,3,{"$f":"IF(OR(ISERROR(FIND(\"-\",Q7)),AE7>'export html'!$AR$7),\"\",SUBSTITUTE(_xlfn.TEXTAFTER(Q7,\"-\"),\"*\",\"\")-0)","v":""},{"$f":"IF(OR(ISERROR(FIND(\"-\",R7)),AF7>'export html'!$AR$7),\"\",SUBSTITUTE(_xlfn.TEXTAFTER(R7,\"-\"),\"*\",\"\")-0)","v":2},null,{"$f":"IF(OR(ISERROR(FIND(\"-\",T7)),AH7>'export html'!$AR$7),\"\",SUBSTITUTE(_xlfn.TEXTAFTER(T7,\"-\"),\"*\",\"\")-0)","v":""},{"$f":"IF(OR(ISERROR(FIND(\"-\",U7)),AI7>'export html'!$AR$7),\"\",SUBSTITUTE(_xlfn.TEXTAFTER(U7,\"-\"),\"*\",\"\")-0)","v":""},{"$f":"IF(OR(ISERROR(FIND(\"-\",V7)),AJ7>'export html'!$AR$7),\"\",SUBSTITUTE(_xlfn.TEXTAFTER(V7,\"-\"),\"*\",\"\")-0)","v":1},{"$f":"IF(OR(ISERROR(FIND(\"-\",W7)),AK7>'export html'!$AR$7),\"\",SUBSTITUTE(_xlfn.TEXTAFTER(W7,\"-\"),\"*\",\"\")-0)","v":2},{"$f":"IF(OR(ISERROR(FIND(\"-\",X7)),AL7>'export html'!$AR$7),\"\",SUBSTITUTE(_xlfn.TEXTAFTER(X7,\"-\"),\"*\",\"\")-0)","v":""},{"$f":"IF(OR(ISERROR(FIND(\"-\",Y7)),AM7>'export html'!$AR$7),\"\",SUBSTITUTE(_xlfn.TEXTAFTER(Y7,\"-\"),\"*\",\"\")-0)","v":0},{"$f":"IF(OR(ISERROR(FIND(\"-\",Z7)),AN7>'export html'!$AR$7),\"\",SUBSTITUTE(_xlfn.TEXTAFTER(Z7,\"-\"),\"*\",\"\")-0)","v":""},{"$f":"IF(OR(ISERROR(FIND(\"-\",AA7)),AO7>'export html'!$AR$7),\"\",SUBSTITUTE(_xlfn.TEXTAFTER(AA7,\"-\"),\"*\",\"\")-0)","v":""},{"$f":"IF(OR(ISERROR(FIND(\"-\",AB7)),AP7>'export html'!$AR$7),\"\",SUBSTITUTE(_xlfn.TEXTAFTER(AB7,\"-\"),\"*\",\"\")-0)","v":6},{"$f":"IF(OR(ISERROR(FIND(\"-\",AC7)),AQ7>'export html'!$AR$7),\"\",SUBSTITUTE(_xlfn.TEXTAFTER(AC7,\"-\"),\"*\",\"\")-0)","v":3},{"$f":"IF(OR(ISERROR(FIND(\"-\",AD7)),AR7>'export html'!$AR$7),\"\",SUBSTITUTE(_xlfn.TEXTAFTER(AD7,\"-\"),\"*\",\"\")-0)","v":4},3,{"$f":"IF(OR(ISERROR(FIND(\"-\",Q7)),AE7<='export html'!$AR$7),\"\",SUBSTITUTE(_xlfn.TEXTAFTER(Q7,\"-\"),\"*\",\"\")-0)","v":5},{"$f":"IF(OR(ISERROR(FIND(\"-\",R7)),AF7<='export html'!$AR$7),\"\",SUBSTITUTE(_xlfn.TEXTAFTER(R7,\"-\"),\"*\",\"\")-0)","v":""},null,{"$f":"IF(OR(ISERROR(FIND(\"-\",T7)),AH7<='export html'!$AR$7),\"\",SUBSTITUTE(_xlfn.TEXTAFTER(T7,\"-\"),\"*\",\"\")-0)","v":0},{"$f":"IF(OR(ISERROR(FIND(\"-\",U7)),AI7<='export html'!$AR$7),\"\",SUBSTITUTE(_xlfn.TEXTAFTER(U7,\"-\"),\"*\",\"\")-0)","v":1},{"$f":"IF(OR(ISERROR(FIND(\"-\",V7)),AJ7<='export html'!$AR$7),\"\",SUBSTITUTE(_xlfn.TEXTAFTER(V7,\"-\"),\"*\",\"\")-0)","v":""},{"$f":"IF(OR(ISERROR(FIND(\"-\",W7)),AK7<='export html'!$AR$7),\"\",SUBSTITUTE(_xlfn.TEXTAFTER(W7,\"-\"),\"*\",\"\")-0)","v":""},{"$f":"IF(OR(ISERROR(FIND(\"-\",X7)),AL7<='export html'!$AR$7),\"\",SUBSTITUTE(_xlfn.TEXTAFTER(X7,\"-\"),\"*\",\"\")-0)","v":1},{"$f":"IF(OR(ISERROR(FIND(\"-\",Y7)),AM7<='export html'!$AR$7),\"\",SUBSTITUTE(_xlfn.TEXTAFTER(Y7,\"-\"),\"*\",\"\")-0)","v":""},{"$f":"IF(OR(ISERROR(FIND(\"-\",Z7)),AN7<='export html'!$AR$7),\"\",SUBSTITUTE(_xlfn.TEXTAFTER(Z7,\"-\"),\"*\",\"\")-0)","v":3},{"$f":"IF(OR(ISERROR(FIND(\"-\",AA7)),AO7<='export html'!$AR$7),\"\",SUBSTITUTE(_xlfn.TEXTAFTER(AA7,\"-\"),\"*\",\"\")-0)","v":2},{"$f":"IF(OR(ISERROR(FIND(\"-\",AB7)),AP7<='export html'!$AR$7),\"\",SUBSTITUTE(_xlfn.TEXTAFTER(AB7,\"-\"),\"*\",\"\")-0)","v":""},{"$f":"IF(OR(ISERROR(FIND(\"-\",AC7)),AQ7<='export html'!$AR$7),\"\",SUBSTITUTE(_xlfn.TEXTAFTER(AC7,\"-\"),\"*\",\"\")-0)","v":""},{"$f":"IF(OR(ISERROR(FIND(\"-\",AD7)),AR7<='export html'!$AR$7),\"\",SUBSTITUTE(_xlfn.TEXTAFTER(AD7,\"-\"),\"*\",\"\")-0)","v":""},3]
[null,null,null,{"$f":"IF('export html'!T3=\"\",\"\",'export html'!T3)","v":"2025-03-30"},{"$f":"IF('export html'!U3=\"\",\"\",'export html'!U3)","v":25},{"$f":"IF('export html'!V3=\"\",\"\",'export html'!V3)","v":"Antwerp Global - Lucyvo"},null,null,null,null,null,null,null,{"$f":"IF('export html'!W3=\"\",\"\",'export html'!W3)","v":"4-0"},null,null,{"$f":"_xlfn.CHOOSECOLS(_xlfn.ANCHORARRAY( 'export html'!AF3), 2, 1 )","v":29},"Glenn De Vinster",null,null,null,null,null,null,null,{"$f":"_xlfn.CHOOSECOLS(_xlfn.ANCHORARRAY( spelersstatistieken!AK350), 2, 1 )","v":243.6371292106586},"Glenn De Vinster",null,null,null,null,null,null,null,null,null,null,null,null,null,null,null,null,null,null,null,null,null,null,null,null,null,null,null,null,null,null,null,null,null,null,null,null,null,null,null,null,null,null,null,null,null,null,4,{"$f":"IF(OR(ISERROR(FIND(\"-\",Q8)),AE8>'export html'!$AR$7),\"\",SUBSTITUTE(_xlfn.TEXTAFTER(Q8,\"-\"),\"*\",\"\")-0)","v":1},{"$f":"IF(OR(ISERROR(FIND(\"-\",R8)),AF8>'export html'!$AR$7),\"\",SUBSTITUTE(_xlfn.TEXTAFTER(R8,\"-\"),\"*\",\"\")-0)","v":7},{"$f":"IF(OR(ISERROR(FIND(\"-\",S8)),AG8>'export html'!$AR$7),\"\",SUBSTITUTE(_xlfn.TEXTAFTER(S8,\"-\"),\"*\",\"\")-0)","v":7},null,{"$f":"IF(OR(ISERROR(FIND(\"-\",U8)),AI8>'export html'!$AR$7),\"\",SUBSTITUTE(_xlfn.TEXTAFTER(U8,\"-\"),\"*\",\"\")-0)","v":2},{"$f":"IF(OR(ISERROR(FIND(\"-\",V8)),AJ8>'export html'!$AR$7),\"\",SUBSTITUTE(_xlfn.TEXTAFTER(V8,\"-\"),\"*\",\"\")-0)","v":""},{"$f":"IF(OR(ISERROR(FIND(\"-\",W8)),AK8>'export html'!$AR$7),\"\",SUBSTITUTE(_xlfn.TEXTAFTER(W8,\"-\"),\"*\",\"\")-0)","v":""},{"$f":"IF(OR(ISERROR(FIND(\"-\",X8)),AL8>'export html'!$AR$7),\"\",SUBSTITUTE(_xlfn.TEXTAFTER(X8,\"-\"),\"*\",\"\")-0)","v":5},{"$f":"IF(OR(ISERROR(FIND(\"-\",Y8)),AM8>'export html'!$AR$7),\"\",SUBSTITUTE(_xlfn.TEXTAFTER(Y8,\"-\"),\"*\",\"\")-0)","v":1},{"$f":"IF(OR(ISERROR(FIND(\"-\",Z8)),AN8>'export html'!$AR$7),\"\",SUBSTITUTE(_xlfn.TEXTAFTER(Z8,\"-\"),\"*\",\"\")-0)","v":1},{"$f":"IF(OR(ISERROR(FIND(\"-\",AA8)),AO8>'export html'!$AR$7),\"\",SUBSTITUTE(_xlfn.TEXTAFTER(AA8,\"-\"),\"*\",\"\")-0)","v":""},{"$f":"IF(OR(ISERROR(FIND(\"-\",AB8)),AP8>'export html'!$AR$7),\"\",SUBSTITUTE(_xlfn.TEXTAFTER(AB8,\"-\"),\"*\",\"\")-0)","v":""},{"$f":"IF(OR(ISERROR(FIND(\"-\",AC8)),AQ8>'export html'!$AR$7),\"\",SUBSTITUTE(_xlfn.TEXTAFTER(AC8,\"-\"),\"*\",\"\")-0)","v":""},{"$f":"IF(OR(ISERROR(FIND(\"-\",AD8)),AR8>'export html'!$AR$7),\"\",SUBSTITUTE(_xlfn.TEXTAFTER(AD8,\"-\"),\"*\",\"\")-0)","v":""},4,{"$f":"IF(OR(ISERROR(FIND(\"-\",Q8)),AE8<='export html'!$AR$7),\"\",SUBSTITUTE(_xlfn.TEXTAFTER(Q8,\"-\"),\"*\",\"\")-0)","v":""},{"$f":"IF(OR(ISERROR(FIND(\"-\",R8)),AF8<='export html'!$AR$7),\"\",SUBSTITUTE(_xlfn.TEXTAFTER(R8,\"-\"),\"*\",\"\")-0)","v":""},{"$f":"IF(OR(ISERROR(FIND(\"-\",S8)),AG8<='export html'!$AR$7),\"\",SUBSTITUTE(_xlfn.TEXTAFTER(S8,\"-\"),\"*\",\"\")-0)","v":""},null,{"$f":"IF(OR(ISERROR(FIND(\"-\",U8)),AI8<='export html'!$AR$7),\"\",SUBSTITUTE(_xlfn.TEXTAFTER(U8,\"-\"),\"*\",\"\")-0)","v":""},{"$f":"IF(OR(ISERROR(FIND(\"-\",V8)),AJ8<='export html'!$AR$7),\"\",SUBSTITUTE(_xlfn.TEXTAFTER(V8,\"-\"),\"*\",\"\")-0)","v":10},{"$f":"IF(OR(ISERROR(FIND(\"-\",W8)),AK8<='export html'!$AR$7),\"\",SUBSTITUTE(_xlfn.TEXTAFTER(W8,\"-\"),\"*\",\"\")-0)","v":3},{"$f":"IF(OR(ISERROR(FIND(\"-\",X8)),AL8<='export html'!$AR$7),\"\",SUBSTITUTE(_xlfn.TEXTAFTER(X8,\"-\"),\"*\",\"\")-0)","v":""},{"$f":"IF(OR(ISERROR(FIND(\"-\",Y8)),AM8<='export html'!$AR$7),\"\",SUBSTITUTE(_xlfn.TEXTAFTER(Y8,\"-\"),\"*\",\"\")-0)","v":""},{"$f":"IF(OR(ISERROR(FIND(\"-\",Z8)),AN8<='export html'!$AR$7),\"\",SUBSTITUTE(_xlfn.TEXTAFTER(Z8,\"-\"),\"*\",\"\")-0)","v":""},{"$f":"IF(OR(ISERROR(FIND(\"-\",AA8)),AO8<='export html'!$AR$7),\"\",SUBSTITUTE(_xlfn.TEXTAFTER(AA8,\"-\"),\"*\",\"\")-0)","v":4},{"$f":"IF(OR(ISERROR(FIND(\"-\",AB8)),AP8<='export html'!$AR$7),\"\",SUBSTITUTE(_xlfn.TEXTAFTER(AB8,\"-\"),\"*\",\"\")-0)","v":1},{"$f":"IF(OR(ISERROR(FIND(\"-\",AC8)),AQ8<='export html'!$AR$7),\"\",SUBSTITUTE(_xlfn.TEXTAFTER(AC8,\"-\"),\"*\",\"\")-0)","v":0},{"$f":"IF(OR(ISERROR(FIND(\"-\",AD8)),AR8<='export html'!$AR$7),\"\",SUBSTITUTE(_xlfn.TEXTAFTER(AD8,\"-\"),\"*\",\"\")-0)","v":4},4]
[null,null,null,{"$f":"IF('export html'!T4=\"\",\"\",'export html'!T4)","v":"2025-03-23"},{"$f":"IF('export html'!U4=\"\",\"\",'export html'!U4)","v":24},{"$f":"IF('export html'!V4=\"\",\"\",'export html'!V4)","v":"Lucyvo - Bariton"},null,null,null,null,null,null,null,{"$f":"IF('export html'!W4=\"\",\"\",'export html'!W4)","v":"2-1"},null,null,18,"Stijn Hofmans",null,null,null,null,null,null,null,166.12033477358554,"Stijn Hofmans",null,null,null,null,null,null,null,null,null,null,null,null,null,null,null,null,null,null,null,null,null,null,null,null,null,null,null,null,null,null,null,null,null,null,null,null,null,null,null,null,null,null,null,null,null,null,5,{"$f":"IF(OR(ISERROR(FIND(\"-\",Q9)),AE9>'export html'!$AR$7),\"\",SUBSTITUTE(_xlfn.TEXTAFTER(Q9,\"-\"),\"*\",\"\")-0)","v":3},{"$f":"IF(OR(ISERROR(FIND(\"-\",R9)),AF9>'export html'!$AR$7),\"\",SUBSTITUTE(_xlfn.TEXTAFTER(R9,\"-\"),\"*\",\"\")-0)","v":4},{"$f":"IF(OR(ISERROR(FIND(\"-\",S9)),AG9>'export html'!$AR$7),\"\",SUBSTITUTE(_xlfn.TEXTAFTER(S9,\"-\"),\"*\",\"\")-0)","v":1},{"$f":"IF(OR(ISERROR(FIND(\"-\",T9)),AH9>'export html'!$AR$7),\"\",SUBSTITUTE(_xlfn.TEXTAFTER(T9,\"-\"),\"*\",\"\")-0)","v":""},null,{"$f":"IF(OR(ISERROR(FIND(\"-\",V9)),AJ9>'export html'!$AR$7),\"\",SUBSTITUTE(_xlfn.TEXTAFTER(V9,\"-\"),\"*\",\"\")-0)","v":""},{"$f":"IF(OR(ISERROR(FIND(\"-\",W9)),AK9>'export html'!$AR$7),\"\",SUBSTITUTE(_xlfn.TEXTAFTER(W9,\"-\"),\"*\",\"\")-0)","v":""},{"$f":"IF(OR(ISERROR(FIND(\"-\",X9)),AL9>'export html'!$AR$7),\"\",SUBSTITUTE(_xlfn.TEXTAFTER(X9,\"-\"),\"*\",\"\")-0)","v":5},{"$f":"IF(OR(ISERROR(FIND(\"-\",Y9)),AM9>'export html'!$AR$7),\"\",SUBSTITUTE(_xlfn.TEXTAFTER(Y9,\"-\"),\"*\",\"\")-0)","v":""},{"$f":"IF(OR(ISERROR(FIND(\"-\",Z9)),AN9>'export html'!$AR$7),\"\",SUBSTITUTE(_xlfn.TEXTAFTER(Z9,\"-\"),\"*\",\"\")-0)","v":""},{"$f":"IF(OR(ISERROR(FIND(\"-\",AA9)),AO9>'export html'!$AR$7),\"\",SUBSTITUTE(_xlfn.TEXTAFTER(AA9,\"-\"),\"*\",\"\")-0)","v":""},{"$f":"IF(OR(ISERROR(FIND(\"-\",AB9)),AP9>'export html'!$AR$7),\"\",SUBSTITUTE(_xlfn.TEXTAFTER(AB9,\"-\"),\"*\",\"\")-0)","v":10},{"$f":"IF(OR(ISERROR(FIND(\"-\",AC9)),AQ9>'export html'!$AR$7),\"\",SUBSTITUTE(_xlfn.TEXTAFTER(AC9,\"-\"),\"*\",\"\")-0)","v":""},{"$f":"IF(OR(ISERROR(FIND(\"-\",AD9)),AR9>'export html'!$AR$7),\"\",SUBSTITUTE(_xlfn.TEXTAFTER(AD9,\"-\"),\"*\",\"\")-0)","v":6},5,{"$f":"IF(OR(ISERROR(FIND(\"-\",Q9)),AE9<='export html'!$AR$7),\"\",SUBSTITUTE(_xlfn.TEXTAFTER(Q9,\"-\"),\"*\",\"\")-0)","v":""},{"$f":"IF(OR(ISERROR(FIND(\"-\",R9)),AF9<='export html'!$AR$7),\"\",SUBSTITUTE(_xlfn.TEXTAFTER(R9,\"-\"),\"*\",\"\")-0)","v":""},{"$f":"IF(OR(ISERROR(FIND(\"-\",S9)),AG9<='export html'!$AR$7),\"\",SUBSTITUTE(_xlfn.TEXTAFTER(S9,\"-\"),\"*\",\"\")-0)","v":""},{"$f":"IF(OR(ISERROR(FIND(\"-\",T9)),AH9<='export html'!$AR$7),\"\",SUBSTITUTE(_xlfn.TEXTAFTER(T9,\"-\"),\"*\",\"\")-0)","v":1},null,{"$f":"IF(OR(ISERROR(FIND(\"-\",V9)),AJ9<='export html'!$AR$7),\"\",SUBSTITUTE(_xlfn.TEXTAFTER(V9,\"-\"),\"*\",\"\")-0)","v":9},{"$f":"IF(OR(ISERROR(FIND(\"-\",W9)),AK9<='export html'!$AR$7),\"\",SUBSTITUTE(_xlfn.TEXTAFTER(W9,\"-\"),\"*\",\"\")-0)","v":""},{"$f":"IF(OR(ISERROR(FIND(\"-\",X9)),AL9<='export html'!$AR$7),\"\",SUBSTITUTE(_xlfn.TEXTAFTER(X9,\"-\"),\"*\",\"\")-0)","v":""},{"$f":"IF(OR(ISERROR(FIND(\"-\",Y9)),AM9<='export html'!$AR$7),\"\",SUBSTITUTE(_xlfn.TEXTAFTER(Y9,\"-\"),\"*\",\"\")-0)","v":1},{"$f":"IF(OR(ISERROR(FIND(\"-\",Z9)),AN9<='export html'!$AR$7),\"\",SUBSTITUTE(_xlfn.TEXTAFTER(Z9,\"-\"),\"*\",\"\")-0)","v":0},{"$f":"IF(OR(ISERROR(FIND(\"-\",AA9)),AO9<='export html'!$AR$7),\"\",SUBSTITUTE(_xlfn.TEXTAFTER(AA9,\"-\"),\"*\",\"\")-0)","v":5},{"$f":"IF(OR(ISERROR(FIND(\"-\",AB9)),AP9<='export html'!$AR$7),\"\",SUBSTITUTE(_xlfn.TEXTAFTER(AB9,\"-\"),\"*\",\"\")-0)","v":""},{"$f":"IF(OR(ISERROR(FIND(\"-\",AC9)),AQ9<='export html'!$AR$7),\"\",SUBSTITUTE(_xlfn.TEXTAFTER(AC9,\"-\"),\"*\",\"\")-0)","v":2},{"$f":"IF(OR(ISERROR(FIND(\"-\",AD9)),AR9<='export html'!$AR$7),\"\",SUBSTITUTE(_xlfn.TEXTAFTER(AD9,\"-\"),\"*\",\"\")-0)","v":""},5]
[null,null,null,{"$f":"IF('export html'!T5=\"\",\"\",'export html'!T5)","v":"2025-03-16"},{"$f":"IF('export html'!U5=\"\",\"\",'export html'!U5)","v":23},{"$f":"IF('export html'!V5=\"\",\"\",'export html'!V5)","v":"Yerevan United - Lucyvo"},null,null,null,null,null,null,null,{"$f":"IF('export html'!W5=\"\",\"\",'export html'!W5)","v":"1-7"},null,null,3,"Jorn Verhellen",null,null,null,null,null,null,null,155.52707844271313,"Kaïn Verlooy",null,null,null,null,null,null,null,null,null,null,null,null,null,null,null,null,null,null,null,null,null,null,null,null,null,null,null,null,null,null,null,null,null,null,null,null,null,null,null,null,null,null,null,null,null,null,6,{"$f":"IF(OR(ISERROR(FIND(\"-\",Q10)),AE10>'export html'!$AR$7),\"\",SUBSTITUTE(_xlfn.TEXTAFTER(Q10,\"-\"),\"*\",\"\")-0)","v":""},{"$f":"IF(OR(ISERROR(FIND(\"-\",R10)),AF10>'export html'!$AR$7),\"\",SUBSTITUTE(_xlfn.TEXTAFTER(R10,\"-\"),\"*\",\"\")-0)","v":""},{"$f":"IF(OR(ISERROR(FIND(\"-\",S10)),AG10>'export html'!$AR$7),\"\",SUBSTITUTE(_xlfn.TEXTAFTER(S10,\"-\"),\"*\",\"\")-0)","v":""},{"$f":"IF(OR(ISERROR(FIND(\"-\",T10)),AH10>'export html'!$AR$7),\"\",SUBSTITUTE(_xlfn.TEXTAFTER(T10,\"-\"),\"*\",\"\")-0)","v":0},{"$f":"IF(OR(ISERROR(FIND(\"-\",U10)),AI10>'export html'!$AR$7),\"\",SUBSTITUTE(_xlfn.TEXTAFTER(U10,\"-\"),\"*\",\"\")-0)","v":0},null,{"$f":"IF(OR(ISERROR(FIND(\"-\",W10)),AK10>'export html'!$AR$7),\"\",SUBSTITUTE(_xlfn.TEXTAFTER(W10,\"-\"),\"*\",\"\")-0)","v":0},{"$f":"IF(OR(ISERROR(FIND(\"-\",X10)),AL10>'export html'!$AR$7),\"\",SUBSTITUTE(_xlfn.TEXTAFTER(X10,\"-\"),\"*\",\"\")-0)","v":""},{"$f":"IF(OR(ISERROR(FIND(\"-\",Y10)),AM10>'export html'!$AR$7),\"\",SUBSTITUTE(_xlfn.TEXTAFTER(Y10,\"-\"),\"*\",\"\")-0)","v":""},{"$f":"IF(OR(ISERROR(FIND(\"-\",Z10)),AN10>'export html'!$AR$7),\"\",SUBSTITUTE(_xlfn.TEXTAFTER(Z10,\"-\"),\"*\",\"\")-0)","v":0},{"$f":"IF(OR(ISERROR(FIND(\"-\",AA10)),AO10>'export html'!$AR$7),\"\",SUBSTITUTE(_xlfn.TEXTAFTER(AA10,\"-\"),\"*\",\"\")-0)","v":2},{"$f":"IF(OR(ISERROR(FIND(\"-\",AB10)),AP10>'export html'!$AR$7),\"\",SUBSTITUTE(_xlfn.TEXTAFTER(AB10,\"-\"),\"*\",\"\")-0)","v":""},{"$f":"IF(OR(ISERROR(FIND(\"-\",AC10)),AQ10>'export html'!$AR$7),\"\",SUBSTITUTE(_xlfn.TEXTAFTER(AC10,\"-\"),\"*\",\"\")-0)","v":1},{"$f":"IF(OR(ISERROR(FIND(\"-\",AD10)),AR10>'export html'!$AR$7),\"\",SUBSTITUTE(_xlfn.TEXTAFTER(AD10,\"-\"),\"*\",\"\")-0)","v":""},6,{"$f":"IF(OR(ISERROR(FIND(\"-\",Q10)),AE10<='export html'!$AR$7),\"\",SUBSTITUTE(_xlfn.TEXTAFTER(Q10,\"-\"),\"*\",\"\")-0)","v":""},{"$f":"IF(OR(ISERROR(FIND(\"-\",R10)),AF10<='export html'!$AR$7),\"\",SUBSTITUTE(_xlfn.TEXTAFTER(R10,\"-\"),\"*\",\"\")-0)","v":0},{"$f":"IF(OR(ISERROR(FIND(\"-\",S10)),AG10<='export html'!$AR$7),\"\",SUBSTITUTE(_xlfn.TEXTAFTER(S10,\"-\"),\"*\",\"\")-0)","v":1},{"$f":"IF(OR(ISERROR(FIND(\"-\",T10)),AH10<='export html'!$AR$7),\"\",SUBSTITUTE(_xlfn.TEXTAFTER(T10,\"-\"),\"*\",\"\")-0)","v":""},{"$f":"IF(OR(ISERROR(FIND(\"-\",U10)),AI10<='export html'!$AR$7),\"\",SUBSTITUTE(_xlfn.TEXTAFTER(U10,\"-\"),\"*\",\"\")-0)","v":""},null,{"$f":"IF(OR(ISERROR(FIND(\"-\",W10)),AK10<='export html'!$AR$7),\"\",SUBSTITUTE(_xlfn.TEXTAFTER(W10,\"-\"),\"*\",\"\")-0)","v":""},{"$f":"IF(OR(ISERROR(FIND(\"-\",X10)),AL10<='export html'!$AR$7),\"\",SUBSTITUTE(_xlfn.TEXTAFTER(X10,\"-\"),\"*\",\"\")-0)","v":1},{"$f":"IF(OR(ISERROR(FIND(\"-\",Y10)),AM10<='export html'!$AR$7),\"\",SUBSTITUTE(_xlfn.TEXTAFTER(Y10,\"-\"),\"*\",\"\")-0)","v":0},{"$f":"IF(OR(ISERROR(FIND(\"-\",Z10)),AN10<='export html'!$AR$7),\"\",SUBSTITUTE(_xlfn.TEXTAFTER(Z10,\"-\"),\"*\",\"\")-0)","v":""},{"$f":"IF(OR(ISERROR(FIND(\"-\",AA10)),AO10<='export html'!$AR$7),\"\",SUBSTITUTE(_xlfn.TEXTAFTER(AA10,\"-\"),\"*\",\"\")-0)","v":""},{"$f":"IF(OR(ISERROR(FIND(\"-\",AB10)),AP10<='export html'!$AR$7),\"\",SUBSTITUTE(_xlfn.TEXTAFTER(AB10,\"-\"),\"*\",\"\")-0)","v":1},{"$f":"IF(OR(ISERROR(FIND(\"-\",AC10)),AQ10<='export html'!$AR$7),\"\",SUBSTITUTE(_xlfn.TEXTAFTER(AC10,\"-\"),\"*\",\"\")-0)","v":""},{"$f":"IF(OR(ISERROR(FIND(\"-\",AD10)),AR10<='export html'!$AR$7),\"\",SUBSTITUTE(_xlfn.TEXTAFTER(AD10,\"-\"),\"*\",\"\")-0)","v":0},6]
[null,null,null,{"$f":"IF('export html'!T6=\"\",\"\",'export html'!T6)","v":"2025-03-09"},{"$f":"IF('export html'!U6=\"\",\"\",'export html'!U6)","v":22},{"$f":"IF('export html'!V6=\"\",\"\",'export html'!V6)","v":"Lucyvo - Jolika"},null,null,null,null,null,null,null,{"$f":"IF('export html'!W6=\"\",\"\",'export html'!W6)","v":"2-2"},null,null,1,"Wout Beirinckx",null,null,null,null,null,null,null,149.55248509660274,"Maarten Langenaeker",null,null,null,null,null,null,null,null,null,null,null,null,null,null,null,null,null,null,null,null,null,null,null,null,null,null,null,null,null,null,null,null,null,null,null,null,null,null,null,null,null,null,null,null,null,null,7,{"$f":"IF(OR(ISERROR(FIND(\"-\",Q11)),AE11>'export html'!$AR$7),\"\",SUBSTITUTE(_xlfn.TEXTAFTER(Q11,\"-\"),\"*\",\"\")-0)","v":2},{"$f":"IF(OR(ISERROR(FIND(\"-\",R11)),AF11>'export html'!$AR$7),\"\",SUBSTITUTE(_xlfn.TEXTAFTER(R11,\"-\"),\"*\",\"\")-0)","v":""},{"$f":"IF(OR(ISERROR(FIND(\"-\",S11)),AG11>'export html'!$AR$7),\"\",SUBSTITUTE(_xlfn.TEXTAFTER(S11,\"-\"),\"*\",\"\")-0)","v":""},{"$f":"IF(OR(ISERROR(FIND(\"-\",T11)),AH11>'export html'!$AR$7),\"\",SUBSTITUTE(_xlfn.TEXTAFTER(T11,\"-\"),\"*\",\"\")-0)","v":1},{"$f":"IF(OR(ISERROR(FIND(\"-\",U11)),AI11>'export html'!$AR$7),\"\",SUBSTITUTE(_xlfn.TEXTAFTER(U11,\"-\"),\"*\",\"\")-0)","v":5},{"$f":"IF(OR(ISERROR(FIND(\"-\",V11)),AJ11>'export html'!$AR$7),\"\",SUBSTITUTE(_xlfn.TEXTAFTER(V11,\"-\"),\"*\",\"\")-0)","v":""},null,{"$f":"IF(OR(ISERROR(FIND(\"-\",X11)),AL11>'export html'!$AR$7),\"\",SUBSTITUTE(_xlfn.TEXTAFTER(X11,\"-\"),\"*\",\"\")-0)","v":4},{"$f":"IF(OR(ISERROR(FIND(\"-\",Y11)),AM11>'export html'!$AR$7),\"\",SUBSTITUTE(_xlfn.TEXTAFTER(Y11,\"-\"),\"*\",\"\")-0)","v":0},{"$f":"IF(OR(ISERROR(FIND(\"-\",Z11)),AN11>'export html'!$AR$7),\"\",SUBSTITUTE(_xlfn.TEXTAFTER(Z11,\"-\"),\"*\",\"\")-0)","v":0},{"$f":"IF(OR(ISERROR(FIND(\"-\",AA11)),AO11>'export html'!$AR$7),\"\",SUBSTITUTE(_xlfn.TEXTAFTER(AA11,\"-\"),\"*\",\"\")-0)","v":5},{"$f":"IF(OR(ISERROR(FIND(\"-\",AB11)),AP11>'export html'!$AR$7),\"\",SUBSTITUTE(_xlfn.TEXTAFTER(AB11,\"-\"),\"*\",\"\")-0)","v":""},{"$f":"IF(OR(ISERROR(FIND(\"-\",AC11)),AQ11>'export html'!$AR$7),\"\",SUBSTITUTE(_xlfn.TEXTAFTER(AC11,\"-\"),\"*\",\"\")-0)","v":""},{"$f":"IF(OR(ISERROR(FIND(\"-\",AD11)),AR11>'export html'!$AR$7),\"\",SUBSTITUTE(_xlfn.TEXTAFTER(AD11,\"-\"),\"*\",\"\")-0)","v":""},7,{"$f":"IF(OR(ISERROR(FIND(\"-\",Q11)),AE11<='export html'!$AR$7),\"\",SUBSTITUTE(_xlfn.TEXTAFTER(Q11,\"-\"),\"*\",\"\")-0)","v":""},{"$f":"IF(OR(ISERROR(FIND(\"-\",R11)),AF11<='export html'!$AR$7),\"\",SUBSTITUTE(_xlfn.TEXTAFTER(R11,\"-\"),\"*\",\"\")-0)","v":5},{"$f":"IF(OR(ISERROR(FIND(\"-\",S11)),AG11<='export html'!$AR$7),\"\",SUBSTITUTE(_xlfn.TEXTAFTER(S11,\"-\"),\"*\",\"\")-0)","v":2},{"$f":"IF(OR(ISERROR(FIND(\"-\",T11)),AH11<='export html'!$AR$7),\"\",SUBSTITUTE(_xlfn.TEXTAFTER(T11,\"-\"),\"*\",\"\")-0)","v":""},{"$f":"IF(OR(ISERROR(FIND(\"-\",U11)),AI11<='export html'!$AR$7),\"\",SUBSTITUTE(_xlfn.TEXTAFTER(U11,\"-\"),\"*\",\"\")-0)","v":""},{"$f":"IF(OR(ISERROR(FIND(\"-\",V11)),AJ11<='export html'!$AR$7),\"\",SUBSTITUTE(_xlfn.TEXTAFTER(V11,\"-\"),\"*\",\"\")-0)","v":2},null,{"$f":"IF(OR(ISERROR(FIND(\"-\",X11)),AL11<='export html'!$AR$7),\"\",SUBSTITUTE(_xlfn.TEXTAFTER(X11,\"-\"),\"*\",\"\")-0)","v":""},{"$f":"IF(OR(ISERROR(FIND(\"-\",Y11)),AM11<='export html'!$AR$7),\"\",SUBSTITUTE(_xlfn.TEXTAFTER(Y11,\"-\"),\"*\",\"\")-0)","v":""},{"$f":"IF(OR(ISERROR(FIND(\"-\",Z11)),AN11<='export html'!$AR$7),\"\",SUBSTITUTE(_xlfn.TEXTAFTER(Z11,\"-\"),\"*\",\"\")-0)","v":""},{"$f":"IF(OR(ISERROR(FIND(\"-\",AA11)),AO11<='export html'!$AR$7),\"\",SUBSTITUTE(_xlfn.TEXTAFTER(AA11,\"-\"),\"*\",\"\")-0)","v":""},{"$f":"IF(OR(ISERROR(FIND(\"-\",AB11)),AP11<='export html'!$AR$7),\"\",SUBSTITUTE(_xlfn.TEXTAFTER(AB11,\"-\"),\"*\",\"\")-0)","v":3},{"$f":"IF(OR(ISERROR(FIND(\"-\",AC11)),AQ11<='export html'!$AR$7),\"\",SUBSTITUTE(_xlfn.TEXTAFTER(AC11,\"-\"),\"*\",\"\")-0)","v":4},{"$f":"IF(OR(ISERROR(FIND(\"-\",AD11)),AR11<='export html'!$AR$7),\"\",SUBSTITUTE(_xlfn.TEXTAFTER(AD11,\"-\"),\"*\",\"\")-0)","v":1},7]
[null,null,null,{"$f":"IF('export html'!T7=\"\",\"\",'export html'!T7)","v":"2025-03-02"},{"$f":"IF('export html'!U7=\"\",\"\",'export html'!U7)","v":15},{"$f":"IF('export html'!V7=\"\",\"\",'export html'!V7)","v":"Lucyvo - Goka"},null,null,null,null,null,null,null,{"$f":"IF('export html'!W7=\"\",\"\",'export html'!W7)","v":"3-0"},null,null,1,"Maarten De Groof",null,null,null,null,null,null,null,134.29717865553778,"Maarten De Groof",null,null,null,null,null,null,null,null,null,null,null,null,null,null,null,null,null,null,null,null,null,null,null,null,null,null,null,null,null,null,null,null,null,null,null,null,null,null,null,null,null,null,null,null,null,null,8,{"$f":"IF(OR(ISERROR(FIND(\"-\",Q12)),AE12>'export html'!$AR$7),\"\",SUBSTITUTE(_xlfn.TEXTAFTER(Q12,\"-\"),\"*\",\"\")-0)","v":4},{"$f":"IF(OR(ISERROR(FIND(\"-\",R12)),AF12>'export html'!$AR$7),\"\",SUBSTITUTE(_xlfn.TEXTAFTER(R12,\"-\"),\"*\",\"\")-0)","v":3},{"$f":"IF(OR(ISERROR(FIND(\"-\",S12)),AG12>'export html'!$AR$7),\"\",SUBSTITUTE(_xlfn.TEXTAFTER(S12,\"-\"),\"*\",\"\")-0)","v":4},{"$f":"IF(OR(ISERROR(FIND(\"-\",T12)),AH12>'export html'!$AR$7),\"\",SUBSTITUTE(_xlfn.TEXTAFTER(T12,\"-\"),\"*\",\"\")-0)","v":""},{"$f":"IF(OR(ISERROR(FIND(\"-\",U12)),AI12>'export html'!$AR$7),\"\",SUBSTITUTE(_xlfn.TEXTAFTER(U12,\"-\"),\"*\",\"\")-0)","v":""},{"$f":"IF(OR(ISERROR(FIND(\"-\",V12)),AJ12>'export html'!$AR$7),\"\",SUBSTITUTE(_xlfn.TEXTAFTER(V12,\"-\"),\"*\",\"\")-0)","v":3},{"$f":"IF(OR(ISERROR(FIND(\"-\",W12)),AK12>'export html'!$AR$7),\"\",SUBSTITUTE(_xlfn.TEXTAFTER(W12,\"-\"),\"*\",\"\")-0)","v":""},null,{"$f":"IF(OR(ISERROR(FIND(\"-\",Y12)),AM12>'export html'!$AR$7),\"\",SUBSTITUTE(_xlfn.TEXTAFTER(Y12,\"-\"),\"*\",\"\")-0)","v":""},{"$f":"IF(OR(ISERROR(FIND(\"-\",Z12)),AN12>'export html'!$AR$7),\"\",SUBSTITUTE(_xlfn.TEXTAFTER(Z12,\"-\"),\"*\",\"\")-0)","v":""},{"$f":"IF(OR(ISERROR(FIND(\"-\",AA12)),AO12>'export html'!$AR$7),\"\",SUBSTITUTE(_xlfn.TEXTAFTER(AA12,\"-\"),\"*\",\"\")-0)","v":""},{"$f":"IF(OR(ISERROR(FIND(\"-\",AB12)),AP12>'export html'!$AR$7),\"\",SUBSTITUTE(_xlfn.TEXTAFTER(AB12,\"-\"),\"*\",\"\")-0)","v":6},{"$f":"IF(OR(ISERROR(FIND(\"-\",AC12)),AQ12>'export html'!$AR$7),\"\",SUBSTITUTE(_xlfn.TEXTAFTER(AC12,\"-\"),\"*\",\"\")-0)","v":""},{"$f":"IF(OR(ISERROR(FIND(\"-\",AD12)),AR12>'export html'!$AR$7),\"\",SUBSTITUTE(_xlfn.TEXTAFTER(AD12,\"-\"),\"*\",\"\")-0)","v":1},8,{"$f":"IF(OR(ISERROR(FIND(\"-\",Q12)),AE12<='export html'!$AR$7),\"\",SUBSTITUTE(_xlfn.TEXTAFTER(Q12,\"-\"),\"*\",\"\")-0)","v":""},{"$f":"IF(OR(ISERROR(FIND(\"-\",R12)),AF12<='export html'!$AR$7),\"\",SUBSTITUTE(_xlfn.TEXTAFTER(R12,\"-\"),\"*\",\"\")-0)","v":""},{"$f":"IF(OR(ISERROR(FIND(\"-\",S12)),AG12<='export html'!$AR$7),\"\",SUBSTITUTE(_xlfn.TEXTAFTER(S12,\"-\"),\"*\",\"\")-0)","v":""},{"$f":"IF(OR(ISERROR(FIND(\"-\",T12)),AH12<='export html'!$AR$7),\"\",SUBSTITUTE(_xlfn.TEXTAFTER(T12,\"-\"),\"*\",\"\")-0)","v":0},{"$f":"IF(OR(ISERROR(FIND(\"-\",U12)),AI12<='export html'!$AR$7),\"\",SUBSTITUTE(_xlfn.TEXTAFTER(U12,\"-\"),\"*\",\"\")-0)","v":6},{"$f":"IF(OR(ISERROR(FIND(\"-\",V12)),AJ12<='export html'!$AR$7),\"\",SUBSTITUTE(_xlfn.TEXTAFTER(V12,\"-\"),\"*\",\"\")-0)","v":""},{"$f":"IF(OR(ISERROR(FIND(\"-\",W12)),AK12<='export html'!$AR$7),\"\",SUBSTITUTE(_xlfn.TEXTAFTER(W12,\"-\"),\"*\",\"\")-0)","v":2},null,{"$f":"IF(OR(ISERROR(FIND(\"-\",Y12)),AM12<='export html'!$AR$7),\"\",SUBSTITUTE(_xlfn.TEXTAFTER(Y12,\"-\"),\"*\",\"\")-0)","v":0},{"$f":"IF(OR(ISERROR(FIND(\"-\",Z12)),AN12<='export html'!$AR$7),\"\",SUBSTITUTE(_xlfn.TEXTAFTER(Z12,\"-\"),\"*\",\"\")-0)","v":""},{"$f":"IF(OR(ISERROR(FIND(\"-\",AA12)),AO12<='export html'!$AR$7),\"\",SUBSTITUTE(_xlfn.TEXTAFTER(AA12,\"-\"),\"*\",\"\")-0)","v":1},{"$f":"IF(OR(ISERROR(FIND(\"-\",AB12)),AP12<='export html'!$AR$7),\"\",SUBSTITUTE(_xlfn.TEXTAFTER(AB12,\"-\"),\"*\",\"\")-0)","v":""},{"$f":"IF(OR(ISERROR(FIND(\"-\",AC12)),AQ12<='export html'!$AR$7),\"\",SUBSTITUTE(_xlfn.TEXTAFTER(AC12,\"-\"),\"*\",\"\")-0)","v":""},{"$f":"IF(OR(ISERROR(FIND(\"-\",AD12)),AR12<='export html'!$AR$7),\"\",SUBSTITUTE(_xlfn.TEXTAFTER(AD12,\"-\"),\"*\",\"\")-0)","v":""},8]
[null,null,null,{"$f":"IF('export html'!T8=\"\",\"\",'export html'!T8)","v":""},{"$f":"IF('export html'!U8=\"\",\"\",'export html'!U8)","v":""},{"$f":"IF('export html'!V8=\"\",\"\",'export html'!V8)","v":""},null,null,null,null,null,null,null,{"$f":"IF('export html'!W8=\"\",\"\",'export html'!W8)","v":""},null,null,null,null,null,null,null,null,null,null,null,null,null,null,null,null,null,null,null,null,null,null,null,null,null,null,null,null,null,null,null,null,null,null,null,null,null,null,null,null,null,null,null,null,null,null,null,null,null,null,null,null,null,null,null,null,null,null,null,9,{"$f":"IF(OR(ISERROR(FIND(\"-\",Q13)),AE13>'export html'!$AR$7),\"\",SUBSTITUTE(_xlfn.TEXTAFTER(Q13,\"-\"),\"*\",\"\")-0)","v":""},{"$f":"IF(OR(ISERROR(FIND(\"-\",R13)),AF13>'export html'!$AR$7),\"\",SUBSTITUTE(_xlfn.TEXTAFTER(R13,\"-\"),\"*\",\"\")-0)","v":""},{"$f":"IF(OR(ISERROR(FIND(\"-\",S13)),AG13>'export html'!$AR$7),\"\",SUBSTITUTE(_xlfn.TEXTAFTER(S13,\"-\"),\"*\",\"\")-0)","v":""},{"$f":"IF(OR(ISERROR(FIND(\"-\",T13)),AH13>'export html'!$AR$7),\"\",SUBSTITUTE(_xlfn.TEXTAFTER(T13,\"-\"),\"*\",\"\")-0)","v":""},{"$f":"IF(OR(ISERROR(FIND(\"-\",U13)),AI13>'export html'!$AR$7),\"\",SUBSTITUTE(_xlfn.TEXTAFTER(U13,\"-\"),\"*\",\"\")-0)","v":8},{"$f":"IF(OR(ISERROR(FIND(\"-\",V13)),AJ13>'export html'!$AR$7),\"\",SUBSTITUTE(_xlfn.TEXTAFTER(V13,\"-\"),\"*\",\"\")-0)","v":7},{"$f":"IF(OR(ISERROR(FIND(\"-\",W13)),AK13>'export html'!$AR$7),\"\",SUBSTITUTE(_xlfn.TEXTAFTER(W13,\"-\"),\"*\",\"\")-0)","v":""},{"$f":"IF(OR(ISERROR(FIND(\"-\",X13)),AL13>'export html'!$AR$7),\"\",SUBSTITUTE(_xlfn.TEXTAFTER(X13,\"-\"),\"*\",\"\")-0)","v":6},null,{"$f":"IF(OR(ISERROR(FIND(\"-\",Z13)),AN13>'export html'!$AR$7),\"\",SUBSTITUTE(_xlfn.TEXTAFTER(Z13,\"-\"),\"*\",\"\")-0)","v":1},{"$f":"IF(OR(ISERROR(FIND(\"-\",AA13)),AO13>'export html'!$AR$7),\"\",SUBSTITUTE(_xlfn.TEXTAFTER(AA13,\"-\"),\"*\",\"\")-0)","v":""},{"$f":"IF(OR(ISERROR(FIND(\"-\",AB13)),AP13>'export html'!$AR$7),\"\",SUBSTITUTE(_xlfn.TEXTAFTER(AB13,\"-\"),\"*\",\"\")-0)","v":8},{"$f":"IF(OR(ISERROR(FIND(\"-\",AC13)),AQ13>'export html'!$AR$7),\"\",SUBSTITUTE(_xlfn.TEXTAFTER(AC13,\"-\"),\"*\",\"\")-0)","v":0},{"$f":"IF(OR(ISERROR(FIND(\"-\",AD13)),AR13>'export html'!$AR$7),\"\",SUBSTITUTE(_xlfn.TEXTAFTER(AD13,\"-\"),\"*\",\"\")-0)","v":5},9,{"$f":"IF(OR(ISERROR(FIND(\"-\",Q13)),AE13<='export html'!$AR$7),\"\",SUBSTITUTE(_xlfn.TEXTAFTER(Q13,\"-\"),\"*\",\"\")-0)","v":5},{"$f":"IF(OR(ISERROR(FIND(\"-\",R13)),AF13<='export html'!$AR$7),\"\",SUBSTITUTE(_xlfn.TEXTAFTER(R13,\"-\"),\"*\",\"\")-0)","v":5},{"$f":"IF(OR(ISERROR(FIND(\"-\",S13)),AG13<='export html'!$AR$7),\"\",SUBSTITUTE(_xlfn.TEXTAFTER(S13,\"-\"),\"*\",\"\")-0)","v":2},{"$f":"IF(OR(ISERROR(FIND(\"-\",T13)),AH13<='export html'!$AR$7),\"\",SUBSTITUTE(_xlfn.TEXTAFTER(T13,\"-\"),\"*\",\"\")-0)","v":""},{"$f":"IF(OR(ISERROR(FIND(\"-\",U13)),AI13<='export html'!$AR$7),\"\",SUBSTITUTE(_xlfn.TEXTAFTER(U13,\"-\"),\"*\",\"\")-0)","v":""},{"$f":"IF(OR(ISERROR(FIND(\"-\",V13)),AJ13<='export html'!$AR$7),\"\",SUBSTITUTE(_xlfn.TEXTAFTER(V13,\"-\"),\"*\",\"\")-0)","v":""},{"$f":"IF(OR(ISERROR(FIND(\"-\",W13)),AK13<='export html'!$AR$7),\"\",SUBSTITUTE(_xlfn.TEXTAFTER(W13,\"-\"),\"*\",\"\")-0)","v":1},{"$f":"IF(OR(ISERROR(FIND(\"-\",X13)),AL13<='export html'!$AR$7),\"\",SUBSTITUTE(_xlfn.TEXTAFTER(X13,\"-\"),\"*\",\"\")-0)","v":""},null,{"$f":"IF(OR(ISERROR(FIND(\"-\",Z13)),AN13<='export html'!$AR$7),\"\",SUBSTITUTE(_xlfn.TEXTAFTER(Z13,\"-\"),\"*\",\"\")-0)","v":""},{"$f":"IF(OR(ISERROR(FIND(\"-\",AA13)),AO13<='export html'!$AR$7),\"\",SUBSTITUTE(_xlfn.TEXTAFTER(AA13,\"-\"),\"*\",\"\")-0)","v":""},{"$f":"IF(OR(ISERROR(FIND(\"-\",AB13)),AP13<='export html'!$AR$7),\"\",SUBSTITUTE(_xlfn.TEXTAFTER(AB13,\"-\"),\"*\",\"\")-0)","v":""},{"$f":"IF(OR(ISERROR(FIND(\"-\",AC13)),AQ13<='export html'!$AR$7),\"\",SUBSTITUTE(_xlfn.TEXTAFTER(AC13,\"-\"),\"*\",\"\")-0)","v":""},{"$f":"IF(OR(ISERROR(FIND(\"-\",AD13)),AR13<='export html'!$AR$7),\"\",SUBSTITUTE(_xlfn.TEXTAFTER(AD13,\"-\"),\"*\",\"\")-0)","v":""},9]
[null,null,null,null,null,null,null,null,null,null,null,null,null,null,null,null,null,null,null,null,null,null,null,null,null,null,null,null,null,null,null,null,null,null,null,null,null,null,null,null,null,null,null,null,null,null,null,null,null,null,null,null,null,null,null,null,null,null,null,null,null,null,null,null,null,null,null,null,null,null,null,null,null,10,{"$f":"IF(OR(ISERROR(FIND(\"-\",Q14)),AE14>'export html'!$AR$7),\"\",SUBSTITUTE(_xlfn.TEXTAFTER(Q14,\"-\"),\"*\",\"\")-0)","v":5},{"$f":"IF(OR(ISERROR(FIND(\"-\",R14)),AF14>'export html'!$AR$7),\"\",SUBSTITUTE(_xlfn.TEXTAFTER(R14,\"-\"),\"*\",\"\")-0)","v":7},{"$f":"IF(OR(ISERROR(FIND(\"-\",S14)),AG14>'export html'!$AR$7),\"\",SUBSTITUTE(_xlfn.TEXTAFTER(S14,\"-\"),\"*\",\"\")-0)","v":4},{"$f":"IF(OR(ISERROR(FIND(\"-\",T14)),AH14>'export html'!$AR$7),\"\",SUBSTITUTE(_xlfn.TEXTAFTER(T14,\"-\"),\"*\",\"\")-0)","v":""},{"$f":"IF(OR(ISERROR(FIND(\"-\",U14)),AI14>'export html'!$AR$7),\"\",SUBSTITUTE(_xlfn.TEXTAFTER(U14,\"-\"),\"*\",\"\")-0)","v":5},{"$f":"IF(OR(ISERROR(FIND(\"-\",V14)),AJ14>'export html'!$AR$7),\"\",SUBSTITUTE(_xlfn.TEXTAFTER(V14,\"-\"),\"*\",\"\")-0)","v":""},{"$f":"IF(OR(ISERROR(FIND(\"-\",W14)),AK14>'export html'!$AR$7),\"\",SUBSTITUTE(_xlfn.TEXTAFTER(W14,\"-\"),\"*\",\"\")-0)","v":""},{"$f":"IF(OR(ISERROR(FIND(\"-\",X14)),AL14>'export html'!$AR$7),\"\",SUBSTITUTE(_xlfn.TEXTAFTER(X14,\"-\"),\"*\",\"\")-0)","v":1},{"$f":"IF(OR(ISERROR(FIND(\"-\",Y14)),AM14>'export html'!$AR$7),\"\",SUBSTITUTE(_xlfn.TEXTAFTER(Y14,\"-\"),\"*\",\"\")-0)","v":""},null,{"$f":"IF(OR(ISERROR(FIND(\"-\",AA14)),AO14>'export html'!$AR$7),\"\",SUBSTITUTE(_xlfn.TEXTAFTER(AA14,\"-\"),\"*\",\"\")-0)","v":""},{"$f":"IF(OR(ISERROR(FIND(\"-\",AB14)),AP14>'export html'!$AR$7),\"\",SUBSTITUTE(_xlfn.TEXTAFTER(AB14,\"-\"),\"*\",\"\")-0)","v":""},{"$f":"IF(OR(ISERROR(FIND(\"-\",AC14)),AQ14>'export html'!$AR$7),\"\",SUBSTITUTE(_xlfn.TEXTAFTER(AC14,\"-\"),\"*\",\"\")-0)","v":""},{"$f":"IF(OR(ISERROR(FIND(\"-\",AD14)),AR14>'export html'!$AR$7),\"\",SUBSTITUTE(_xlfn.TEXTAFTER(AD14,\"-\"),\"*\",\"\")-0)","v":2},10,{"$f":"IF(OR(ISERROR(FIND(\"-\",Q14)),AE14<='export html'!$AR$7),\"\",SUBSTITUTE(_xlfn.TEXTAFTER(Q14,\"-\"),\"*\",\"\")-0)","v":""},{"$f":"IF(OR(ISERROR(FIND(\"-\",R14)),AF14<='export html'!$AR$7),\"\",SUBSTITUTE(_xlfn.TEXTAFTER(R14,\"-\"),\"*\",\"\")-0)","v":""},{"$f":"IF(OR(ISERROR(FIND(\"-\",S14)),AG14<='export html'!$AR$7),\"\",SUBSTITUTE(_xlfn.TEXTAFTER(S14,\"-\"),\"*\",\"\")-0)","v":""},{"$f":"IF(OR(ISERROR(FIND(\"-\",T14)),AH14<='export html'!$AR$7),\"\",SUBSTITUTE(_xlfn.TEXTAFTER(T14,\"-\"),\"*\",\"\")-0)","v":1},{"$f":"IF(OR(ISERROR(FIND(\"-\",U14)),AI14<='export html'!$AR$7),\"\",SUBSTITUTE(_xlfn.TEXTAFTER(U14,\"-\"),\"*\",\"\")-0)","v":""},{"$f":"IF(OR(ISERROR(FIND(\"-\",V14)),AJ14<='export html'!$AR$7),\"\",SUBSTITUTE(_xlfn.TEXTAFTER(V14,\"-\"),\"*\",\"\")-0)","v":5},{"$f":"IF(OR(ISERROR(FIND(\"-\",W14)),AK14<='export html'!$AR$7),\"\",SUBSTITUTE(_xlfn.TEXTAFTER(W14,\"-\"),\"*\",\"\")-0)","v":0},{"$f":"IF(OR(ISERROR(FIND(\"-\",X14)),AL14<='export html'!$AR$7),\"\",SUBSTITUTE(_xlfn.TEXTAFTER(X14,\"-\"),\"*\",\"\")-0)","v":""},{"$f":"IF(OR(ISERROR(FIND(\"-\",Y14)),AM14<='export html'!$AR$7),\"\",SUBSTITUTE(_xlfn.TEXTAFTER(Y14,\"-\"),\"*\",\"\")-0)","v":2},null,{"$f":"IF(OR(ISERROR(FIND(\"-\",AA14)),AO14<='export html'!$AR$7),\"\",SUBSTITUTE(_xlfn.TEXTAFTER(AA14,\"-\"),\"*\",\"\")-0)","v":""},{"$f":"IF(OR(ISERROR(FIND(\"-\",AB14)),AP14<='export html'!$AR$7),\"\",SUBSTITUTE(_xlfn.TEXTAFTER(AB14,\"-\"),\"*\",\"\")-0)","v":2},{"$f":"IF(OR(ISERROR(FIND(\"-\",AC14)),AQ14<='export html'!$AR$7),\"\",SUBSTITUTE(_xlfn.TEXTAFTER(AC14,\"-\"),\"*\",\"\")-0)","v":8},{"$f":"IF(OR(ISERROR(FIND(\"-\",AD14)),AR14<='export html'!$AR$7),\"\",SUBSTITUTE(_xlfn.TEXTAFTER(AD14,\"-\"),\"*\",\"\")-0)","v":""},10]
[null,null,null,null,null,null,null,null,null,null,null,null,null,null,null,null,null,null,null,null,null,null,null,null,null,null,null,null,null,null,null,null,null,null,null,null,null,null,null,null,null,null,null,null,null,null,null,null,null,null,null,null,null,null,null,null,null,null,null,null,null,null,null,null,null,null,null,null,null,null,null,null,null,11,{"$f":"IF(OR(ISERROR(FIND(\"-\",Q15)),AE15>'export html'!$AR$7),\"\",SUBSTITUTE(_xlfn.TEXTAFTER(Q15,\"-\"),\"*\",\"\")-0)","v":1},{"$f":"IF(OR(ISERROR(FIND(\"-\",R15)),AF15>'export html'!$AR$7),\"\",SUBSTITUTE(_xlfn.TEXTAFTER(R15,\"-\"),\"*\",\"\")-0)","v":""},{"$f":"IF(OR(ISERROR(FIND(\"-\",S15)),AG15>'export html'!$AR$7),\"\",SUBSTITUTE(_xlfn.TEXTAFTER(S15,\"-\"),\"*\",\"\")-0)","v":0},{"$f":"IF(OR(ISERROR(FIND(\"-\",T15)),AH15>'export html'!$AR$7),\"\",SUBSTITUTE(_xlfn.TEXTAFTER(T15,\"-\"),\"*\",\"\")-0)","v":5},{"$f":"IF(OR(ISERROR(FIND(\"-\",U15)),AI15>'export html'!$AR$7),\"\",SUBSTITUTE(_xlfn.TEXTAFTER(U15,\"-\"),\"*\",\"\")-0)","v":1},{"$f":"IF(OR(ISERROR(FIND(\"-\",V15)),AJ15>'export html'!$AR$7),\"\",SUBSTITUTE(_xlfn.TEXTAFTER(V15,\"-\"),\"*\",\"\")-0)","v":""},{"$f":"IF(OR(ISERROR(FIND(\"-\",W15)),AK15>'export html'!$AR$7),\"\",SUBSTITUTE(_xlfn.TEXTAFTER(W15,\"-\"),\"*\",\"\")-0)","v":""},{"$f":"IF(OR(ISERROR(FIND(\"-\",X15)),AL15>'export html'!$AR$7),\"\",SUBSTITUTE(_xlfn.TEXTAFTER(X15,\"-\"),\"*\",\"\")-0)","v":2},{"$f":"IF(OR(ISERROR(FIND(\"-\",Y15)),AM15>'export html'!$AR$7),\"\",SUBSTITUTE(_xlfn.TEXTAFTER(Y15,\"-\"),\"*\",\"\")-0)","v":1},{"$f":"IF(OR(ISERROR(FIND(\"-\",Z15)),AN15>'export html'!$AR$7),\"\",SUBSTITUTE(_xlfn.TEXTAFTER(Z15,\"-\"),\"*\",\"\")-0)","v":2},null,{"$f":"IF(OR(ISERROR(FIND(\"-\",AB15)),AP15>'export html'!$AR$7),\"\",SUBSTITUTE(_xlfn.TEXTAFTER(AB15,\"-\"),\"*\",\"\")-0)","v":""},{"$f":"IF(OR(ISERROR(FIND(\"-\",AC15)),AQ15>'export html'!$AR$7),\"\",SUBSTITUTE(_xlfn.TEXTAFTER(AC15,\"-\"),\"*\",\"\")-0)","v":""},{"$f":"IF(OR(ISERROR(FIND(\"-\",AD15)),AR15>'export html'!$AR$7),\"\",SUBSTITUTE(_xlfn.TEXTAFTER(AD15,\"-\"),\"*\",\"\")-0)","v":""},11,{"$f":"IF(OR(ISERROR(FIND(\"-\",Q15)),AE15<='export html'!$AR$7),\"\",SUBSTITUTE(_xlfn.TEXTAFTER(Q15,\"-\"),\"*\",\"\")-0)","v":""},{"$f":"IF(OR(ISERROR(FIND(\"-\",R15)),AF15<='export html'!$AR$7),\"\",SUBSTITUTE(_xlfn.TEXTAFTER(R15,\"-\"),\"*\",\"\")-0)","v":3},{"$f":"IF(OR(ISERROR(FIND(\"-\",S15)),AG15<='export html'!$AR$7),\"\",SUBSTITUTE(_xlfn.TEXTAFTER(S15,\"-\"),\"*\",\"\")-0)","v":""},{"$f":"IF(OR(ISERROR(FIND(\"-\",T15)),AH15<='export html'!$AR$7),\"\",SUBSTITUTE(_xlfn.TEXTAFTER(T15,\"-\"),\"*\",\"\")-0)","v":""},{"$f":"IF(OR(ISERROR(FIND(\"-\",U15)),AI15<='export html'!$AR$7),\"\",SUBSTITUTE(_xlfn.TEXTAFTER(U15,\"-\"),\"*\",\"\")-0)","v":""},{"$f":"IF(OR(ISERROR(FIND(\"-\",V15)),AJ15<='export html'!$AR$7),\"\",SUBSTITUTE(_xlfn.TEXTAFTER(V15,\"-\"),\"*\",\"\")-0)","v":1},{"$f":"IF(OR(ISERROR(FIND(\"-\",W15)),AK15<='export html'!$AR$7),\"\",SUBSTITUTE(_xlfn.TEXTAFTER(W15,\"-\"),\"*\",\"\")-0)","v":0},{"$f":"IF(OR(ISERROR(FIND(\"-\",X15)),AL15<='export html'!$AR$7),\"\",SUBSTITUTE(_xlfn.TEXTAFTER(X15,\"-\"),\"*\",\"\")-0)","v":""},{"$f":"IF(OR(ISERROR(FIND(\"-\",Y15)),AM15<='export html'!$AR$7),\"\",SUBSTITUTE(_xlfn.TEXTAFTER(Y15,\"-\"),\"*\",\"\")-0)","v":""},{"$f":"IF(OR(ISERROR(FIND(\"-\",Z15)),AN15<='export html'!$AR$7),\"\",SUBSTITUTE(_xlfn.TEXTAFTER(Z15,\"-\"),\"*\",\"\")-0)","v":""},null,{"$f":"IF(OR(ISERROR(FIND(\"-\",AB15)),AP15<='export html'!$AR$7),\"\",SUBSTITUTE(_xlfn.TEXTAFTER(AB15,\"-\"),\"*\",\"\")-0)","v":1},{"$f":"IF(OR(ISERROR(FIND(\"-\",AC15)),AQ15<='export html'!$AR$7),\"\",SUBSTITUTE(_xlfn.TEXTAFTER(AC15,\"-\"),\"*\",\"\")-0)","v":6},{"$f":"IF(OR(ISERROR(FIND(\"-\",AD15)),AR15<='export html'!$AR$7),\"\",SUBSTITUTE(_xlfn.TEXTAFTER(AD15,\"-\"),\"*\",\"\")-0)","v":5},11]
[null,null,null,{"$f":"'export html'!C2","v":"Matchen van speeldag 25"},null,25,null,null,null,null,null,null,null,null,null,null,null,null,null,null,null,null,null,null,null,null,null,null,null,null,null,null,null,null,null,null,null,null,null,null,null,null,null,null,null,null,null,null,null,null,null,null,null,null,null,null,null,null,null,null,null,null,null,null,null,null,null,null,null,null,null,null,null,12,{"$f":"IF(OR(ISERROR(FIND(\"-\",Q16)),AE16>'export html'!$AR$7),\"\",SUBSTITUTE(_xlfn.TEXTAFTER(Q16,\"-\"),\"*\",\"\")-0)","v":""},{"$f":"IF(OR(ISERROR(FIND(\"-\",R16)),AF16>'export html'!$AR$7),\"\",SUBSTITUTE(_xlfn.TEXTAFTER(R16,\"-\"),\"*\",\"\")-0)","v":""},{"$f":"IF(OR(ISERROR(FIND(\"-\",S16)),AG16>'export html'!$AR$7),\"\",SUBSTITUTE(_xlfn.TEXTAFTER(S16,\"-\"),\"*\",\"\")-0)","v":""},{"$f":"IF(OR(ISERROR(FIND(\"-\",T16)),AH16>'export html'!$AR$7),\"\",SUBSTITUTE(_xlfn.TEXTAFTER(T16,\"-\"),\"*\",\"\")-0)","v":2},{"$f":"IF(OR(ISERROR(FIND(\"-\",U16)),AI16>'export html'!$AR$7),\"\",SUBSTITUTE(_xlfn.TEXTAFTER(U16,\"-\"),\"*\",\"\")-0)","v":""},{"$f":"IF(OR(ISERROR(FIND(\"-\",V16)),AJ16>'export html'!$AR$7),\"\",SUBSTITUTE(_xlfn.TEXTAFTER(V16,\"-\"),\"*\",\"\")-0)","v":3},{"$f":"IF(OR(ISERROR(FIND(\"-\",W16)),AK16>'export html'!$AR$7),\"\",SUBSTITUTE(_xlfn.TEXTAFTER(W16,\"-\"),\"*\",\"\")-0)","v":2},{"$f":"IF(OR(ISERROR(FIND(\"-\",X16)),AL16>'export html'!$AR$7),\"\",SUBSTITUTE(_xlfn.TEXTAFTER(X16,\"-\"),\"*\",\"\")-0)","v":""},{"$f":"IF(OR(ISERROR(FIND(\"-\",Y16)),AM16>'export html'!$AR$7),\"\",SUBSTITUTE(_xlfn.TEXTAFTER(Y16,\"-\"),\"*\",\"\")-0)","v":""},{"$f":"IF(OR(ISERROR(FIND(\"-\",Z16)),AN16>'export html'!$AR$7),\"\",SUBSTITUTE(_xlfn.TEXTAFTER(Z16,\"-\"),\"*\",\"\")-0)","v":0},{"$f":"IF(OR(ISERROR(FIND(\"-\",AA16)),AO16>'export html'!$AR$7),\"\",SUBSTITUTE(_xlfn.TEXTAFTER(AA16,\"-\"),\"*\",\"\")-0)","v":8},null,{"$f":"IF(OR(ISERROR(FIND(\"-\",AC16)),AQ16>'export html'!$AR$7),\"\",SUBSTITUTE(_xlfn.TEXTAFTER(AC16,\"-\"),\"*\",\"\")-0)","v":3},{"$f":"IF(OR(ISERROR(FIND(\"-\",AD16)),AR16>'export html'!$AR$7),\"\",SUBSTITUTE(_xlfn.TEXTAFTER(AD16,\"-\"),\"*\",\"\")-0)","v":""},12,{"$f":"IF(OR(ISERROR(FIND(\"-\",Q16)),AE16<='export html'!$AR$7),\"\",SUBSTITUTE(_xlfn.TEXTAFTER(Q16,\"-\"),\"*\",\"\")-0)","v":2},{"$f":"IF(OR(ISERROR(FIND(\"-\",R16)),AF16<='export html'!$AR$7),\"\",SUBSTITUTE(_xlfn.TEXTAFTER(R16,\"-\"),\"*\",\"\")-0)","v":2},{"$f":"IF(OR(ISERROR(FIND(\"-\",S16)),AG16<='export html'!$AR$7),\"\",SUBSTITUTE(_xlfn.TEXTAFTER(S16,\"-\"),\"*\",\"\")-0)","v":""},{"$f":"IF(OR(ISERROR(FIND(\"-\",T16)),AH16<='export html'!$AR$7),\"\",SUBSTITUTE(_xlfn.TEXTAFTER(T16,\"-\"),\"*\",\"\")-0)","v":""},{"$f":"IF(OR(ISERROR(FIND(\"-\",U16)),AI16<='export html'!$AR$7),\"\",SUBSTITUTE(_xlfn.TEXTAFTER(U16,\"-\"),\"*\",\"\")-0)","v":3},{"$f":"IF(OR(ISERROR(FIND(\"-\",V16)),AJ16<='export html'!$AR$7),\"\",SUBSTITUTE(_xlfn.TEXTAFTER(V16,\"-\"),\"*\",\"\")-0)","v":""},{"$f":"IF(OR(ISERROR(FIND(\"-\",W16)),AK16<='export html'!$AR$7),\"\",SUBSTITUTE(_xlfn.TEXTAFTER(W16,\"-\"),\"*\",\"\")-0)","v":""},{"$f":"IF(OR(ISERROR(FIND(\"-\",X16)),AL16<='export html'!$AR$7),\"\",SUBSTITUTE(_xlfn.TEXTAFTER(X16,\"-\"),\"*\",\"\")-0)","v":0},{"$f":"IF(OR(ISERROR(FIND(\"-\",Y16)),AM16<='export html'!$AR$7),\"\",SUBSTITUTE(_xlfn.TEXTAFTER(Y16,\"-\"),\"*\",\"\")-0)","v":2},{"$f":"IF(OR(ISERROR(FIND(\"-\",Z16)),AN16<='export html'!$AR$7),\"\",SUBSTITUTE(_xlfn.TEXTAFTER(Z16,\"-\"),\"*\",\"\")-0)","v":""},{"$f":"IF(OR(ISERROR(FIND(\"-\",AA16)),AO16<='export html'!$AR$7),\"\",SUBSTITUTE(_xlfn.TEXTAFTER(AA16,\"-\"),\"*\",\"\")-0)","v":""},null,{"$f":"IF(OR(ISERROR(FIND(\"-\",AC16)),AQ16<='export html'!$AR$7),\"\",SUBSTITUTE(_xlfn.TEXTAFTER(AC16,\"-\"),\"*\",\"\")-0)","v":""},{"$f":"IF(OR(ISERROR(FIND(\"-\",AD16)),AR16<='export html'!$AR$7),\"\",SUBSTITUTE(_xlfn.TEXTAFTER(AD16,\"-\"),\"*\",\"\")-0)","v":9},12]
[null,null,null,null,null,null,null,null,null,null,null,null,null,null,null,null,null,null,null,null,null,null,null,null,null,null,null,null,null,null,null,null,null,null,null,null,null,null,null,null,null,null,null,null,null,null,null,null,null,null,null,null,null,null,null,null,null,null,null,null,null,null,null,null,null,null,null,null,null,null,null,null,null,13,{"$f":"IF(OR(ISERROR(FIND(\"-\",Q17)),AE17>'export html'!$AR$7),\"\",SUBSTITUTE(_xlfn.TEXTAFTER(Q17,\"-\"),\"*\",\"\")-0)","v":""},{"$f":"IF(OR(ISERROR(FIND(\"-\",R17)),AF17>'export html'!$AR$7),\"\",SUBSTITUTE(_xlfn.TEXTAFTER(R17,\"-\"),\"*\",\"\")-0)","v":""},{"$f":"IF(OR(ISERROR(FIND(\"-\",S17)),AG17>'export html'!$AR$7),\"\",SUBSTITUTE(_xlfn.TEXTAFTER(S17,\"-\"),\"*\",\"\")-0)","v":""},{"$f":"IF(OR(ISERROR(FIND(\"-\",T17)),AH17>'export html'!$AR$7),\"\",SUBSTITUTE(_xlfn.TEXTAFTER(T17,\"-\"),\"*\",\"\")-0)","v":1},{"$f":"IF(OR(ISERROR(FIND(\"-\",U17)),AI17>'export html'!$AR$7),\"\",SUBSTITUTE(_xlfn.TEXTAFTER(U17,\"-\"),\"*\",\"\")-0)","v":3},{"$f":"IF(OR(ISERROR(FIND(\"-\",V17)),AJ17>'export html'!$AR$7),\"\",SUBSTITUTE(_xlfn.TEXTAFTER(V17,\"-\"),\"*\",\"\")-0)","v":""},{"$f":"IF(OR(ISERROR(FIND(\"-\",W17)),AK17>'export html'!$AR$7),\"\",SUBSTITUTE(_xlfn.TEXTAFTER(W17,\"-\"),\"*\",\"\")-0)","v":1},{"$f":"IF(OR(ISERROR(FIND(\"-\",X17)),AL17>'export html'!$AR$7),\"\",SUBSTITUTE(_xlfn.TEXTAFTER(X17,\"-\"),\"*\",\"\")-0)","v":1},{"$f":"IF(OR(ISERROR(FIND(\"-\",Y17)),AM17>'export html'!$AR$7),\"\",SUBSTITUTE(_xlfn.TEXTAFTER(Y17,\"-\"),\"*\",\"\")-0)","v":""},{"$f":"IF(OR(ISERROR(FIND(\"-\",Z17)),AN17>'export html'!$AR$7),\"\",SUBSTITUTE(_xlfn.TEXTAFTER(Z17,\"-\"),\"*\",\"\")-0)","v":1},{"$f":"IF(OR(ISERROR(FIND(\"-\",AA17)),AO17>'export html'!$AR$7),\"\",SUBSTITUTE(_xlfn.TEXTAFTER(AA17,\"-\"),\"*\",\"\")-0)","v":1},{"$f":"IF(OR(ISERROR(FIND(\"-\",AB17)),AP17>'export html'!$AR$7),\"\",SUBSTITUTE(_xlfn.TEXTAFTER(AB17,\"-\"),\"*\",\"\")-0)","v":""},null,{"$f":"IF(OR(ISERROR(FIND(\"-\",AD17)),AR17>'export html'!$AR$7),\"\",SUBSTITUTE(_xlfn.TEXTAFTER(AD17,\"-\"),\"*\",\"\")-0)","v":""},13,{"$f":"IF(OR(ISERROR(FIND(\"-\",Q17)),AE17<='export html'!$AR$7),\"\",SUBSTITUTE(_xlfn.TEXTAFTER(Q17,\"-\"),\"*\",\"\")-0)","v":1},{"$f":"IF(OR(ISERROR(FIND(\"-\",R17)),AF17<='export html'!$AR$7),\"\",SUBSTITUTE(_xlfn.TEXTAFTER(R17,\"-\"),\"*\",\"\")-0)","v":2},{"$f":"IF(OR(ISERROR(FIND(\"-\",S17)),AG17<='export html'!$AR$7),\"\",SUBSTITUTE(_xlfn.TEXTAFTER(S17,\"-\"),\"*\",\"\")-0)","v":3},{"$f":"IF(OR(ISERROR(FIND(\"-\",T17)),AH17<='export html'!$AR$7),\"\",SUBSTITUTE(_xlfn.TEXTAFTER(T17,\"-\"),\"*\",\"\")-0)","v":""},{"$f":"IF(OR(ISERROR(FIND(\"-\",U17)),AI17<='export html'!$AR$7),\"\",SUBSTITUTE(_xlfn.TEXTAFTER(U17,\"-\"),\"*\",\"\")-0)","v":""},{"$f":"IF(OR(ISERROR(FIND(\"-\",V17)),AJ17<='export html'!$AR$7),\"\",SUBSTITUTE(_xlfn.TEXTAFTER(V17,\"-\"),\"*\",\"\")-0)","v":1},{"$f":"IF(OR(ISERROR(FIND(\"-\",W17)),AK17<='export html'!$AR$7),\"\",SUBSTITUTE(_xlfn.TEXTAFTER(W17,\"-\"),\"*\",\"\")-0)","v":""},{"$f":"IF(OR(ISERROR(FIND(\"-\",X17)),AL17<='export html'!$AR$7),\"\",SUBSTITUTE(_xlfn.TEXTAFTER(X17,\"-\"),\"*\",\"\")-0)","v":""},{"$f":"IF(OR(ISERROR(FIND(\"-\",Y17)),AM17<='export html'!$AR$7),\"\",SUBSTITUTE(_xlfn.TEXTAFTER(Y17,\"-\"),\"*\",\"\")-0)","v":0},{"$f":"IF(OR(ISERROR(FIND(\"-\",Z17)),AN17<='export html'!$AR$7),\"\",SUBSTITUTE(_xlfn.TEXTAFTER(Z17,\"-\"),\"*\",\"\")-0)","v":""},{"$f":"IF(OR(ISERROR(FIND(\"-\",AA17)),AO17<='export html'!$AR$7),\"\",SUBSTITUTE(_xlfn.TEXTAFTER(AA17,\"-\"),\"*\",\"\")-0)","v":""},{"$f":"IF(OR(ISERROR(FIND(\"-\",AB17)),AP17<='export html'!$AR$7),\"\",SUBSTITUTE(_xlfn.TEXTAFTER(AB17,\"-\"),\"*\",\"\")-0)","v":2},null,{"$f":"IF(OR(ISERROR(FIND(\"-\",AD17)),AR17<='export html'!$AR$7),\"\",SUBSTITUTE(_xlfn.TEXTAFTER(AD17,\"-\"),\"*\",\"\")-0)","v":5},13]
[null,null,null,{"$f":"IF('export html'!A3=\"\",\"\",'export html'!A3)","v":"2025-03-29"},{"$f":"IF('export html'!B3=\"\",\"\",'export html'!B3)","v":25},{"$f":"IF('export html'!C3=\"\",\"\",'export html'!C3)","v":"SC Duffel - Jolika"},null,null,null,null,null,null,null,{"$f":"IF('export html'!D3=\"\",\"\",'export html'!D3)","v":"10-0"},null,null,null,null,null,null,null,null,null,null,null,null,null,null,null,null,null,null,null,null,null,null,null,null,null,null,null,null,null,null,null,null,null,null,null,null,null,null,null,null,null,null,null,null,null,null,null,null,null,null,null,null,null,null,null,null,null,null,null,14,{"$f":"IF(OR(ISERROR(FIND(\"-\",Q18)),AE18>'export html'!$AR$7),\"\",SUBSTITUTE(_xlfn.TEXTAFTER(Q18,\"-\"),\"*\",\"\")-0)","v":""},{"$f":"IF(OR(ISERROR(FIND(\"-\",R18)),AF18>'export html'!$AR$7),\"\",SUBSTITUTE(_xlfn.TEXTAFTER(R18,\"-\"),\"*\",\"\")-0)","v":""},{"$f":"IF(OR(ISERROR(FIND(\"-\",S18)),AG18>'export html'!$AR$7),\"\",SUBSTITUTE(_xlfn.TEXTAFTER(S18,\"-\"),\"*\",\"\")-0)","v":""},{"$f":"IF(OR(ISERROR(FIND(\"-\",T18)),AH18>'export html'!$AR$7),\"\",SUBSTITUTE(_xlfn.TEXTAFTER(T18,\"-\"),\"*\",\"\")-0)","v":2},{"$f":"IF(OR(ISERROR(FIND(\"-\",U18)),AI18>'export html'!$AR$7),\"\",SUBSTITUTE(_xlfn.TEXTAFTER(U18,\"-\"),\"*\",\"\")-0)","v":""},{"$f":"IF(OR(ISERROR(FIND(\"-\",V18)),AJ18>'export html'!$AR$7),\"\",SUBSTITUTE(_xlfn.TEXTAFTER(V18,\"-\"),\"*\",\"\")-0)","v":4},{"$f":"IF(OR(ISERROR(FIND(\"-\",W18)),AK18>'export html'!$AR$7),\"\",SUBSTITUTE(_xlfn.TEXTAFTER(W18,\"-\"),\"*\",\"\")-0)","v":3},{"$f":"IF(OR(ISERROR(FIND(\"-\",X18)),AL18>'export html'!$AR$7),\"\",SUBSTITUTE(_xlfn.TEXTAFTER(X18,\"-\"),\"*\",\"\")-0)","v":""},{"$f":"IF(OR(ISERROR(FIND(\"-\",Y18)),AM18>'export html'!$AR$7),\"\",SUBSTITUTE(_xlfn.TEXTAFTER(Y18,\"-\"),\"*\",\"\")-0)","v":""},{"$f":"IF(OR(ISERROR(FIND(\"-\",Z18)),AN18>'export html'!$AR$7),\"\",SUBSTITUTE(_xlfn.TEXTAFTER(Z18,\"-\"),\"*\",\"\")-0)","v":""},{"$f":"IF(OR(ISERROR(FIND(\"-\",AA18)),AO18>'export html'!$AR$7),\"\",SUBSTITUTE(_xlfn.TEXTAFTER(AA18,\"-\"),\"*\",\"\")-0)","v":2},{"$f":"IF(OR(ISERROR(FIND(\"-\",AB18)),AP18>'export html'!$AR$7),\"\",SUBSTITUTE(_xlfn.TEXTAFTER(AB18,\"-\"),\"*\",\"\")-0)","v":4},{"$f":"IF(OR(ISERROR(FIND(\"-\",AC18)),AQ18>'export html'!$AR$7),\"\",SUBSTITUTE(_xlfn.TEXTAFTER(AC18,\"-\"),\"*\",\"\")-0)","v":1},null,14,{"$f":"IF(OR(ISERROR(FIND(\"-\",Q18)),AE18<='export html'!$AR$7),\"\",SUBSTITUTE(_xlfn.TEXTAFTER(Q18,\"-\"),\"*\",\"\")-0)","v":1},{"$f":"IF(OR(ISERROR(FIND(\"-\",R18)),AF18<='export html'!$AR$7),\"\",SUBSTITUTE(_xlfn.TEXTAFTER(R18,\"-\"),\"*\",\"\")-0)","v":""},{"$f":"IF(OR(ISERROR(FIND(\"-\",S18)),AG18<='export html'!$AR$7),\"\",SUBSTITUTE(_xlfn.TEXTAFTER(S18,\"-\"),\"*\",\"\")-0)","v":3},{"$f":"IF(OR(ISERROR(FIND(\"-\",T18)),AH18<='export html'!$AR$7),\"\",SUBSTITUTE(_xlfn.TEXTAFTER(T18,\"-\"),\"*\",\"\")-0)","v":""},{"$f":"IF(OR(ISERROR(FIND(\"-\",U18)),AI18<='export html'!$AR$7),\"\",SUBSTITUTE(_xlfn.TEXTAFTER(U18,\"-\"),\"*\",\"\")-0)","v":3},{"$f":"IF(OR(ISERROR(FIND(\"-\",V18)),AJ18<='export html'!$AR$7),\"\",SUBSTITUTE(_xlfn.TEXTAFTER(V18,\"-\"),\"*\",\"\")-0)","v":""},{"$f":"IF(OR(ISERROR(FIND(\"-\",W18)),AK18<='export html'!$AR$7),\"\",SUBSTITUTE(_xlfn.TEXTAFTER(W18,\"-\"),\"*\",\"\")-0)","v":""},{"$f":"IF(OR(ISERROR(FIND(\"-\",X18)),AL18<='export html'!$AR$7),\"\",SUBSTITUTE(_xlfn.TEXTAFTER(X18,\"-\"),\"*\",\"\")-0)","v":5},{"$f":"IF(OR(ISERROR(FIND(\"-\",Y18)),AM18<='export html'!$AR$7),\"\",SUBSTITUTE(_xlfn.TEXTAFTER(Y18,\"-\"),\"*\",\"\")-0)","v":3},{"$f":"IF(OR(ISERROR(FIND(\"-\",Z18)),AN18<='export html'!$AR$7),\"\",SUBSTITUTE(_xlfn.TEXTAFTER(Z18,\"-\"),\"*\",\"\")-0)","v":7},{"$f":"IF(OR(ISERROR(FIND(\"-\",AA18)),AO18<='export html'!$AR$7),\"\",SUBSTITUTE(_xlfn.TEXTAFTER(AA18,\"-\"),\"*\",\"\")-0)","v":""},{"$f":"IF(OR(ISERROR(FIND(\"-\",AB18)),AP18<='export html'!$AR$7),\"\",SUBSTITUTE(_xlfn.TEXTAFTER(AB18,\"-\"),\"*\",\"\")-0)","v":""},{"$f":"IF(OR(ISERROR(FIND(\"-\",AC18)),AQ18<='export html'!$AR$7),\"\",SUBSTITUTE(_xlfn.TEXTAFTER(AC18,\"-\"),\"*\",\"\")-0)","v":""},null,14]
[null,null,null,{"$f":"IF('export html'!A4=\"\",\"\",'export html'!A4)","v":"2025-03-30"},{"$f":"IF('export html'!B4=\"\",\"\",'export html'!B4)","v":25},{"$f":"IF('export html'!C4=\"\",\"\",'export html'!C4)","v":"Antwerp Global - Lucyvo"},null,null,null,null,null,null,null,{"$f":"IF('export html'!D4=\"\",\"\",'export html'!D4)","v":"4-0"},null,null,null,null,null,null,null,null,null,null,null,null,null,null,null,null,null,null,null,null,null,null,null,null,null,null,null,null,null,null,null,null,null,null,null,null,null,null,null,null,null,null,null,null,null,null,null,null,null,null,null,null,null,null,null,null,null,null,null,null,1,2,3,4,5,6,7,8,9,10,11,12,13,14,null,1,2,3,4,5,6,7,8,9,10,11,12,13,14]
[null,null,null,{"$f":"IF('export html'!A5=\"\",\"\",'export html'!A5)","v":"2025-03-30"},{"$f":"IF('export html'!B5=\"\",\"\",'export html'!B5)","v":25},{"$f":"IF('export html'!C5=\"\",\"\",'export html'!C5)","v":"Bar Patron - Corum"},null,null,null,null,null,null,null,{"$f":"IF('export html'!D5=\"\",\"\",'export html'!D5)","v":"4-1"},null,null,null,null,null,null,null,null,null,null,null,null,null,null,null,null,null,null,null,null,null,null,null,null,null,null,null,null,null,null,null,null,null,null,null,null,null,null,null,null,null,null,null,null,null,null,null,null,null,null,null,null,null,null,null,null,null,null,null,1,null,{"$f":"IF(OR(ISERROR(FIND(\"-\",R5)),AF5>'export html'!$AR$7),\"\",IF(AND(LEFT(R5)=\"*\",RIGHT(R5)=\"*\"),\"ff\",IF(BX5>BX20,\"t\",IF(BX5<BX20,\"u\",\"g\"))))","v":"t"},{"$f":"IF(OR(ISERROR(FIND(\"-\",S5)),AG5>'export html'!$AR$7),\"\",IF(AND(LEFT(S5)=\"*\",RIGHT(S5)=\"*\"),\"ff\",IF(BY5>BY20,\"t\",IF(BY5<BY20,\"u\",\"g\"))))","v":"g"},{"$f":"IF(OR(ISERROR(FIND(\"-\",T5)),AH5>'export html'!$AR$7),\"\",IF(AND(LEFT(T5)=\"*\",RIGHT(T5)=\"*\"),\"ff\",IF(BZ5>BZ20,\"t\",IF(BZ5<BZ20,\"u\",\"g\"))))","v":""},{"$f":"IF(OR(ISERROR(FIND(\"-\",U5)),AI5>'export html'!$AR$7),\"\",IF(AND(LEFT(U5)=\"*\",RIGHT(U5)=\"*\"),\"ff\",IF(CA5>CA20,\"t\",IF(CA5<CA20,\"u\",\"g\"))))","v":""},{"$f":"IF(OR(ISERROR(FIND(\"-\",V5)),AJ5>'export html'!$AR$7),\"\",IF(AND(LEFT(V5)=\"*\",RIGHT(V5)=\"*\"),\"ff\",IF(CB5>CB20,\"t\",IF(CB5<CB20,\"u\",\"g\"))))","v":"u"},{"$f":"IF(OR(ISERROR(FIND(\"-\",W5)),AK5>'export html'!$AR$7),\"\",IF(AND(LEFT(W5)=\"*\",RIGHT(W5)=\"*\"),\"ff\",IF(CC5>CC20,\"t\",IF(CC5<CC20,\"u\",\"g\"))))","v":""},{"$f":"IF(OR(ISERROR(FIND(\"-\",X5)),AL5>'export html'!$AR$7),\"\",IF(AND(LEFT(X5)=\"*\",RIGHT(X5)=\"*\"),\"ff\",IF(CD5>CD20,\"t\",IF(CD5<CD20,\"u\",\"g\"))))","v":""},{"$f":"IF(OR(ISERROR(FIND(\"-\",Y5)),AM5>'export html'!$AR$7),\"\",IF(AND(LEFT(Y5)=\"*\",RIGHT(Y5)=\"*\"),\"ff\",IF(CE5>CE20,\"t\",IF(CE5<CE20,\"u\",\"g\"))))","v":"t"},{"$f":"IF(OR(ISERROR(FIND(\"-\",Z5)),AN5>'export html'!$AR$7),\"\",IF(AND(LEFT(Z5)=\"*\",RIGHT(Z5)=\"*\"),\"ff\",IF(CF5>CF20,\"t\",IF(CF5<CF20,\"u\",\"g\"))))","v":""},{"$f":"IF(OR(ISERROR(FIND(\"-\",AA5)),AO5>'export html'!$AR$7),\"\",IF(AND(LEFT(AA5)=\"*\",RIGHT(AA5)=\"*\"),\"ff\",IF(CG5>CG20,\"t\",IF(CG5<CG20,\"u\",\"g\"))))","v":""},{"$f":"IF(OR(ISERROR(FIND(\"-\",AB5)),AP5>'export html'!$AR$7),\"\",IF(AND(LEFT(AB5)=\"*\",RIGHT(AB5)=\"*\"),\"ff\",IF(CH5>CH20,\"t\",IF(CH5<CH20,\"u\",\"g\"))))","v":"t"},{"$f":"IF(OR(ISERROR(FIND(\"-\",AC5)),AQ5>'export html'!$AR$7),\"\",IF(AND(LEFT(AC5)=\"*\",RIGHT(AC5)=\"*\"),\"ff\",IF(CI5>CI20,\"t\",IF(CI5<CI20,\"u\",\"g\"))))","v":"t"},{"$f":"IF(OR(ISERROR(FIND(\"-\",AD5)),AR5>'export html'!$AR$7),\"\",IF(AND(LEFT(AD5)=\"*\",RIGHT(AD5)=\"*\"),\"ff\",IF(CJ5>CJ20,\"t\",IF(CJ5<CJ20,\"u\",\"g\"))))","v":"g"},1,null,{"$f":"IF(OR(ISERROR(FIND(\"-\",R5)),AF5<='export html'!$AR$7),\"\",IF(AND(LEFT(R5)=\"*\",RIGHT(R5)=\"*\"),\"ff\",IF(CM5>CM20,\"t\",IF(CM5<CM20,\"u\",\"g\"))))","v":""},{"$f":"IF(OR(ISERROR(FIND(\"-\",S5)),AG5<='export html'!$AR$7),\"\",IF(AND(LEFT(S5)=\"*\",RIGHT(S5)=\"*\"),\"ff\",IF(CN5>CN20,\"t\",IF(CN5<CN20,\"u\",\"g\"))))","v":""},{"$f":"IF(OR(ISERROR(FIND(\"-\",T5)),AH5<='export html'!$AR$7),\"\",IF(AND(LEFT(T5)=\"*\",RIGHT(T5)=\"*\"),\"ff\",IF(CO5>CO20,\"t\",IF(CO5<CO20,\"u\",\"g\"))))","v":"t"},{"$f":"IF(OR(ISERROR(FIND(\"-\",U5)),AI5<='export html'!$AR$7),\"\",IF(AND(LEFT(U5)=\"*\",RIGHT(U5)=\"*\"),\"ff\",IF(CP5>CP20,\"t\",IF(CP5<CP20,\"u\",\"g\"))))","v":"t"},{"$f":"IF(OR(ISERROR(FIND(\"-\",V5)),AJ5<='export html'!$AR$7),\"\",IF(AND(LEFT(V5)=\"*\",RIGHT(V5)=\"*\"),\"ff\",IF(CQ5>CQ20,\"t\",IF(CQ5<CQ20,\"u\",\"g\"))))","v":""},{"$f":"IF(OR(ISERROR(FIND(\"-\",W5)),AK5<='export html'!$AR$7),\"\",IF(AND(LEFT(W5)=\"*\",RIGHT(W5)=\"*\"),\"ff\",IF(CR5>CR20,\"t\",IF(CR5<CR20,\"u\",\"g\"))))","v":"t"},{"$f":"IF(OR(ISERROR(FIND(\"-\",X5)),AL5<='export html'!$AR$7),\"\",IF(AND(LEFT(X5)=\"*\",RIGHT(X5)=\"*\"),\"ff\",IF(CS5>CS20,\"t\",IF(CS5<CS20,\"u\",\"g\"))))","v":"t"},{"$f":"IF(OR(ISERROR(FIND(\"-\",Y5)),AM5<='export html'!$AR$7),\"\",IF(AND(LEFT(Y5)=\"*\",RIGHT(Y5)=\"*\"),\"ff\",IF(CT5>CT20,\"t\",IF(CT5<CT20,\"u\",\"g\"))))","v":""},{"$f":"IF(OR(ISERROR(FIND(\"-\",Z5)),AN5<='export html'!$AR$7),\"\",IF(AND(LEFT(Z5)=\"*\",RIGHT(Z5)=\"*\"),\"ff\",IF(CU5>CU20,\"t\",IF(CU5<CU20,\"u\",\"g\"))))","v":"u"},{"$f":"IF(OR(ISERROR(FIND(\"-\",AA5)),AO5<='export html'!$AR$7),\"\",IF(AND(LEFT(AA5)=\"*\",RIGHT(AA5)=\"*\"),\"ff\",IF(CV5>CV20,\"t\",IF(CV5<CV20,\"u\",\"g\"))))","v":"t"},{"$f":"IF(OR(ISERROR(FIND(\"-\",AB5)),AP5<='export html'!$AR$7),\"\",IF(AND(LEFT(AB5)=\"*\",RIGHT(AB5)=\"*\"),\"ff\",IF(CW5>CW20,\"t\",IF(CW5<CW20,\"u\",\"g\"))))","v":""},{"$f":"IF(OR(ISERROR(FIND(\"-\",AC5)),AQ5<='export html'!$AR$7),\"\",IF(AND(LEFT(AC5)=\"*\",RIGHT(AC5)=\"*\"),\"ff\",IF(CX5>CX20,\"t\",IF(CX5<CX20,\"u\",\"g\"))))","v":""},{"$f":"IF(OR(ISERROR(FIND(\"-\",AD5)),AR5<='export html'!$AR$7),\"\",IF(AND(LEFT(AD5)=\"*\",RIGHT(AD5)=\"*\"),\"ff\",IF(CY5>CY20,\"t\",IF(CY5<CY20,\"u\",\"g\"))))","v":""},1]
[null,null,null,{"$f":"IF('export html'!A6=\"\",\"\",'export html'!A6)","v":"2025-03-30"},{"$f":"IF('export html'!B6=\"\",\"\",'export html'!B6)","v":25},{"$f":"IF('export html'!C6=\"\",\"\",'export html'!C6)","v":"Bariton - Yerevan United"},null,null,null,null,null,null,null,{"$f":"IF('export html'!D6=\"\",\"\",'export html'!D6)","v":"1-4"},null,null,null,null,null,null,null,null,null,null,null,null,null,null,null,null,null,null,null,null,null,null,null,null,null,null,null,null,null,null,null,null,null,null,null,null,null,null,null,null,null,null,null,null,null,null,null,null,null,null,null,null,null,null,null,null,null,null,null,2,{"$f":"IF(OR(ISERROR(FIND(\"-\",Q6)),AE6>'export html'!$AR$7),\"\",IF(AND(LEFT(Q6)=\"*\",RIGHT(Q6)=\"*\"),\"ff\",IF(BW6>BW21,\"t\",IF(BW6<BW21,\"u\",\"g\"))))","v":""},null,{"$f":"IF(OR(ISERROR(FIND(\"-\",S6)),AG6>'export html'!$AR$7),\"\",IF(AND(LEFT(S6)=\"*\",RIGHT(S6)=\"*\"),\"ff\",IF(BY6>BY21,\"t\",IF(BY6<BY21,\"u\",\"g\"))))","v":""},{"$f":"IF(OR(ISERROR(FIND(\"-\",T6)),AH6>'export html'!$AR$7),\"\",IF(AND(LEFT(T6)=\"*\",RIGHT(T6)=\"*\"),\"ff\",IF(BZ6>BZ21,\"t\",IF(BZ6<BZ21,\"u\",\"g\"))))","v":""},{"$f":"IF(OR(ISERROR(FIND(\"-\",U6)),AI6>'export html'!$AR$7),\"\",IF(AND(LEFT(U6)=\"*\",RIGHT(U6)=\"*\"),\"ff\",IF(CA6>CA21,\"t\",IF(CA6<CA21,\"u\",\"g\"))))","v":""},{"$f":"IF(OR(ISERROR(FIND(\"-\",V6)),AJ6>'export html'!$AR$7),\"\",IF(AND(LEFT(V6)=\"*\",RIGHT(V6)=\"*\"),\"ff\",IF(CB6>CB21,\"t\",IF(CB6<CB21,\"u\",\"g\"))))","v":"u"},{"$f":"IF(OR(ISERROR(FIND(\"-\",W6)),AK6>'export html'!$AR$7),\"\",IF(AND(LEFT(W6)=\"*\",RIGHT(W6)=\"*\"),\"ff\",IF(CC6>CC21,\"t\",IF(CC6<CC21,\"u\",\"g\"))))","v":"t"},{"$f":"IF(OR(ISERROR(FIND(\"-\",X6)),AL6>'export html'!$AR$7),\"\",IF(AND(LEFT(X6)=\"*\",RIGHT(X6)=\"*\"),\"ff\",IF(CD6>CD21,\"t\",IF(CD6<CD21,\"u\",\"g\"))))","v":""},{"$f":"IF(OR(ISERROR(FIND(\"-\",Y6)),AM6>'export html'!$AR$7),\"\",IF(AND(LEFT(Y6)=\"*\",RIGHT(Y6)=\"*\"),\"ff\",IF(CE6>CE21,\"t\",IF(CE6<CE21,\"u\",\"g\"))))","v":"t"},{"$f":"IF(OR(ISERROR(FIND(\"-\",Z6)),AN6>'export html'!$AR$7),\"\",IF(AND(LEFT(Z6)=\"*\",RIGHT(Z6)=\"*\"),\"ff\",IF(CF6>CF21,\"t\",IF(CF6<CF21,\"u\",\"g\"))))","v":""},{"$f":"IF(OR(ISERROR(FIND(\"-\",AA6)),AO6>'export html'!$AR$7),\"\",IF(AND(LEFT(AA6)=\"*\",RIGHT(AA6)=\"*\"),\"ff\",IF(CG6>CG21,\"t\",IF(CG6<CG21,\"u\",\"g\"))))","v":"t"},{"$f":"IF(OR(ISERROR(FIND(\"-\",AB6)),AP6>'export html'!$AR$7),\"\",IF(AND(LEFT(AB6)=\"*\",RIGHT(AB6)=\"*\"),\"ff\",IF(CH6>CH21,\"t\",IF(CH6<CH21,\"u\",\"g\"))))","v":"g"},{"$f":"IF(OR(ISERROR(FIND(\"-\",AC6)),AQ6>'export html'!$AR$7),\"\",IF(AND(LEFT(AC6)=\"*\",RIGHT(AC6)=\"*\"),\"ff\",IF(CI6>CI21,\"t\",IF(CI6<CI21,\"u\",\"g\"))))","v":"t"},{"$f":"IF(OR(ISERROR(FIND(\"-\",AD6)),AR6>'export html'!$AR$7),\"\",IF(AND(LEFT(AD6)=\"*\",RIGHT(AD6)=\"*\"),\"ff\",IF(CJ6>CJ21,\"t\",IF(CJ6<CJ21,\"u\",\"g\"))))","v":"u"},2,{"$f":"IF(OR(ISERROR(FIND(\"-\",Q6)),AE6<='export html'!$AR$7),\"\",IF(AND(LEFT(Q6)=\"*\",RIGHT(Q6)=\"*\"),\"ff\",IF(CL6>CL21,\"t\",IF(CL6<CL21,\"u\",\"g\"))))","v":"t"},null,{"$f":"IF(OR(ISERROR(FIND(\"-\",S6)),AG6<='export html'!$AR$7),\"\",IF(AND(LEFT(S6)=\"*\",RIGHT(S6)=\"*\"),\"ff\",IF(CN6>CN21,\"t\",IF(CN6<CN21,\"u\",\"g\"))))","v":"g"},{"$f":"IF(OR(ISERROR(FIND(\"-\",T6)),AH6<='export html'!$AR$7),\"\",IF(AND(LEFT(T6)=\"*\",RIGHT(T6)=\"*\"),\"ff\",IF(CO6>CO21,\"t\",IF(CO6<CO21,\"u\",\"g\"))))","v":"t"},{"$f":"IF(OR(ISERROR(FIND(\"-\",U6)),AI6<='export html'!$AR$7),\"\",IF(AND(LEFT(U6)=\"*\",RIGHT(U6)=\"*\"),\"ff\",IF(CP6>CP21,\"t\",IF(CP6<CP21,\"u\",\"g\"))))","v":"t"},{"$f":"IF(OR(ISERROR(FIND(\"-\",V6)),AJ6<='export html'!$AR$7),\"\",IF(AND(LEFT(V6)=\"*\",RIGHT(V6)=\"*\"),\"ff\",IF(CQ6>CQ21,\"t\",IF(CQ6<CQ21,\"u\",\"g\"))))","v":""},{"$f":"IF(OR(ISERROR(FIND(\"-\",W6)),AK6<='export html'!$AR$7),\"\",IF(AND(LEFT(W6)=\"*\",RIGHT(W6)=\"*\"),\"ff\",IF(CR6>CR21,\"t\",IF(CR6<CR21,\"u\",\"g\"))))","v":""},{"$f":"IF(OR(ISERROR(FIND(\"-\",X6)),AL6<='export html'!$AR$7),\"\",IF(AND(LEFT(X6)=\"*\",RIGHT(X6)=\"*\"),\"ff\",IF(CS6>CS21,\"t\",IF(CS6<CS21,\"u\",\"g\"))))","v":"g"},{"$f":"IF(OR(ISERROR(FIND(\"-\",Y6)),AM6<='export html'!$AR$7),\"\",IF(AND(LEFT(Y6)=\"*\",RIGHT(Y6)=\"*\"),\"ff\",IF(CT6>CT21,\"t\",IF(CT6<CT21,\"u\",\"g\"))))","v":""},{"$f":"IF(OR(ISERROR(FIND(\"-\",Z6)),AN6<='export html'!$AR$7),\"\",IF(AND(LEFT(Z6)=\"*\",RIGHT(Z6)=\"*\"),\"ff\",IF(CU6>CU21,\"t\",IF(CU6<CU21,\"u\",\"g\"))))","v":"t"},{"$f":"IF(OR(ISERROR(FIND(\"-\",AA6)),AO6<='export html'!$AR$7),\"\",IF(AND(LEFT(AA6)=\"*\",RIGHT(AA6)=\"*\"),\"ff\",IF(CV6>CV21,\"t\",IF(CV6<CV21,\"u\",\"g\"))))","v":""},{"$f":"IF(OR(ISERROR(FIND(\"-\",AB6)),AP6<='export html'!$AR$7),\"\",IF(AND(LEFT(AB6)=\"*\",RIGHT(AB6)=\"*\"),\"ff\",IF(CW6>CW21,\"t\",IF(CW6<CW21,\"u\",\"g\"))))","v":""},{"$f":"IF(OR(ISERROR(FIND(\"-\",AC6)),AQ6<='export html'!$AR$7),\"\",IF(AND(LEFT(AC6)=\"*\",RIGHT(AC6)=\"*\"),\"ff\",IF(CX6>CX21,\"t\",IF(CX6<CX21,\"u\",\"g\"))))","v":""},{"$f":"IF(OR(ISERROR(FIND(\"-\",AD6)),AR6<='export html'!$AR$7),\"\",IF(AND(LEFT(AD6)=\"*\",RIGHT(AD6)=\"*\"),\"ff\",IF(CY6>CY21,\"t\",IF(CY6<CY21,\"u\",\"g\"))))","v":""},2]
[null,null,null,{"$f":"IF('export html'!A7=\"\",\"\",'export html'!A7)","v":"2025-03-30"},{"$f":"IF('export html'!B7=\"\",\"\",'export html'!B7)","v":25},{"$f":"IF('export html'!C7=\"\",\"\",'export html'!C7)","v":"Goka - Daltons"},null,null,null,null,null,null,null,{"$f":"IF('export html'!D7=\"\",\"\",'export html'!D7)","v":"0-2"},null,null,null,null,null,null,null,null,null,null,null,null,null,null,null,null,null,null,null,null,null,null,null,null,null,null,null,null,null,null,null,null,null,null,null,null,null,null,null,null,null,null,null,null,null,null,null,null,null,null,null,null,null,null,null,null,null,null,null,3,{"$f":"IF(OR(ISERROR(FIND(\"-\",Q7)),AE7>'export html'!$AR$7),\"\",IF(AND(LEFT(Q7)=\"*\",RIGHT(Q7)=\"*\"),\"ff\",IF(BW7>BW22,\"t\",IF(BW7<BW22,\"u\",\"g\"))))","v":""},{"$f":"IF(OR(ISERROR(FIND(\"-\",R7)),AF7>'export html'!$AR$7),\"\",IF(AND(LEFT(R7)=\"*\",RIGHT(R7)=\"*\"),\"ff\",IF(BX7>BX22,\"t\",IF(BX7<BX22,\"u\",\"g\"))))","v":"t"},null,{"$f":"IF(OR(ISERROR(FIND(\"-\",T7)),AH7>'export html'!$AR$7),\"\",IF(AND(LEFT(T7)=\"*\",RIGHT(T7)=\"*\"),\"ff\",IF(BZ7>BZ22,\"t\",IF(BZ7<BZ22,\"u\",\"g\"))))","v":""},{"$f":"IF(OR(ISERROR(FIND(\"-\",U7)),AI7>'export html'!$AR$7),\"\",IF(AND(LEFT(U7)=\"*\",RIGHT(U7)=\"*\"),\"ff\",IF(CA7>CA22,\"t\",IF(CA7<CA22,\"u\",\"g\"))))","v":""},{"$f":"IF(OR(ISERROR(FIND(\"-\",V7)),AJ7>'export html'!$AR$7),\"\",IF(AND(LEFT(V7)=\"*\",RIGHT(V7)=\"*\"),\"ff\",IF(CB7>CB22,\"t\",IF(CB7<CB22,\"u\",\"g\"))))","v":"g"},{"$f":"IF(OR(ISERROR(FIND(\"-\",W7)),AK7>'export html'!$AR$7),\"\",IF(AND(LEFT(W7)=\"*\",RIGHT(W7)=\"*\"),\"ff\",IF(CC7>CC22,\"t\",IF(CC7<CC22,\"u\",\"g\"))))","v":"t"},{"$f":"IF(OR(ISERROR(FIND(\"-\",X7)),AL7>'export html'!$AR$7),\"\",IF(AND(LEFT(X7)=\"*\",RIGHT(X7)=\"*\"),\"ff\",IF(CD7>CD22,\"t\",IF(CD7<CD22,\"u\",\"g\"))))","v":""},{"$f":"IF(OR(ISERROR(FIND(\"-\",Y7)),AM7>'export html'!$AR$7),\"\",IF(AND(LEFT(Y7)=\"*\",RIGHT(Y7)=\"*\"),\"ff\",IF(CE7>CE22,\"t\",IF(CE7<CE22,\"u\",\"g\"))))","v":"t"},{"$f":"IF(OR(ISERROR(FIND(\"-\",Z7)),AN7>'export html'!$AR$7),\"\",IF(AND(LEFT(Z7)=\"*\",RIGHT(Z7)=\"*\"),\"ff\",IF(CF7>CF22,\"t\",IF(CF7<CF22,\"u\",\"g\"))))","v":""},{"$f":"IF(OR(ISERROR(FIND(\"-\",AA7)),AO7>'export html'!$AR$7),\"\",IF(AND(LEFT(AA7)=\"*\",RIGHT(AA7)=\"*\"),\"ff\",IF(CG7>CG22,\"t\",IF(CG7<CG22,\"u\",\"g\"))))","v":""},{"$f":"IF(OR(ISERROR(FIND(\"-\",AB7)),AP7>'export html'!$AR$7),\"\",IF(AND(LEFT(AB7)=\"*\",RIGHT(AB7)=\"*\"),\"ff\",IF(CH7>CH22,\"t\",IF(CH7<CH22,\"u\",\"g\"))))","v":"u"},{"$f":"IF(OR(ISERROR(FIND(\"-\",AC7)),AQ7>'export html'!$AR$7),\"\",IF(AND(LEFT(AC7)=\"*\",RIGHT(AC7)=\"*\"),\"ff\",IF(CI7>CI22,\"t\",IF(CI7<CI22,\"u\",\"g\"))))","v":"u"},{"$f":"IF(OR(ISERROR(FIND(\"-\",AD7)),AR7>'export html'!$AR$7),\"\",IF(AND(LEFT(AD7)=\"*\",RIGHT(AD7)=\"*\"),\"ff\",IF(CJ7>CJ22,\"t\",IF(CJ7<CJ22,\"u\",\"g\"))))","v":"g"},3,{"$f":"IF(OR(ISERROR(FIND(\"-\",Q7)),AE7<='export html'!$AR$7),\"\",IF(AND(LEFT(Q7)=\"*\",RIGHT(Q7)=\"*\"),\"ff\",IF(CL7>CL22,\"t\",IF(CL7<CL22,\"u\",\"g\"))))","v":"u"},{"$f":"IF(OR(ISERROR(FIND(\"-\",R7)),AF7<='export html'!$AR$7),\"\",IF(AND(LEFT(R7)=\"*\",RIGHT(R7)=\"*\"),\"ff\",IF(CM7>CM22,\"t\",IF(CM7<CM22,\"u\",\"g\"))))","v":""},null,{"$f":"IF(OR(ISERROR(FIND(\"-\",T7)),AH7<='export html'!$AR$7),\"\",IF(AND(LEFT(T7)=\"*\",RIGHT(T7)=\"*\"),\"ff\",IF(CO7>CO22,\"t\",IF(CO7<CO22,\"u\",\"g\"))))","v":"t"},{"$f":"IF(OR(ISERROR(FIND(\"-\",U7)),AI7<='export html'!$AR$7),\"\",IF(AND(LEFT(U7)=\"*\",RIGHT(U7)=\"*\"),\"ff\",IF(CP7>CP22,\"t\",IF(CP7<CP22,\"u\",\"g\"))))","v":"t"},{"$f":"IF(OR(ISERROR(FIND(\"-\",V7)),AJ7<='export html'!$AR$7),\"\",IF(AND(LEFT(V7)=\"*\",RIGHT(V7)=\"*\"),\"ff\",IF(CQ7>CQ22,\"t\",IF(CQ7<CQ22,\"u\",\"g\"))))","v":""},{"$f":"IF(OR(ISERROR(FIND(\"-\",W7)),AK7<='export html'!$AR$7),\"\",IF(AND(LEFT(W7)=\"*\",RIGHT(W7)=\"*\"),\"ff\",IF(CR7>CR22,\"t\",IF(CR7<CR22,\"u\",\"g\"))))","v":""},{"$f":"IF(OR(ISERROR(FIND(\"-\",X7)),AL7<='export html'!$AR$7),\"\",IF(AND(LEFT(X7)=\"*\",RIGHT(X7)=\"*\"),\"ff\",IF(CS7>CS22,\"t\",IF(CS7<CS22,\"u\",\"g\"))))","v":"t"},{"$f":"IF(OR(ISERROR(FIND(\"-\",Y7)),AM7<='export html'!$AR$7),\"\",IF(AND(LEFT(Y7)=\"*\",RIGHT(Y7)=\"*\"),\"ff\",IF(CT7>CT22,\"t\",IF(CT7<CT22,\"u\",\"g\"))))","v":""},{"$f":"IF(OR(ISERROR(FIND(\"-\",Z7)),AN7<='export html'!$AR$7),\"\",IF(AND(LEFT(Z7)=\"*\",RIGHT(Z7)=\"*\"),\"ff\",IF(CU7>CU22,\"t\",IF(CU7<CU22,\"u\",\"g\"))))","v":"g"},{"$f":"IF(OR(ISERROR(FIND(\"-\",AA7)),AO7<='export html'!$AR$7),\"\",IF(AND(LEFT(AA7)=\"*\",RIGHT(AA7)=\"*\"),\"ff\",IF(CV7>CV22,\"t\",IF(CV7<CV22,\"u\",\"g\"))))","v":"g"},{"$f":"IF(OR(ISERROR(FIND(\"-\",AB7)),AP7<='export html'!$AR$7),\"\",IF(AND(LEFT(AB7)=\"*\",RIGHT(AB7)=\"*\"),\"ff\",IF(CW7>CW22,\"t\",IF(CW7<CW22,\"u\",\"g\"))))","v":""},{"$f":"IF(OR(ISERROR(FIND(\"-\",AC7)),AQ7<='export html'!$AR$7),\"\",IF(AND(LEFT(AC7)=\"*\",RIGHT(AC7)=\"*\"),\"ff\",IF(CX7>CX22,\"t\",IF(CX7<CX22,\"u\",\"g\"))))","v":""},{"$f":"IF(OR(ISERROR(FIND(\"-\",AD7)),AR7<='export html'!$AR$7),\"\",IF(AND(LEFT(AD7)=\"*\",RIGHT(AD7)=\"*\"),\"ff\",IF(CY7>CY22,\"t\",IF(CY7<CY22,\"u\",\"g\"))))","v":""},3]
[null,null,null,{"$f":"IF('export html'!A8=\"\",\"\",'export html'!A8)","v":"2025-03-30"},{"$f":"IF('export html'!B8=\"\",\"\",'export html'!B8)","v":25},{"$f":"IF('export html'!C8=\"\",\"\",'export html'!C8)","v":"Racing Emblem - Sint Anneke"},null,null,null,null,null,null,null,{"$f":"IF('export html'!D8=\"\",\"\",'export html'!D8)","v":"1-1"},null,null,null,null,null,null,null,null,null,null,null,null,null,null,null,null,null,null,null,null,null,null,null,null,null,null,null,null,null,null,null,null,null,null,null,null,null,null,null,null,null,null,null,null,null,null,null,null,null,null,null,null,null,null,null,null,null,null,null,4,{"$f":"IF(OR(ISERROR(FIND(\"-\",Q8)),AE8>'export html'!$AR$7),\"\",IF(AND(LEFT(Q8)=\"*\",RIGHT(Q8)=\"*\"),\"ff\",IF(BW8>BW23,\"t\",IF(BW8<BW23,\"u\",\"g\"))))","v":"t"},{"$f":"IF(OR(ISERROR(FIND(\"-\",R8)),AF8>'export html'!$AR$7),\"\",IF(AND(LEFT(R8)=\"*\",RIGHT(R8)=\"*\"),\"ff\",IF(BX8>BX23,\"t\",IF(BX8<BX23,\"u\",\"g\"))))","v":"u"},{"$f":"IF(OR(ISERROR(FIND(\"-\",S8)),AG8>'export html'!$AR$7),\"\",IF(AND(LEFT(S8)=\"*\",RIGHT(S8)=\"*\"),\"ff\",IF(BY8>BY23,\"t\",IF(BY8<BY23,\"u\",\"g\"))))","v":"u"},null,{"$f":"IF(OR(ISERROR(FIND(\"-\",U8)),AI8>'export html'!$AR$7),\"\",IF(AND(LEFT(U8)=\"*\",RIGHT(U8)=\"*\"),\"ff\",IF(CA8>CA23,\"t\",IF(CA8<CA23,\"u\",\"g\"))))","v":"t"},{"$f":"IF(OR(ISERROR(FIND(\"-\",V8)),AJ8>'export html'!$AR$7),\"\",IF(AND(LEFT(V8)=\"*\",RIGHT(V8)=\"*\"),\"ff\",IF(CB8>CB23,\"t\",IF(CB8<CB23,\"u\",\"g\"))))","v":""},{"$f":"IF(OR(ISERROR(FIND(\"-\",W8)),AK8>'export html'!$AR$7),\"\",IF(AND(LEFT(W8)=\"*\",RIGHT(W8)=\"*\"),\"ff\",IF(CC8>CC23,\"t\",IF(CC8<CC23,\"u\",\"g\"))))","v":""},{"$f":"IF(OR(ISERROR(FIND(\"-\",X8)),AL8>'export html'!$AR$7),\"\",IF(AND(LEFT(X8)=\"*\",RIGHT(X8)=\"*\"),\"ff\",IF(CD8>CD23,\"t\",IF(CD8<CD23,\"u\",\"g\"))))","v":"u"},{"$f":"IF(OR(ISERROR(FIND(\"-\",Y8)),AM8>'export html'!$AR$7),\"\",IF(AND(LEFT(Y8)=\"*\",RIGHT(Y8)=\"*\"),\"ff\",IF(CE8>CE23,\"t\",IF(CE8<CE23,\"u\",\"g\"))))","v":"t"},{"$f":"IF(OR(ISERROR(FIND(\"-\",Z8)),AN8>'export html'!$AR$7),\"\",IF(AND(LEFT(Z8)=\"*\",RIGHT(Z8)=\"*\"),\"ff\",IF(CF8>CF23,\"t\",IF(CF8<CF23,\"u\",\"g\"))))","v":"g"},{"$f":"IF(OR(ISERROR(FIND(\"-\",AA8)),AO8>'export html'!$AR$7),\"\",IF(AND(LEFT(AA8)=\"*\",RIGHT(AA8)=\"*\"),\"ff\",IF(CG8>CG23,\"t\",IF(CG8<CG23,\"u\",\"g\"))))","v":""},{"$f":"IF(OR(ISERROR(FIND(\"-\",AB8)),AP8>'export html'!$AR$7),\"\",IF(AND(LEFT(AB8)=\"*\",RIGHT(AB8)=\"*\"),\"ff\",IF(CH8>CH23,\"t\",IF(CH8<CH23,\"u\",\"g\"))))","v":""},{"$f":"IF(OR(ISERROR(FIND(\"-\",AC8)),AQ8>'export html'!$AR$7),\"\",IF(AND(LEFT(AC8)=\"*\",RIGHT(AC8)=\"*\"),\"ff\",IF(CI8>CI23,\"t\",IF(CI8<CI23,\"u\",\"g\"))))","v":""},{"$f":"IF(OR(ISERROR(FIND(\"-\",AD8)),AR8>'export html'!$AR$7),\"\",IF(AND(LEFT(AD8)=\"*\",RIGHT(AD8)=\"*\"),\"ff\",IF(CJ8>CJ23,\"t\",IF(CJ8<CJ23,\"u\",\"g\"))))","v":""},4,{"$f":"IF(OR(ISERROR(FIND(\"-\",Q8)),AE8<='export html'!$AR$7),\"\",IF(AND(LEFT(Q8)=\"*\",RIGHT(Q8)=\"*\"),\"ff\",IF(CL8>CL23,\"t\",IF(CL8<CL23,\"u\",\"g\"))))","v":""},{"$f":"IF(OR(ISERROR(FIND(\"-\",R8)),AF8<='export html'!$AR$7),\"\",IF(AND(LEFT(R8)=\"*\",RIGHT(R8)=\"*\"),\"ff\",IF(CM8>CM23,\"t\",IF(CM8<CM23,\"u\",\"g\"))))","v":""},{"$f":"IF(OR(ISERROR(FIND(\"-\",S8)),AG8<='export html'!$AR$7),\"\",IF(AND(LEFT(S8)=\"*\",RIGHT(S8)=\"*\"),\"ff\",IF(CN8>CN23,\"t\",IF(CN8<CN23,\"u\",\"g\"))))","v":""},null,{"$f":"IF(OR(ISERROR(FIND(\"-\",U8)),AI8<='export html'!$AR$7),\"\",IF(AND(LEFT(U8)=\"*\",RIGHT(U8)=\"*\"),\"ff\",IF(CP8>CP23,\"t\",IF(CP8<CP23,\"u\",\"g\"))))","v":""},{"$f":"IF(OR(ISERROR(FIND(\"-\",V8)),AJ8<='export html'!$AR$7),\"\",IF(AND(LEFT(V8)=\"*\",RIGHT(V8)=\"*\"),\"ff\",IF(CQ8>CQ23,\"t\",IF(CQ8<CQ23,\"u\",\"g\"))))","v":"u"},{"$f":"IF(OR(ISERROR(FIND(\"-\",W8)),AK8<='export html'!$AR$7),\"\",IF(AND(LEFT(W8)=\"*\",RIGHT(W8)=\"*\"),\"ff\",IF(CR8>CR23,\"t\",IF(CR8<CR23,\"u\",\"g\"))))","v":"u"},{"$f":"IF(OR(ISERROR(FIND(\"-\",X8)),AL8<='export html'!$AR$7),\"\",IF(AND(LEFT(X8)=\"*\",RIGHT(X8)=\"*\"),\"ff\",IF(CS8>CS23,\"t\",IF(CS8<CS23,\"u\",\"g\"))))","v":""},{"$f":"IF(OR(ISERROR(FIND(\"-\",Y8)),AM8<='export html'!$AR$7),\"\",IF(AND(LEFT(Y8)=\"*\",RIGHT(Y8)=\"*\"),\"ff\",IF(CT8>CT23,\"t\",IF(CT8<CT23,\"u\",\"g\"))))","v":""},{"$f":"IF(OR(ISERROR(FIND(\"-\",Z8)),AN8<='export html'!$AR$7),\"\",IF(AND(LEFT(Z8)=\"*\",RIGHT(Z8)=\"*\"),\"ff\",IF(CU8>CU23,\"t\",IF(CU8<CU23,\"u\",\"g\"))))","v":""},{"$f":"IF(OR(ISERROR(FIND(\"-\",AA8)),AO8<='export html'!$AR$7),\"\",IF(AND(LEFT(AA8)=\"*\",RIGHT(AA8)=\"*\"),\"ff\",IF(CV8>CV23,\"t\",IF(CV8<CV23,\"u\",\"g\"))))","v":"u"},{"$f":"IF(OR(ISERROR(FIND(\"-\",AB8)),AP8<='export html'!$AR$7),\"\",IF(AND(LEFT(AB8)=\"*\",RIGHT(AB8)=\"*\"),\"ff\",IF(CW8>CW23,\"t\",IF(CW8<CW23,\"u\",\"g\"))))","v":"t"},{"$f":"IF(OR(ISERROR(FIND(\"-\",AC8)),AQ8<='export html'!$AR$7),\"\",IF(AND(LEFT(AC8)=\"*\",RIGHT(AC8)=\"*\"),\"ff\",IF(CX8>CX23,\"t\",IF(CX8<CX23,\"u\",\"g\"))))","v":"t"},{"$f":"IF(OR(ISERROR(FIND(\"-\",AD8)),AR8<='export html'!$AR$7),\"\",IF(AND(LEFT(AD8)=\"*\",RIGHT(AD8)=\"*\"),\"ff\",IF(CY8>CY23,\"t\",IF(CY8<CY23,\"u\",\"g\"))))","v":"u"},4]
[null,null,null,{"$f":"IF('export html'!A9=\"\",\"\",'export html'!A9)","v":"2025-03-30"},{"$f":"IF('export html'!B9=\"\",\"\",'export html'!B9)","v":25},{"$f":"IF('export html'!C9=\"\",\"\",'export html'!C9)","v":"Alberta Schilde - Hombeek"},null,null,null,null,null,null,null,{"$f":"IF('export html'!D9=\"\",\"\",'export html'!D9)","v":"9-2"},null,null,null,null,null,null,null,null,null,null,null,null,null,null,null,null,null,null,null,null,null,null,null,null,null,null,null,null,null,null,null,null,null,null,null,null,null,null,null,null,null,null,null,null,null,null,null,null,null,null,null,null,null,null,null,null,null,null,null,5,{"$f":"IF(OR(ISERROR(FIND(\"-\",Q9)),AE9>'export html'!$AR$7),\"\",IF(AND(LEFT(Q9)=\"*\",RIGHT(Q9)=\"*\"),\"ff\",IF(BW9>BW24,\"t\",IF(BW9<BW24,\"u\",\"g\"))))","v":"u"},{"$f":"IF(OR(ISERROR(FIND(\"-\",R9)),AF9>'export html'!$AR$7),\"\",IF(AND(LEFT(R9)=\"*\",RIGHT(R9)=\"*\"),\"ff\",IF(BX9>BX24,\"t\",IF(BX9<BX24,\"u\",\"g\"))))","v":"g"},{"$f":"IF(OR(ISERROR(FIND(\"-\",S9)),AG9>'export html'!$AR$7),\"\",IF(AND(LEFT(S9)=\"*\",RIGHT(S9)=\"*\"),\"ff\",IF(BY9>BY24,\"t\",IF(BY9<BY24,\"u\",\"g\"))))","v":"t"},{"$f":"IF(OR(ISERROR(FIND(\"-\",T9)),AH9>'export html'!$AR$7),\"\",IF(AND(LEFT(T9)=\"*\",RIGHT(T9)=\"*\"),\"ff\",IF(BZ9>BZ24,\"t\",IF(BZ9<BZ24,\"u\",\"g\"))))","v":""},null,{"$f":"IF(OR(ISERROR(FIND(\"-\",V9)),AJ9>'export html'!$AR$7),\"\",IF(AND(LEFT(V9)=\"*\",RIGHT(V9)=\"*\"),\"ff\",IF(CB9>CB24,\"t\",IF(CB9<CB24,\"u\",\"g\"))))","v":""},{"$f":"IF(OR(ISERROR(FIND(\"-\",W9)),AK9>'export html'!$AR$7),\"\",IF(AND(LEFT(W9)=\"*\",RIGHT(W9)=\"*\"),\"ff\",IF(CC9>CC24,\"t\",IF(CC9<CC24,\"u\",\"g\"))))","v":""},{"$f":"IF(OR(ISERROR(FIND(\"-\",X9)),AL9>'export html'!$AR$7),\"\",IF(AND(LEFT(X9)=\"*\",RIGHT(X9)=\"*\"),\"ff\",IF(CD9>CD24,\"t\",IF(CD9<CD24,\"u\",\"g\"))))","v":"u"},{"$f":"IF(OR(ISERROR(FIND(\"-\",Y9)),AM9>'export html'!$AR$7),\"\",IF(AND(LEFT(Y9)=\"*\",RIGHT(Y9)=\"*\"),\"ff\",IF(CE9>CE24,\"t\",IF(CE9<CE24,\"u\",\"g\"))))","v":""},{"$f":"IF(OR(ISERROR(FIND(\"-\",Z9)),AN9>'export html'!$AR$7),\"\",IF(AND(LEFT(Z9)=\"*\",RIGHT(Z9)=\"*\"),\"ff\",IF(CF9>CF24,\"t\",IF(CF9<CF24,\"u\",\"g\"))))","v":""},{"$f":"IF(OR(ISERROR(FIND(\"-\",AA9)),AO9>'export html'!$AR$7),\"\",IF(AND(LEFT(AA9)=\"*\",RIGHT(AA9)=\"*\"),\"ff\",IF(CG9>CG24,\"t\",IF(CG9<CG24,\"u\",\"g\"))))","v":""},{"$f":"IF(OR(ISERROR(FIND(\"-\",AB9)),AP9>'export html'!$AR$7),\"\",IF(AND(LEFT(AB9)=\"*\",RIGHT(AB9)=\"*\"),\"ff\",IF(CH9>CH24,\"t\",IF(CH9<CH24,\"u\",\"g\"))))","v":"u"},{"$f":"IF(OR(ISERROR(FIND(\"-\",AC9)),AQ9>'export html'!$AR$7),\"\",IF(AND(LEFT(AC9)=\"*\",RIGHT(AC9)=\"*\"),\"ff\",IF(CI9>CI24,\"t\",IF(CI9<CI24,\"u\",\"g\"))))","v":""},{"$f":"IF(OR(ISERROR(FIND(\"-\",AD9)),AR9>'export html'!$AR$7),\"\",IF(AND(LEFT(AD9)=\"*\",RIGHT(AD9)=\"*\"),\"ff\",IF(CJ9>CJ24,\"t\",IF(CJ9<CJ24,\"u\",\"g\"))))","v":"u"},5,{"$f":"IF(OR(ISERROR(FIND(\"-\",Q9)),AE9<='export html'!$AR$7),\"\",IF(AND(LEFT(Q9)=\"*\",RIGHT(Q9)=\"*\"),\"ff\",IF(CL9>CL24,\"t\",IF(CL9<CL24,\"u\",\"g\"))))","v":""},{"$f":"IF(OR(ISERROR(FIND(\"-\",R9)),AF9<='export html'!$AR$7),\"\",IF(AND(LEFT(R9)=\"*\",RIGHT(R9)=\"*\"),\"ff\",IF(CM9>CM24,\"t\",IF(CM9<CM24,\"u\",\"g\"))))","v":""},{"$f":"IF(OR(ISERROR(FIND(\"-\",S9)),AG9<='export html'!$AR$7),\"\",IF(AND(LEFT(S9)=\"*\",RIGHT(S9)=\"*\"),\"ff\",IF(CN9>CN24,\"t\",IF(CN9<CN24,\"u\",\"g\"))))","v":""},{"$f":"IF(OR(ISERROR(FIND(\"-\",T9)),AH9<='export html'!$AR$7),\"\",IF(AND(LEFT(T9)=\"*\",RIGHT(T9)=\"*\"),\"ff\",IF(CO9>CO24,\"t\",IF(CO9<CO24,\"u\",\"g\"))))","v":"t"},null,{"$f":"IF(OR(ISERROR(FIND(\"-\",V9)),AJ9<='export html'!$AR$7),\"\",IF(AND(LEFT(V9)=\"*\",RIGHT(V9)=\"*\"),\"ff\",IF(CQ9>CQ24,\"t\",IF(CQ9<CQ24,\"u\",\"g\"))))","v":"u"},{"$f":"IF(OR(ISERROR(FIND(\"-\",W9)),AK9<='export html'!$AR$7),\"\",IF(AND(LEFT(W9)=\"*\",RIGHT(W9)=\"*\"),\"ff\",IF(CR9>CR24,\"t\",IF(CR9<CR24,\"u\",\"g\"))))","v":""},{"$f":"IF(OR(ISERROR(FIND(\"-\",X9)),AL9<='export html'!$AR$7),\"\",IF(AND(LEFT(X9)=\"*\",RIGHT(X9)=\"*\"),\"ff\",IF(CS9>CS24,\"t\",IF(CS9<CS24,\"u\",\"g\"))))","v":""},{"$f":"IF(OR(ISERROR(FIND(\"-\",Y9)),AM9<='export html'!$AR$7),\"\",IF(AND(LEFT(Y9)=\"*\",RIGHT(Y9)=\"*\"),\"ff\",IF(CT9>CT24,\"t\",IF(CT9<CT24,\"u\",\"g\"))))","v":"t"},{"$f":"IF(OR(ISERROR(FIND(\"-\",Z9)),AN9<='export html'!$AR$7),\"\",IF(AND(LEFT(Z9)=\"*\",RIGHT(Z9)=\"*\"),\"ff\",IF(CU9>CU24,\"t\",IF(CU9<CU24,\"u\",\"g\"))))","v":"t"},{"$f":"IF(OR(ISERROR(FIND(\"-\",AA9)),AO9<='export html'!$AR$7),\"\",IF(AND(LEFT(AA9)=\"*\",RIGHT(AA9)=\"*\"),\"ff\",IF(CV9>CV24,\"t\",IF(CV9<CV24,\"u\",\"g\"))))","v":"u"},{"$f":"IF(OR(ISERROR(FIND(\"-\",AB9)),AP9<='export html'!$AR$7),\"\",IF(AND(LEFT(AB9)=\"*\",RIGHT(AB9)=\"*\"),\"ff\",IF(CW9>CW24,\"t\",IF(CW9<CW24,\"u\",\"g\"))))","v":""},{"$f":"IF(OR(ISERROR(FIND(\"-\",AC9)),AQ9<='export html'!$AR$7),\"\",IF(AND(LEFT(AC9)=\"*\",RIGHT(AC9)=\"*\"),\"ff\",IF(CX9>CX24,\"t\",IF(CX9<CX24,\"u\",\"g\"))))","v":"t"},{"$f":"IF(OR(ISERROR(FIND(\"-\",AD9)),AR9<='export html'!$AR$7),\"\",IF(AND(LEFT(AD9)=\"*\",RIGHT(AD9)=\"*\"),\"ff\",IF(CY9>CY24,\"t\",IF(CY9<CY24,\"u\",\"g\"))))","v":""},5]
[null,null,null,null,null,null,null,null,null,null,null,null,null,null,null,null,null,null,null,null,null,null,null,null,null,null,null,null,null,null,null,null,null,null,null,null,null,null,null,null,null,null,null,null,null,null,null,null,null,null,null,null,null,null,null,null,null,null,null,null,null,null,null,null,null,null,null,null,null,null,null,null,null,6,{"$f":"IF(OR(ISERROR(FIND(\"-\",Q10)),AE10>'export html'!$AR$7),\"\",IF(AND(LEFT(Q10)=\"*\",RIGHT(Q10)=\"*\"),\"ff\",IF(BW10>BW25,\"t\",IF(BW10<BW25,\"u\",\"g\"))))","v":""},{"$f":"IF(OR(ISERROR(FIND(\"-\",R10)),AF10>'export html'!$AR$7),\"\",IF(AND(LEFT(R10)=\"*\",RIGHT(R10)=\"*\"),\"ff\",IF(BX10>BX25,\"t\",IF(BX10<BX25,\"u\",\"g\"))))","v":""},{"$f":"IF(OR(ISERROR(FIND(\"-\",S10)),AG10>'export html'!$AR$7),\"\",IF(AND(LEFT(S10)=\"*\",RIGHT(S10)=\"*\"),\"ff\",IF(BY10>BY25,\"t\",IF(BY10<BY25,\"u\",\"g\"))))","v":""},{"$f":"IF(OR(ISERROR(FIND(\"-\",T10)),AH10>'export html'!$AR$7),\"\",IF(AND(LEFT(T10)=\"*\",RIGHT(T10)=\"*\"),\"ff\",IF(BZ10>BZ25,\"t\",IF(BZ10<BZ25,\"u\",\"g\"))))","v":"t"},{"$f":"IF(OR(ISERROR(FIND(\"-\",U10)),AI10>'export html'!$AR$7),\"\",IF(AND(LEFT(U10)=\"*\",RIGHT(U10)=\"*\"),\"ff\",IF(CA10>CA25,\"t\",IF(CA10<CA25,\"u\",\"g\"))))","v":"t"},null,{"$f":"IF(OR(ISERROR(FIND(\"-\",W10)),AK10>'export html'!$AR$7),\"\",IF(AND(LEFT(W10)=\"*\",RIGHT(W10)=\"*\"),\"ff\",IF(CC10>CC25,\"t\",IF(CC10<CC25,\"u\",\"g\"))))","v":"t"},{"$f":"IF(OR(ISERROR(FIND(\"-\",X10)),AL10>'export html'!$AR$7),\"\",IF(AND(LEFT(X10)=\"*\",RIGHT(X10)=\"*\"),\"ff\",IF(CD10>CD25,\"t\",IF(CD10<CD25,\"u\",\"g\"))))","v":""},{"$f":"IF(OR(ISERROR(FIND(\"-\",Y10)),AM10>'export html'!$AR$7),\"\",IF(AND(LEFT(Y10)=\"*\",RIGHT(Y10)=\"*\"),\"ff\",IF(CE10>CE25,\"t\",IF(CE10<CE25,\"u\",\"g\"))))","v":""},{"$f":"IF(OR(ISERROR(FIND(\"-\",Z10)),AN10>'export html'!$AR$7),\"\",IF(AND(LEFT(Z10)=\"*\",RIGHT(Z10)=\"*\"),\"ff\",IF(CF10>CF25,\"t\",IF(CF10<CF25,\"u\",\"g\"))))","v":"t"},{"$f":"IF(OR(ISERROR(FIND(\"-\",AA10)),AO10>'export html'!$AR$7),\"\",IF(AND(LEFT(AA10)=\"*\",RIGHT(AA10)=\"*\"),\"ff\",IF(CG10>CG25,\"t\",IF(CG10<CG25,\"u\",\"g\"))))","v":"t"},{"$f":"IF(OR(ISERROR(FIND(\"-\",AB10)),AP10>'export html'!$AR$7),\"\",IF(AND(LEFT(AB10)=\"*\",RIGHT(AB10)=\"*\"),\"ff\",IF(CH10>CH25,\"t\",IF(CH10<CH25,\"u\",\"g\"))))","v":""},{"$f":"IF(OR(ISERROR(FIND(\"-\",AC10)),AQ10>'export html'!$AR$7),\"\",IF(AND(LEFT(AC10)=\"*\",RIGHT(AC10)=\"*\"),\"ff\",IF(CI10>CI25,\"t\",IF(CI10<CI25,\"u\",\"g\"))))","v":"t"},{"$f":"IF(OR(ISERROR(FIND(\"-\",AD10)),AR10>'export html'!$AR$7),\"\",IF(AND(LEFT(AD10)=\"*\",RIGHT(AD10)=\"*\"),\"ff\",IF(CJ10>CJ25,\"t\",IF(CJ10<CJ25,\"u\",\"g\"))))","v":""},6,{"$f":"IF(OR(ISERROR(FIND(\"-\",Q10)),AE10<='export html'!$AR$7),\"\",IF(AND(LEFT(Q10)=\"*\",RIGHT(Q10)=\"*\"),\"ff\",IF(CL10>CL25,\"t\",IF(CL10<CL25,\"u\",\"g\"))))","v":""},{"$f":"IF(OR(ISERROR(FIND(\"-\",R10)),AF10<='export html'!$AR$7),\"\",IF(AND(LEFT(R10)=\"*\",RIGHT(R10)=\"*\"),\"ff\",IF(CM10>CM25,\"t\",IF(CM10<CM25,\"u\",\"g\"))))","v":"t"},{"$f":"IF(OR(ISERROR(FIND(\"-\",S10)),AG10<='export html'!$AR$7),\"\",IF(AND(LEFT(S10)=\"*\",RIGHT(S10)=\"*\"),\"ff\",IF(CN10>CN25,\"t\",IF(CN10<CN25,\"u\",\"g\"))))","v":"t"},{"$f":"IF(OR(ISERROR(FIND(\"-\",T10)),AH10<='export html'!$AR$7),\"\",IF(AND(LEFT(T10)=\"*\",RIGHT(T10)=\"*\"),\"ff\",IF(CO10>CO25,\"t\",IF(CO10<CO25,\"u\",\"g\"))))","v":""},{"$f":"IF(OR(ISERROR(FIND(\"-\",U10)),AI10<='export html'!$AR$7),\"\",IF(AND(LEFT(U10)=\"*\",RIGHT(U10)=\"*\"),\"ff\",IF(CP10>CP25,\"t\",IF(CP10<CP25,\"u\",\"g\"))))","v":""},null,{"$f":"IF(OR(ISERROR(FIND(\"-\",W10)),AK10<='export html'!$AR$7),\"\",IF(AND(LEFT(W10)=\"*\",RIGHT(W10)=\"*\"),\"ff\",IF(CR10>CR25,\"t\",IF(CR10<CR25,\"u\",\"g\"))))","v":""},{"$f":"IF(OR(ISERROR(FIND(\"-\",X10)),AL10<='export html'!$AR$7),\"\",IF(AND(LEFT(X10)=\"*\",RIGHT(X10)=\"*\"),\"ff\",IF(CS10>CS25,\"t\",IF(CS10<CS25,\"u\",\"g\"))))","v":"t"},{"$f":"IF(OR(ISERROR(FIND(\"-\",Y10)),AM10<='export html'!$AR$7),\"\",IF(AND(LEFT(Y10)=\"*\",RIGHT(Y10)=\"*\"),\"ff\",IF(CT10>CT25,\"t\",IF(CT10<CT25,\"u\",\"g\"))))","v":"t"},{"$f":"IF(OR(ISERROR(FIND(\"-\",Z10)),AN10<='export html'!$AR$7),\"\",IF(AND(LEFT(Z10)=\"*\",RIGHT(Z10)=\"*\"),\"ff\",IF(CU10>CU25,\"t\",IF(CU10<CU25,\"u\",\"g\"))))","v":""},{"$f":"IF(OR(ISERROR(FIND(\"-\",AA10)),AO10<='export html'!$AR$7),\"\",IF(AND(LEFT(AA10)=\"*\",RIGHT(AA10)=\"*\"),\"ff\",IF(CV10>CV25,\"t\",IF(CV10<CV25,\"u\",\"g\"))))","v":""},{"$f":"IF(OR(ISERROR(FIND(\"-\",AB10)),AP10<='export html'!$AR$7),\"\",IF(AND(LEFT(AB10)=\"*\",RIGHT(AB10)=\"*\"),\"ff\",IF(CW10>CW25,\"t\",IF(CW10<CW25,\"u\",\"g\"))))","v":"t"},{"$f":"IF(OR(ISERROR(FIND(\"-\",AC10)),AQ10<='export html'!$AR$7),\"\",IF(AND(LEFT(AC10)=\"*\",RIGHT(AC10)=\"*\"),\"ff\",IF(CX10>CX25,\"t\",IF(CX10<CX25,\"u\",\"g\"))))","v":""},{"$f":"IF(OR(ISERROR(FIND(\"-\",AD10)),AR10<='export html'!$AR$7),\"\",IF(AND(LEFT(AD10)=\"*\",RIGHT(AD10)=\"*\"),\"ff\",IF(CY10>CY25,\"t\",IF(CY10<CY25,\"u\",\"g\"))))","v":"t"},6]
[null,null,null,null,null,null,null,null,null,null,null,null,null,null,null,null,null,null,null,null,null,null,null,null,null,null,null,null,null,null,null,null,null,null,null,null,null,null,null,null,null,null,null,null,null,null,null,null,null,null,null,null,null,null,null,null,null,null,null,null,null,null,null,null,null,null,null,null,null,null,null,null,null,7,{"$f":"IF(OR(ISERROR(FIND(\"-\",Q11)),AE11>'export html'!$AR$7),\"\",IF(AND(LEFT(Q11)=\"*\",RIGHT(Q11)=\"*\"),\"ff\",IF(BW11>BW26,\"t\",IF(BW11<BW26,\"u\",\"g\"))))","v":"t"},{"$f":"IF(OR(ISERROR(FIND(\"-\",R11)),AF11>'export html'!$AR$7),\"\",IF(AND(LEFT(R11)=\"*\",RIGHT(R11)=\"*\"),\"ff\",IF(BX11>BX26,\"t\",IF(BX11<BX26,\"u\",\"g\"))))","v":""},{"$f":"IF(OR(ISERROR(FIND(\"-\",S11)),AG11>'export html'!$AR$7),\"\",IF(AND(LEFT(S11)=\"*\",RIGHT(S11)=\"*\"),\"ff\",IF(BY11>BY26,\"t\",IF(BY11<BY26,\"u\",\"g\"))))","v":""},{"$f":"IF(OR(ISERROR(FIND(\"-\",T11)),AH11>'export html'!$AR$7),\"\",IF(AND(LEFT(T11)=\"*\",RIGHT(T11)=\"*\"),\"ff\",IF(BZ11>BZ26,\"t\",IF(BZ11<BZ26,\"u\",\"g\"))))","v":"t"},{"$f":"IF(OR(ISERROR(FIND(\"-\",U11)),AI11>'export html'!$AR$7),\"\",IF(AND(LEFT(U11)=\"*\",RIGHT(U11)=\"*\"),\"ff\",IF(CA11>CA26,\"t\",IF(CA11<CA26,\"u\",\"g\"))))","v":"g"},{"$f":"IF(OR(ISERROR(FIND(\"-\",V11)),AJ11>'export html'!$AR$7),\"\",IF(AND(LEFT(V11)=\"*\",RIGHT(V11)=\"*\"),\"ff\",IF(CB11>CB26,\"t\",IF(CB11<CB26,\"u\",\"g\"))))","v":""},null,{"$f":"IF(OR(ISERROR(FIND(\"-\",X11)),AL11>'export html'!$AR$7),\"\",IF(AND(LEFT(X11)=\"*\",RIGHT(X11)=\"*\"),\"ff\",IF(CD11>CD26,\"t\",IF(CD11<CD26,\"u\",\"g\"))))","v":"g"},{"$f":"IF(OR(ISERROR(FIND(\"-\",Y11)),AM11>'export html'!$AR$7),\"\",IF(AND(LEFT(Y11)=\"*\",RIGHT(Y11)=\"*\"),\"ff\",IF(CE11>CE26,\"t\",IF(CE11<CE26,\"u\",\"g\"))))","v":"t"},{"$f":"IF(OR(ISERROR(FIND(\"-\",Z11)),AN11>'export html'!$AR$7),\"\",IF(AND(LEFT(Z11)=\"*\",RIGHT(Z11)=\"*\"),\"ff\",IF(CF11>CF26,\"t\",IF(CF11<CF26,\"u\",\"g\"))))","v":"t"},{"$f":"IF(OR(ISERROR(FIND(\"-\",AA11)),AO11>'export html'!$AR$7),\"\",IF(AND(LEFT(AA11)=\"*\",RIGHT(AA11)=\"*\"),\"ff\",IF(CG11>CG26,\"t\",IF(CG11<CG26,\"u\",\"g\"))))","v":"u"},{"$f":"IF(OR(ISERROR(FIND(\"-\",AB11)),AP11>'export html'!$AR$7),\"\",IF(AND(LEFT(AB11)=\"*\",RIGHT(AB11)=\"*\"),\"ff\",IF(CH11>CH26,\"t\",IF(CH11<CH26,\"u\",\"g\"))))","v":""},{"$f":"IF(OR(ISERROR(FIND(\"-\",AC11)),AQ11>'export html'!$AR$7),\"\",IF(AND(LEFT(AC11)=\"*\",RIGHT(AC11)=\"*\"),\"ff\",IF(CI11>CI26,\"t\",IF(CI11<CI26,\"u\",\"g\"))))","v":""},{"$f":"IF(OR(ISERROR(FIND(\"-\",AD11)),AR11>'export html'!$AR$7),\"\",IF(AND(LEFT(AD11)=\"*\",RIGHT(AD11)=\"*\"),\"ff\",IF(CJ11>CJ26,\"t\",IF(CJ11<CJ26,\"u\",\"g\"))))","v":""},7,{"$f":"IF(OR(ISERROR(FIND(\"-\",Q11)),AE11<='export html'!$AR$7),\"\",IF(AND(LEFT(Q11)=\"*\",RIGHT(Q11)=\"*\"),\"ff\",IF(CL11>CL26,\"t\",IF(CL11<CL26,\"u\",\"g\"))))","v":""},{"$f":"IF(OR(ISERROR(FIND(\"-\",R11)),AF11<='export html'!$AR$7),\"\",IF(AND(LEFT(R11)=\"*\",RIGHT(R11)=\"*\"),\"ff\",IF(CM11>CM26,\"t\",IF(CM11<CM26,\"u\",\"g\"))))","v":"u"},{"$f":"IF(OR(ISERROR(FIND(\"-\",S11)),AG11<='export html'!$AR$7),\"\",IF(AND(LEFT(S11)=\"*\",RIGHT(S11)=\"*\"),\"ff\",IF(CN11>CN26,\"t\",IF(CN11<CN26,\"u\",\"g\"))))","v":"u"},{"$f":"IF(OR(ISERROR(FIND(\"-\",T11)),AH11<='export html'!$AR$7),\"\",IF(AND(LEFT(T11)=\"*\",RIGHT(T11)=\"*\"),\"ff\",IF(CO11>CO26,\"t\",IF(CO11<CO26,\"u\",\"g\"))))","v":""},{"$f":"IF(OR(ISERROR(FIND(\"-\",U11)),AI11<='export html'!$AR$7),\"\",IF(AND(LEFT(U11)=\"*\",RIGHT(U11)=\"*\"),\"ff\",IF(CP11>CP26,\"t\",IF(CP11<CP26,\"u\",\"g\"))))","v":""},{"$f":"IF(OR(ISERROR(FIND(\"-\",V11)),AJ11<='export html'!$AR$7),\"\",IF(AND(LEFT(V11)=\"*\",RIGHT(V11)=\"*\"),\"ff\",IF(CQ11>CQ26,\"t\",IF(CQ11<CQ26,\"u\",\"g\"))))","v":"u"},null,{"$f":"IF(OR(ISERROR(FIND(\"-\",X11)),AL11<='export html'!$AR$7),\"\",IF(AND(LEFT(X11)=\"*\",RIGHT(X11)=\"*\"),\"ff\",IF(CS11>CS26,\"t\",IF(CS11<CS26,\"u\",\"g\"))))","v":""},{"$f":"IF(OR(ISERROR(FIND(\"-\",Y11)),AM11<='export html'!$AR$7),\"\",IF(AND(LEFT(Y11)=\"*\",RIGHT(Y11)=\"*\"),\"ff\",IF(CT11>CT26,\"t\",IF(CT11<CT26,\"u\",\"g\"))))","v":""},{"$f":"IF(OR(ISERROR(FIND(\"-\",Z11)),AN11<='export html'!$AR$7),\"\",IF(AND(LEFT(Z11)=\"*\",RIGHT(Z11)=\"*\"),\"ff\",IF(CU11>CU26,\"t\",IF(CU11<CU26,\"u\",\"g\"))))","v":""},{"$f":"IF(OR(ISERROR(FIND(\"-\",AA11)),AO11<='export html'!$AR$7),\"\",IF(AND(LEFT(AA11)=\"*\",RIGHT(AA11)=\"*\"),\"ff\",IF(CV11>CV26,\"t\",IF(CV11<CV26,\"u\",\"g\"))))","v":""},{"$f":"IF(OR(ISERROR(FIND(\"-\",AB11)),AP11<='export html'!$AR$7),\"\",IF(AND(LEFT(AB11)=\"*\",RIGHT(AB11)=\"*\"),\"ff\",IF(CW11>CW26,\"t\",IF(CW11<CW26,\"u\",\"g\"))))","v":"g"},{"$f":"IF(OR(ISERROR(FIND(\"-\",AC11)),AQ11<='export html'!$AR$7),\"\",IF(AND(LEFT(AC11)=\"*\",RIGHT(AC11)=\"*\"),\"ff\",IF(CX11>CX26,\"t\",IF(CX11<CX26,\"u\",\"g\"))))","v":"u"},{"$f":"IF(OR(ISERROR(FIND(\"-\",AD11)),AR11<='export html'!$AR$7),\"\",IF(AND(LEFT(AD11)=\"*\",RIGHT(AD11)=\"*\"),\"ff\",IF(CY11>CY26,\"t\",IF(CY11<CY26,\"u\",\"g\"))))","v":"u"},7]
[null,null,null,null,null,null,null,null,null,null,null,null,null,null,null,null,null,null,null,null,null,null,null,null,null,null,null,null,null,null,null,null,null,null,null,null,null,null,null,null,null,null,null,null,null,null,null,null,null,null,null,null,null,null,null,null,null,null,null,null,null,null,null,null,null,null,null,null,null,null,null,null,null,8,{"$f":"IF(OR(ISERROR(FIND(\"-\",Q12)),AE12>'export html'!$AR$7),\"\",IF(AND(LEFT(Q12)=\"*\",RIGHT(Q12)=\"*\"),\"ff\",IF(BW12>BW27,\"t\",IF(BW12<BW27,\"u\",\"g\"))))","v":"u"},{"$f":"IF(OR(ISERROR(FIND(\"-\",R12)),AF12>'export html'!$AR$7),\"\",IF(AND(LEFT(R12)=\"*\",RIGHT(R12)=\"*\"),\"ff\",IF(BX12>BX27,\"t\",IF(BX12<BX27,\"u\",\"g\"))))","v":"t"},{"$f":"IF(OR(ISERROR(FIND(\"-\",S12)),AG12>'export html'!$AR$7),\"\",IF(AND(LEFT(S12)=\"*\",RIGHT(S12)=\"*\"),\"ff\",IF(BY12>BY27,\"t\",IF(BY12<BY27,\"u\",\"g\"))))","v":"u"},{"$f":"IF(OR(ISERROR(FIND(\"-\",T12)),AH12>'export html'!$AR$7),\"\",IF(AND(LEFT(T12)=\"*\",RIGHT(T12)=\"*\"),\"ff\",IF(BZ12>BZ27,\"t\",IF(BZ12<BZ27,\"u\",\"g\"))))","v":""},{"$f":"IF(OR(ISERROR(FIND(\"-\",U12)),AI12>'export html'!$AR$7),\"\",IF(AND(LEFT(U12)=\"*\",RIGHT(U12)=\"*\"),\"ff\",IF(CA12>CA27,\"t\",IF(CA12<CA27,\"u\",\"g\"))))","v":""},{"$f":"IF(OR(ISERROR(FIND(\"-\",V12)),AJ12>'export html'!$AR$7),\"\",IF(AND(LEFT(V12)=\"*\",RIGHT(V12)=\"*\"),\"ff\",IF(CB12>CB27,\"t\",IF(CB12<CB27,\"u\",\"g\"))))","v":"u"},{"$f":"IF(OR(ISERROR(FIND(\"-\",W12)),AK12>'export html'!$AR$7),\"\",IF(AND(LEFT(W12)=\"*\",RIGHT(W12)=\"*\"),\"ff\",IF(CC12>CC27,\"t\",IF(CC12<CC27,\"u\",\"g\"))))","v":""},null,{"$f":"IF(OR(ISERROR(FIND(\"-\",Y12)),AM12>'export html'!$AR$7),\"\",IF(AND(LEFT(Y12)=\"*\",RIGHT(Y12)=\"*\"),\"ff\",IF(CE12>CE27,\"t\",IF(CE12<CE27,\"u\",\"g\"))))","v":""},{"$f":"IF(OR(ISERROR(FIND(\"-\",Z12)),AN12>'export html'!$AR$7),\"\",IF(AND(LEFT(Z12)=\"*\",RIGHT(Z12)=\"*\"),\"ff\",IF(CF12>CF27,\"t\",IF(CF12<CF27,\"u\",\"g\"))))","v":""},{"$f":"IF(OR(ISERROR(FIND(\"-\",AA12)),AO12>'export html'!$AR$7),\"\",IF(AND(LEFT(AA12)=\"*\",RIGHT(AA12)=\"*\"),\"ff\",IF(CG12>CG27,\"t\",IF(CG12<CG27,\"u\",\"g\"))))","v":""},{"$f":"IF(OR(ISERROR(FIND(\"-\",AB12)),AP12>'export html'!$AR$7),\"\",IF(AND(LEFT(AB12)=\"*\",RIGHT(AB12)=\"*\"),\"ff\",IF(CH12>CH27,\"t\",IF(CH12<CH27,\"u\",\"g\"))))","v":"u"},{"$f":"IF(OR(ISERROR(FIND(\"-\",AC12)),AQ12>'export html'!$AR$7),\"\",IF(AND(LEFT(AC12)=\"*\",RIGHT(AC12)=\"*\"),\"ff\",IF(CI12>CI27,\"t\",IF(CI12<CI27,\"u\",\"g\"))))","v":""},{"$f":"IF(OR(ISERROR(FIND(\"-\",AD12)),AR12>'export html'!$AR$7),\"\",IF(AND(LEFT(AD12)=\"*\",RIGHT(AD12)=\"*\"),\"ff\",IF(CJ12>CJ27,\"t\",IF(CJ12<CJ27,\"u\",\"g\"))))","v":"g"},8,{"$f":"IF(OR(ISERROR(FIND(\"-\",Q12)),AE12<='export html'!$AR$7),\"\",IF(AND(LEFT(Q12)=\"*\",RIGHT(Q12)=\"*\"),\"ff\",IF(CL12>CL27,\"t\",IF(CL12<CL27,\"u\",\"g\"))))","v":""},{"$f":"IF(OR(ISERROR(FIND(\"-\",R12)),AF12<='export html'!$AR$7),\"\",IF(AND(LEFT(R12)=\"*\",RIGHT(R12)=\"*\"),\"ff\",IF(CM12>CM27,\"t\",IF(CM12<CM27,\"u\",\"g\"))))","v":""},{"$f":"IF(OR(ISERROR(FIND(\"-\",S12)),AG12<='export html'!$AR$7),\"\",IF(AND(LEFT(S12)=\"*\",RIGHT(S12)=\"*\"),\"ff\",IF(CN12>CN27,\"t\",IF(CN12<CN27,\"u\",\"g\"))))","v":""},{"$f":"IF(OR(ISERROR(FIND(\"-\",T12)),AH12<='export html'!$AR$7),\"\",IF(AND(LEFT(T12)=\"*\",RIGHT(T12)=\"*\"),\"ff\",IF(CO12>CO27,\"t\",IF(CO12<CO27,\"u\",\"g\"))))","v":"t"},{"$f":"IF(OR(ISERROR(FIND(\"-\",U12)),AI12<='export html'!$AR$7),\"\",IF(AND(LEFT(U12)=\"*\",RIGHT(U12)=\"*\"),\"ff\",IF(CP12>CP27,\"t\",IF(CP12<CP27,\"u\",\"g\"))))","v":"u"},{"$f":"IF(OR(ISERROR(FIND(\"-\",V12)),AJ12<='export html'!$AR$7),\"\",IF(AND(LEFT(V12)=\"*\",RIGHT(V12)=\"*\"),\"ff\",IF(CQ12>CQ27,\"t\",IF(CQ12<CQ27,\"u\",\"g\"))))","v":""},{"$f":"IF(OR(ISERROR(FIND(\"-\",W12)),AK12<='export html'!$AR$7),\"\",IF(AND(LEFT(W12)=\"*\",RIGHT(W12)=\"*\"),\"ff\",IF(CR12>CR27,\"t\",IF(CR12<CR27,\"u\",\"g\"))))","v":"t"},null,{"$f":"IF(OR(ISERROR(FIND(\"-\",Y12)),AM12<='export html'!$AR$7),\"\",IF(AND(LEFT(Y12)=\"*\",RIGHT(Y12)=\"*\"),\"ff\",IF(CT12>CT27,\"t\",IF(CT12<CT27,\"u\",\"g\"))))","v":"t"},{"$f":"IF(OR(ISERROR(FIND(\"-\",Z12)),AN12<='export html'!$AR$7),\"\",IF(AND(LEFT(Z12)=\"*\",RIGHT(Z12)=\"*\"),\"ff\",IF(CU12>CU27,\"t\",IF(CU12<CU27,\"u\",\"g\"))))","v":""},{"$f":"IF(OR(ISERROR(FIND(\"-\",AA12)),AO12<='export html'!$AR$7),\"\",IF(AND(LEFT(AA12)=\"*\",RIGHT(AA12)=\"*\"),\"ff\",IF(CV12>CV27,\"t\",IF(CV12<CV27,\"u\",\"g\"))))","v":"u"},{"$f":"IF(OR(ISERROR(FIND(\"-\",AB12)),AP12<='export html'!$AR$7),\"\",IF(AND(LEFT(AB12)=\"*\",RIGHT(AB12)=\"*\"),\"ff\",IF(CW12>CW27,\"t\",IF(CW12<CW27,\"u\",\"g\"))))","v":""},{"$f":"IF(OR(ISERROR(FIND(\"-\",AC12)),AQ12<='export html'!$AR$7),\"\",IF(AND(LEFT(AC12)=\"*\",RIGHT(AC12)=\"*\"),\"ff\",IF(CX12>CX27,\"t\",IF(CX12<CX27,\"u\",\"g\"))))","v":""},{"$f":"IF(OR(ISERROR(FIND(\"-\",AD12)),AR12<='export html'!$AR$7),\"\",IF(AND(LEFT(AD12)=\"*\",RIGHT(AD12)=\"*\"),\"ff\",IF(CY12>CY27,\"t\",IF(CY12<CY27,\"u\",\"g\"))))","v":""},8]
[null,null,null,null,null,null,null,null,null,null,null,null,null,null,null,null,null,null,null,null,null,null,null,null,null,null,null,null,null,null,null,null,null,null,null,null,null,null,null,null,null,null,null,null,null,null,null,null,null,null,null,null,null,null,null,null,null,null,null,null,null,null,null,null,null,null,null,null,null,null,null,null,null,9,{"$f":"IF(OR(ISERROR(FIND(\"-\",Q13)),AE13>'export html'!$AR$7),\"\",IF(AND(LEFT(Q13)=\"*\",RIGHT(Q13)=\"*\"),\"ff\",IF(BW13>BW28,\"t\",IF(BW13<BW28,\"u\",\"g\"))))","v":""},{"$f":"IF(OR(ISERROR(FIND(\"-\",R13)),AF13>'export html'!$AR$7),\"\",IF(AND(LEFT(R13)=\"*\",RIGHT(R13)=\"*\"),\"ff\",IF(BX13>BX28,\"t\",IF(BX13<BX28,\"u\",\"g\"))))","v":""},{"$f":"IF(OR(ISERROR(FIND(\"-\",S13)),AG13>'export html'!$AR$7),\"\",IF(AND(LEFT(S13)=\"*\",RIGHT(S13)=\"*\"),\"ff\",IF(BY13>BY28,\"t\",IF(BY13<BY28,\"u\",\"g\"))))","v":""},{"$f":"IF(OR(ISERROR(FIND(\"-\",T13)),AH13>'export html'!$AR$7),\"\",IF(AND(LEFT(T13)=\"*\",RIGHT(T13)=\"*\"),\"ff\",IF(BZ13>BZ28,\"t\",IF(BZ13<BZ28,\"u\",\"g\"))))","v":""},{"$f":"IF(OR(ISERROR(FIND(\"-\",U13)),AI13>'export html'!$AR$7),\"\",IF(AND(LEFT(U13)=\"*\",RIGHT(U13)=\"*\"),\"ff\",IF(CA13>CA28,\"t\",IF(CA13<CA28,\"u\",\"g\"))))","v":"u"},{"$f":"IF(OR(ISERROR(FIND(\"-\",V13)),AJ13>'export html'!$AR$7),\"\",IF(AND(LEFT(V13)=\"*\",RIGHT(V13)=\"*\"),\"ff\",IF(CB13>CB28,\"t\",IF(CB13<CB28,\"u\",\"g\"))))","v":"u"},{"$f":"IF(OR(ISERROR(FIND(\"-\",W13)),AK13>'export html'!$AR$7),\"\",IF(AND(LEFT(W13)=\"*\",RIGHT(W13)=\"*\"),\"ff\",IF(CC13>CC28,\"t\",IF(CC13<CC28,\"u\",\"g\"))))","v":""},{"$f":"IF(OR(ISERROR(FIND(\"-\",X13)),AL13>'export html'!$AR$7),\"\",IF(AND(LEFT(X13)=\"*\",RIGHT(X13)=\"*\"),\"ff\",IF(CD13>CD28,\"t\",IF(CD13<CD28,\"u\",\"g\"))))","v":"u"},null,{"$f":"IF(OR(ISERROR(FIND(\"-\",Z13)),AN13>'export html'!$AR$7),\"\",IF(AND(LEFT(Z13)=\"*\",RIGHT(Z13)=\"*\"),\"ff\",IF(CF13>CF28,\"t\",IF(CF13<CF28,\"u\",\"g\"))))","v":"g"},{"$f":"IF(OR(ISERROR(FIND(\"-\",AA13)),AO13>'export html'!$AR$7),\"\",IF(AND(LEFT(AA13)=\"*\",RIGHT(AA13)=\"*\"),\"ff\",IF(CG13>CG28,\"t\",IF(CG13<CG28,\"u\",\"g\"))))","v":""},{"$f":"IF(OR(ISERROR(FIND(\"-\",AB13)),AP13>'export html'!$AR$7),\"\",IF(AND(LEFT(AB13)=\"*\",RIGHT(AB13)=\"*\"),\"ff\",IF(CH13>CH28,\"t\",IF(CH13<CH28,\"u\",\"g\"))))","v":"u"},{"$f":"IF(OR(ISERROR(FIND(\"-\",AC13)),AQ13>'export html'!$AR$7),\"\",IF(AND(LEFT(AC13)=\"*\",RIGHT(AC13)=\"*\"),\"ff\",IF(CI13>CI28,\"t\",IF(CI13<CI28,\"u\",\"g\"))))","v":"t"},{"$f":"IF(OR(ISERROR(FIND(\"-\",AD13)),AR13>'export html'!$AR$7),\"\",IF(AND(LEFT(AD13)=\"*\",RIGHT(AD13)=\"*\"),\"ff\",IF(CJ13>CJ28,\"t\",IF(CJ13<CJ28,\"u\",\"g\"))))","v":"u"},9,{"$f":"IF(OR(ISERROR(FIND(\"-\",Q13)),AE13<='export html'!$AR$7),\"\",IF(AND(LEFT(Q13)=\"*\",RIGHT(Q13)=\"*\"),\"ff\",IF(CL13>CL28,\"t\",IF(CL13<CL28,\"u\",\"g\"))))","v":"u"},{"$f":"IF(OR(ISERROR(FIND(\"-\",R13)),AF13<='export html'!$AR$7),\"\",IF(AND(LEFT(R13)=\"*\",RIGHT(R13)=\"*\"),\"ff\",IF(CM13>CM28,\"t\",IF(CM13<CM28,\"u\",\"g\"))))","v":"u"},{"$f":"IF(OR(ISERROR(FIND(\"-\",S13)),AG13<='export html'!$AR$7),\"\",IF(AND(LEFT(S13)=\"*\",RIGHT(S13)=\"*\"),\"ff\",IF(CN13>CN28,\"t\",IF(CN13<CN28,\"u\",\"g\"))))","v":"u"},{"$f":"IF(OR(ISERROR(FIND(\"-\",T13)),AH13<='export html'!$AR$7),\"\",IF(AND(LEFT(T13)=\"*\",RIGHT(T13)=\"*\"),\"ff\",IF(CO13>CO28,\"t\",IF(CO13<CO28,\"u\",\"g\"))))","v":""},{"$f":"IF(OR(ISERROR(FIND(\"-\",U13)),AI13<='export html'!$AR$7),\"\",IF(AND(LEFT(U13)=\"*\",RIGHT(U13)=\"*\"),\"ff\",IF(CP13>CP28,\"t\",IF(CP13<CP28,\"u\",\"g\"))))","v":""},{"$f":"IF(OR(ISERROR(FIND(\"-\",V13)),AJ13<='export html'!$AR$7),\"\",IF(AND(LEFT(V13)=\"*\",RIGHT(V13)=\"*\"),\"ff\",IF(CQ13>CQ28,\"t\",IF(CQ13<CQ28,\"u\",\"g\"))))","v":""},{"$f":"IF(OR(ISERROR(FIND(\"-\",W13)),AK13<='export html'!$AR$7),\"\",IF(AND(LEFT(W13)=\"*\",RIGHT(W13)=\"*\"),\"ff\",IF(CR13>CR28,\"t\",IF(CR13<CR28,\"u\",\"g\"))))","v":"g"},{"$f":"IF(OR(ISERROR(FIND(\"-\",X13)),AL13<='export html'!$AR$7),\"\",IF(AND(LEFT(X13)=\"*\",RIGHT(X13)=\"*\"),\"ff\",IF(CS13>CS28,\"t\",IF(CS13<CS28,\"u\",\"g\"))))","v":""},null,{"$f":"IF(OR(ISERROR(FIND(\"-\",Z13)),AN13<='export html'!$AR$7),\"\",IF(AND(LEFT(Z13)=\"*\",RIGHT(Z13)=\"*\"),\"ff\",IF(CU13>CU28,\"t\",IF(CU13<CU28,\"u\",\"g\"))))","v":""},{"$f":"IF(OR(ISERROR(FIND(\"-\",AA13)),AO13<='export html'!$AR$7),\"\",IF(AND(LEFT(AA13)=\"*\",RIGHT(AA13)=\"*\"),\"ff\",IF(CV13>CV28,\"t\",IF(CV13<CV28,\"u\",\"g\"))))","v":""},{"$f":"IF(OR(ISERROR(FIND(\"-\",AB13)),AP13<='export html'!$AR$7),\"\",IF(AND(LEFT(AB13)=\"*\",RIGHT(AB13)=\"*\"),\"ff\",IF(CW13>CW28,\"t\",IF(CW13<CW28,\"u\",\"g\"))))","v":""},{"$f":"IF(OR(ISERROR(FIND(\"-\",AC13)),AQ13<='export html'!$AR$7),\"\",IF(AND(LEFT(AC13)=\"*\",RIGHT(AC13)=\"*\"),\"ff\",IF(CX13>CX28,\"t\",IF(CX13<CX28,\"u\",\"g\"))))","v":""},{"$f":"IF(OR(ISERROR(FIND(\"-\",AD13)),AR13<='export html'!$AR$7),\"\",IF(AND(LEFT(AD13)=\"*\",RIGHT(AD13)=\"*\"),\"ff\",IF(CY13>CY28,\"t\",IF(CY13<CY28,\"u\",\"g\"))))","v":""},9]
[null,null,null,null,null,null,null,null,null,null,null,null,null,null,null,null,null,null,null,null,null,null,null,null,null,null,null,null,null,null,null,null,null,null,null,null,null,null,null,null,null,null,null,null,null,null,null,null,null,null,null,null,null,null,null,null,null,null,null,null,null,null,null,null,null,null,null,null,null,null,null,null,null,10,{"$f":"IF(OR(ISERROR(FIND(\"-\",Q14)),AE14>'export html'!$AR$7),\"\",IF(AND(LEFT(Q14)=\"*\",RIGHT(Q14)=\"*\"),\"ff\",IF(BW14>BW29,\"t\",IF(BW14<BW29,\"u\",\"g\"))))","v":"u"},{"$f":"IF(OR(ISERROR(FIND(\"-\",R14)),AF14>'export html'!$AR$7),\"\",IF(AND(LEFT(R14)=\"*\",RIGHT(R14)=\"*\"),\"ff\",IF(BX14>BX29,\"t\",IF(BX14<BX29,\"u\",\"g\"))))","v":"u"},{"$f":"IF(OR(ISERROR(FIND(\"-\",S14)),AG14>'export html'!$AR$7),\"\",IF(AND(LEFT(S14)=\"*\",RIGHT(S14)=\"*\"),\"ff\",IF(BY14>BY29,\"t\",IF(BY14<BY29,\"u\",\"g\"))))","v":"u"},{"$f":"IF(OR(ISERROR(FIND(\"-\",T14)),AH14>'export html'!$AR$7),\"\",IF(AND(LEFT(T14)=\"*\",RIGHT(T14)=\"*\"),\"ff\",IF(BZ14>BZ29,\"t\",IF(BZ14<BZ29,\"u\",\"g\"))))","v":""},{"$f":"IF(OR(ISERROR(FIND(\"-\",U14)),AI14>'export html'!$AR$7),\"\",IF(AND(LEFT(U14)=\"*\",RIGHT(U14)=\"*\"),\"ff\",IF(CA14>CA29,\"t\",IF(CA14<CA29,\"u\",\"g\"))))","v":"g"},{"$f":"IF(OR(ISERROR(FIND(\"-\",V14)),AJ14>'export html'!$AR$7),\"\",IF(AND(LEFT(V14)=\"*\",RIGHT(V14)=\"*\"),\"ff\",IF(CB14>CB29,\"t\",IF(CB14<CB29,\"u\",\"g\"))))","v":""},{"$f":"IF(OR(ISERROR(FIND(\"-\",W14)),AK14>'export html'!$AR$7),\"\",IF(AND(LEFT(W14)=\"*\",RIGHT(W14)=\"*\"),\"ff\",IF(CC14>CC29,\"t\",IF(CC14<CC29,\"u\",\"g\"))))","v":""},{"$f":"IF(OR(ISERROR(FIND(\"-\",X14)),AL14>'export html'!$AR$7),\"\",IF(AND(LEFT(X14)=\"*\",RIGHT(X14)=\"*\"),\"ff\",IF(CD14>CD29,\"t\",IF(CD14<CD29,\"u\",\"g\"))))","v":"t"},{"$f":"IF(OR(ISERROR(FIND(\"-\",Y14)),AM14>'export html'!$AR$7),\"\",IF(AND(LEFT(Y14)=\"*\",RIGHT(Y14)=\"*\"),\"ff\",IF(CE14>CE29,\"t\",IF(CE14<CE29,\"u\",\"g\"))))","v":""},null,{"$f":"IF(OR(ISERROR(FIND(\"-\",AA14)),AO14>'export html'!$AR$7),\"\",IF(AND(LEFT(AA14)=\"*\",RIGHT(AA14)=\"*\"),\"ff\",IF(CG14>CG29,\"t\",IF(CG14<CG29,\"u\",\"g\"))))","v":""},{"$f":"IF(OR(ISERROR(FIND(\"-\",AB14)),AP14>'export html'!$AR$7),\"\",IF(AND(LEFT(AB14)=\"*\",RIGHT(AB14)=\"*\"),\"ff\",IF(CH14>CH29,\"t\",IF(CH14<CH29,\"u\",\"g\"))))","v":""},{"$f":"IF(OR(ISERROR(FIND(\"-\",AC14)),AQ14>'export html'!$AR$7),\"\",IF(AND(LEFT(AC14)=\"*\",RIGHT(AC14)=\"*\"),\"ff\",IF(CI14>CI29,\"t\",IF(CI14<CI29,\"u\",\"g\"))))","v":""},{"$f":"IF(OR(ISERROR(FIND(\"-\",AD14)),AR14>'export html'!$AR$7),\"\",IF(AND(LEFT(AD14)=\"*\",RIGHT(AD14)=\"*\"),\"ff\",IF(CJ14>CJ29,\"t\",IF(CJ14<CJ29,\"u\",\"g\"))))","v":"t"},10,{"$f":"IF(OR(ISERROR(FIND(\"-\",Q14)),AE14<='export html'!$AR$7),\"\",IF(AND(LEFT(Q14)=\"*\",RIGHT(Q14)=\"*\"),\"ff\",IF(CL14>CL29,\"t\",IF(CL14<CL29,\"u\",\"g\"))))","v":""},{"$f":"IF(OR(ISERROR(FIND(\"-\",R14)),AF14<='export html'!$AR$7),\"\",IF(AND(LEFT(R14)=\"*\",RIGHT(R14)=\"*\"),\"ff\",IF(CM14>CM29,\"t\",IF(CM14<CM29,\"u\",\"g\"))))","v":""},{"$f":"IF(OR(ISERROR(FIND(\"-\",S14)),AG14<='export html'!$AR$7),\"\",IF(AND(LEFT(S14)=\"*\",RIGHT(S14)=\"*\"),\"ff\",IF(CN14>CN29,\"t\",IF(CN14<CN29,\"u\",\"g\"))))","v":""},{"$f":"IF(OR(ISERROR(FIND(\"-\",T14)),AH14<='export html'!$AR$7),\"\",IF(AND(LEFT(T14)=\"*\",RIGHT(T14)=\"*\"),\"ff\",IF(CO14>CO29,\"t\",IF(CO14<CO29,\"u\",\"g\"))))","v":"t"},{"$f":"IF(OR(ISERROR(FIND(\"-\",U14)),AI14<='export html'!$AR$7),\"\",IF(AND(LEFT(U14)=\"*\",RIGHT(U14)=\"*\"),\"ff\",IF(CP14>CP29,\"t\",IF(CP14<CP29,\"u\",\"g\"))))","v":""},{"$f":"IF(OR(ISERROR(FIND(\"-\",V14)),AJ14<='export html'!$AR$7),\"\",IF(AND(LEFT(V14)=\"*\",RIGHT(V14)=\"*\"),\"ff\",IF(CQ14>CQ29,\"t\",IF(CQ14<CQ29,\"u\",\"g\"))))","v":"u"},{"$f":"IF(OR(ISERROR(FIND(\"-\",W14)),AK14<='export html'!$AR$7),\"\",IF(AND(LEFT(W14)=\"*\",RIGHT(W14)=\"*\"),\"ff\",IF(CR14>CR29,\"t\",IF(CR14<CR29,\"u\",\"g\"))))","v":"t"},{"$f":"IF(OR(ISERROR(FIND(\"-\",X14)),AL14<='export html'!$AR$7),\"\",IF(AND(LEFT(X14)=\"*\",RIGHT(X14)=\"*\"),\"ff\",IF(CS14>CS29,\"t\",IF(CS14<CS29,\"u\",\"g\"))))","v":""},{"$f":"IF(OR(ISERROR(FIND(\"-\",Y14)),AM14<='export html'!$AR$7),\"\",IF(AND(LEFT(Y14)=\"*\",RIGHT(Y14)=\"*\"),\"ff\",IF(CT14>CT29,\"t\",IF(CT14<CT29,\"u\",\"g\"))))","v":"g"},null,{"$f":"IF(OR(ISERROR(FIND(\"-\",AA14)),AO14<='export html'!$AR$7),\"\",IF(AND(LEFT(AA14)=\"*\",RIGHT(AA14)=\"*\"),\"ff\",IF(CV14>CV29,\"t\",IF(CV14<CV29,\"u\",\"g\"))))","v":""},{"$f":"IF(OR(ISERROR(FIND(\"-\",AB14)),AP14<='export html'!$AR$7),\"\",IF(AND(LEFT(AB14)=\"*\",RIGHT(AB14)=\"*\"),\"ff\",IF(CW14>CW29,\"t\",IF(CW14<CW29,\"u\",\"g\"))))","v":"t"},{"$f":"IF(OR(ISERROR(FIND(\"-\",AC14)),AQ14<='export html'!$AR$7),\"\",IF(AND(LEFT(AC14)=\"*\",RIGHT(AC14)=\"*\"),\"ff\",IF(CX14>CX29,\"t\",IF(CX14<CX29,\"u\",\"g\"))))","v":"u"},{"$f":"IF(OR(ISERROR(FIND(\"-\",AD14)),AR14<='export html'!$AR$7),\"\",IF(AND(LEFT(AD14)=\"*\",RIGHT(AD14)=\"*\"),\"ff\",IF(CY14>CY29,\"t\",IF(CY14<CY29,\"u\",\"g\"))))","v":""},10]
[null,null,null,null,null,null,null,null,null,null,null,null,null,null,null,null,null,null,null,null,null,null,null,null,null,null,null,null,null,null,null,null,null,null,null,null,null,null,null,null,null,null,null,null,null,null,null,null,null,null,null,null,null,null,null,null,null,null,null,null,null,null,null,null,null,null,null,null,null,null,null,null,null,11,{"$f":"IF(OR(ISERROR(FIND(\"-\",Q15)),AE15>'export html'!$AR$7),\"\",IF(AND(LEFT(Q15)=\"*\",RIGHT(Q15)=\"*\"),\"ff\",IF(BW15>BW30,\"t\",IF(BW15<BW30,\"u\",\"g\"))))","v":"t"},{"$f":"IF(OR(ISERROR(FIND(\"-\",R15)),AF15>'export html'!$AR$7),\"\",IF(AND(LEFT(R15)=\"*\",RIGHT(R15)=\"*\"),\"ff\",IF(BX15>BX30,\"t\",IF(BX15<BX30,\"u\",\"g\"))))","v":""},{"$f":"IF(OR(ISERROR(FIND(\"-\",S15)),AG15>'export html'!$AR$7),\"\",IF(AND(LEFT(S15)=\"*\",RIGHT(S15)=\"*\"),\"ff\",IF(BY15>BY30,\"t\",IF(BY15<BY30,\"u\",\"g\"))))","v":"t"},{"$f":"IF(OR(ISERROR(FIND(\"-\",T15)),AH15>'export html'!$AR$7),\"\",IF(AND(LEFT(T15)=\"*\",RIGHT(T15)=\"*\"),\"ff\",IF(BZ15>BZ30,\"t\",IF(BZ15<BZ30,\"u\",\"g\"))))","v":"u"},{"$f":"IF(OR(ISERROR(FIND(\"-\",U15)),AI15>'export html'!$AR$7),\"\",IF(AND(LEFT(U15)=\"*\",RIGHT(U15)=\"*\"),\"ff\",IF(CA15>CA30,\"t\",IF(CA15<CA30,\"u\",\"g\"))))","v":"t"},{"$f":"IF(OR(ISERROR(FIND(\"-\",V15)),AJ15>'export html'!$AR$7),\"\",IF(AND(LEFT(V15)=\"*\",RIGHT(V15)=\"*\"),\"ff\",IF(CB15>CB30,\"t\",IF(CB15<CB30,\"u\",\"g\"))))","v":""},{"$f":"IF(OR(ISERROR(FIND(\"-\",W15)),AK15>'export html'!$AR$7),\"\",IF(AND(LEFT(W15)=\"*\",RIGHT(W15)=\"*\"),\"ff\",IF(CC15>CC30,\"t\",IF(CC15<CC30,\"u\",\"g\"))))","v":""},{"$f":"IF(OR(ISERROR(FIND(\"-\",X15)),AL15>'export html'!$AR$7),\"\",IF(AND(LEFT(X15)=\"*\",RIGHT(X15)=\"*\"),\"ff\",IF(CD15>CD30,\"t\",IF(CD15<CD30,\"u\",\"g\"))))","v":"u"},{"$f":"IF(OR(ISERROR(FIND(\"-\",Y15)),AM15>'export html'!$AR$7),\"\",IF(AND(LEFT(Y15)=\"*\",RIGHT(Y15)=\"*\"),\"ff\",IF(CE15>CE30,\"t\",IF(CE15<CE30,\"u\",\"g\"))))","v":"t"},{"$f":"IF(OR(ISERROR(FIND(\"-\",Z15)),AN15>'export html'!$AR$7),\"\",IF(AND(LEFT(Z15)=\"*\",RIGHT(Z15)=\"*\"),\"ff\",IF(CF15>CF30,\"t\",IF(CF15<CF30,\"u\",\"g\"))))","v":"t"},null,{"$f":"IF(OR(ISERROR(FIND(\"-\",AB15)),AP15>'export html'!$AR$7),\"\",IF(AND(LEFT(AB15)=\"*\",RIGHT(AB15)=\"*\"),\"ff\",IF(CH15>CH30,\"t\",IF(CH15<CH30,\"u\",\"g\"))))","v":""},{"$f":"IF(OR(ISERROR(FIND(\"-\",AC15)),AQ15>'export html'!$AR$7),\"\",IF(AND(LEFT(AC15)=\"*\",RIGHT(AC15)=\"*\"),\"ff\",IF(CI15>CI30,\"t\",IF(CI15<CI30,\"u\",\"g\"))))","v":""},{"$f":"IF(OR(ISERROR(FIND(\"-\",AD15)),AR15>'export html'!$AR$7),\"\",IF(AND(LEFT(AD15)=\"*\",RIGHT(AD15)=\"*\"),\"ff\",IF(CJ15>CJ30,\"t\",IF(CJ15<CJ30,\"u\",\"g\"))))","v":""},11,{"$f":"IF(OR(ISERROR(FIND(\"-\",Q15)),AE15<='export html'!$AR$7),\"\",IF(AND(LEFT(Q15)=\"*\",RIGHT(Q15)=\"*\"),\"ff\",IF(CL15>CL30,\"t\",IF(CL15<CL30,\"u\",\"g\"))))","v":""},{"$f":"IF(OR(ISERROR(FIND(\"-\",R15)),AF15<='export html'!$AR$7),\"\",IF(AND(LEFT(R15)=\"*\",RIGHT(R15)=\"*\"),\"ff\",IF(CM15>CM30,\"t\",IF(CM15<CM30,\"u\",\"g\"))))","v":"u"},{"$f":"IF(OR(ISERROR(FIND(\"-\",S15)),AG15<='export html'!$AR$7),\"\",IF(AND(LEFT(S15)=\"*\",RIGHT(S15)=\"*\"),\"ff\",IF(CN15>CN30,\"t\",IF(CN15<CN30,\"u\",\"g\"))))","v":""},{"$f":"IF(OR(ISERROR(FIND(\"-\",T15)),AH15<='export html'!$AR$7),\"\",IF(AND(LEFT(T15)=\"*\",RIGHT(T15)=\"*\"),\"ff\",IF(CO15>CO30,\"t\",IF(CO15<CO30,\"u\",\"g\"))))","v":""},{"$f":"IF(OR(ISERROR(FIND(\"-\",U15)),AI15<='export html'!$AR$7),\"\",IF(AND(LEFT(U15)=\"*\",RIGHT(U15)=\"*\"),\"ff\",IF(CP15>CP30,\"t\",IF(CP15<CP30,\"u\",\"g\"))))","v":""},{"$f":"IF(OR(ISERROR(FIND(\"-\",V15)),AJ15<='export html'!$AR$7),\"\",IF(AND(LEFT(V15)=\"*\",RIGHT(V15)=\"*\"),\"ff\",IF(CQ15>CQ30,\"t\",IF(CQ15<CQ30,\"u\",\"g\"))))","v":"g"},{"$f":"IF(OR(ISERROR(FIND(\"-\",W15)),AK15<='export html'!$AR$7),\"\",IF(AND(LEFT(W15)=\"*\",RIGHT(W15)=\"*\"),\"ff\",IF(CR15>CR30,\"t\",IF(CR15<CR30,\"u\",\"g\"))))","v":"t"},{"$f":"IF(OR(ISERROR(FIND(\"-\",X15)),AL15<='export html'!$AR$7),\"\",IF(AND(LEFT(X15)=\"*\",RIGHT(X15)=\"*\"),\"ff\",IF(CS15>CS30,\"t\",IF(CS15<CS30,\"u\",\"g\"))))","v":""},{"$f":"IF(OR(ISERROR(FIND(\"-\",Y15)),AM15<='export html'!$AR$7),\"\",IF(AND(LEFT(Y15)=\"*\",RIGHT(Y15)=\"*\"),\"ff\",IF(CT15>CT30,\"t\",IF(CT15<CT30,\"u\",\"g\"))))","v":""},{"$f":"IF(OR(ISERROR(FIND(\"-\",Z15)),AN15<='export html'!$AR$7),\"\",IF(AND(LEFT(Z15)=\"*\",RIGHT(Z15)=\"*\"),\"ff\",IF(CU15>CU30,\"t\",IF(CU15<CU30,\"u\",\"g\"))))","v":""},null,{"$f":"IF(OR(ISERROR(FIND(\"-\",AB15)),AP15<='export html'!$AR$7),\"\",IF(AND(LEFT(AB15)=\"*\",RIGHT(AB15)=\"*\"),\"ff\",IF(CW15>CW30,\"t\",IF(CW15<CW30,\"u\",\"g\"))))","v":"g"},{"$f":"IF(OR(ISERROR(FIND(\"-\",AC15)),AQ15<='export html'!$AR$7),\"\",IF(AND(LEFT(AC15)=\"*\",RIGHT(AC15)=\"*\"),\"ff\",IF(CX15>CX30,\"t\",IF(CX15<CX30,\"u\",\"g\"))))","v":"u"},{"$f":"IF(OR(ISERROR(FIND(\"-\",AD15)),AR15<='export html'!$AR$7),\"\",IF(AND(LEFT(AD15)=\"*\",RIGHT(AD15)=\"*\"),\"ff\",IF(CY15>CY30,\"t\",IF(CY15<CY30,\"u\",\"g\"))))","v":"u"},11]
[null,null,null,null,null,null,null,null,null,null,null,null,null,null,null,null,null,null,null,null,null,null,null,null,null,null,null,null,null,null,null,null,null,null,null,null,null,null,null,null,null,null,null,null,null,null,null,null,null,null,null,null,null,null,null,null,null,null,null,null,null,null,null,null,null,null,null,null,null,null,null,null,null,12,{"$f":"IF(OR(ISERROR(FIND(\"-\",Q16)),AE16>'export html'!$AR$7),\"\",IF(AND(LEFT(Q16)=\"*\",RIGHT(Q16)=\"*\"),\"ff\",IF(BW16>BW31,\"t\",IF(BW16<BW31,\"u\",\"g\"))))","v":""},{"$f":"IF(OR(ISERROR(FIND(\"-\",R16)),AF16>'export html'!$AR$7),\"\",IF(AND(LEFT(R16)=\"*\",RIGHT(R16)=\"*\"),\"ff\",IF(BX16>BX31,\"t\",IF(BX16<BX31,\"u\",\"g\"))))","v":""},{"$f":"IF(OR(ISERROR(FIND(\"-\",S16)),AG16>'export html'!$AR$7),\"\",IF(AND(LEFT(S16)=\"*\",RIGHT(S16)=\"*\"),\"ff\",IF(BY16>BY31,\"t\",IF(BY16<BY31,\"u\",\"g\"))))","v":""},{"$f":"IF(OR(ISERROR(FIND(\"-\",T16)),AH16>'export html'!$AR$7),\"\",IF(AND(LEFT(T16)=\"*\",RIGHT(T16)=\"*\"),\"ff\",IF(BZ16>BZ31,\"t\",IF(BZ16<BZ31,\"u\",\"g\"))))","v":"t"},{"$f":"IF(OR(ISERROR(FIND(\"-\",U16)),AI16>'export html'!$AR$7),\"\",IF(AND(LEFT(U16)=\"*\",RIGHT(U16)=\"*\"),\"ff\",IF(CA16>CA31,\"t\",IF(CA16<CA31,\"u\",\"g\"))))","v":""},{"$f":"IF(OR(ISERROR(FIND(\"-\",V16)),AJ16>'export html'!$AR$7),\"\",IF(AND(LEFT(V16)=\"*\",RIGHT(V16)=\"*\"),\"ff\",IF(CB16>CB31,\"t\",IF(CB16<CB31,\"u\",\"g\"))))","v":"u"},{"$f":"IF(OR(ISERROR(FIND(\"-\",W16)),AK16>'export html'!$AR$7),\"\",IF(AND(LEFT(W16)=\"*\",RIGHT(W16)=\"*\"),\"ff\",IF(CC16>CC31,\"t\",IF(CC16<CC31,\"u\",\"g\"))))","v":"t"},{"$f":"IF(OR(ISERROR(FIND(\"-\",X16)),AL16>'export html'!$AR$7),\"\",IF(AND(LEFT(X16)=\"*\",RIGHT(X16)=\"*\"),\"ff\",IF(CD16>CD31,\"t\",IF(CD16<CD31,\"u\",\"g\"))))","v":""},{"$f":"IF(OR(ISERROR(FIND(\"-\",Y16)),AM16>'export html'!$AR$7),\"\",IF(AND(LEFT(Y16)=\"*\",RIGHT(Y16)=\"*\"),\"ff\",IF(CE16>CE31,\"t\",IF(CE16<CE31,\"u\",\"g\"))))","v":""},{"$f":"IF(OR(ISERROR(FIND(\"-\",Z16)),AN16>'export html'!$AR$7),\"\",IF(AND(LEFT(Z16)=\"*\",RIGHT(Z16)=\"*\"),\"ff\",IF(CF16>CF31,\"t\",IF(CF16<CF31,\"u\",\"g\"))))","v":"t"},{"$f":"IF(OR(ISERROR(FIND(\"-\",AA16)),AO16>'export html'!$AR$7),\"\",IF(AND(LEFT(AA16)=\"*\",RIGHT(AA16)=\"*\"),\"ff\",IF(CG16>CG31,\"t\",IF(CG16<CG31,\"u\",\"g\"))))","v":"u"},null,{"$f":"IF(OR(ISERROR(FIND(\"-\",AC16)),AQ16>'export html'!$AR$7),\"\",IF(AND(LEFT(AC16)=\"*\",RIGHT(AC16)=\"*\"),\"ff\",IF(CI16>CI31,\"t\",IF(CI16<CI31,\"u\",\"g\"))))","v":"t"},{"$f":"IF(OR(ISERROR(FIND(\"-\",AD16)),AR16>'export html'!$AR$7),\"\",IF(AND(LEFT(AD16)=\"*\",RIGHT(AD16)=\"*\"),\"ff\",IF(CJ16>CJ31,\"t\",IF(CJ16<CJ31,\"u\",\"g\"))))","v":""},12,{"$f":"IF(OR(ISERROR(FIND(\"-\",Q16)),AE16<='export html'!$AR$7),\"\",IF(AND(LEFT(Q16)=\"*\",RIGHT(Q16)=\"*\"),\"ff\",IF(CL16>CL31,\"t\",IF(CL16<CL31,\"u\",\"g\"))))","v":"u"},{"$f":"IF(OR(ISERROR(FIND(\"-\",R16)),AF16<='export html'!$AR$7),\"\",IF(AND(LEFT(R16)=\"*\",RIGHT(R16)=\"*\"),\"ff\",IF(CM16>CM31,\"t\",IF(CM16<CM31,\"u\",\"g\"))))","v":"u"},{"$f":"IF(OR(ISERROR(FIND(\"-\",S16)),AG16<='export html'!$AR$7),\"\",IF(AND(LEFT(S16)=\"*\",RIGHT(S16)=\"*\"),\"ff\",IF(CN16>CN31,\"t\",IF(CN16<CN31,\"u\",\"g\"))))","v":""},{"$f":"IF(OR(ISERROR(FIND(\"-\",T16)),AH16<='export html'!$AR$7),\"\",IF(AND(LEFT(T16)=\"*\",RIGHT(T16)=\"*\"),\"ff\",IF(CO16>CO31,\"t\",IF(CO16<CO31,\"u\",\"g\"))))","v":""},{"$f":"IF(OR(ISERROR(FIND(\"-\",U16)),AI16<='export html'!$AR$7),\"\",IF(AND(LEFT(U16)=\"*\",RIGHT(U16)=\"*\"),\"ff\",IF(CP16>CP31,\"t\",IF(CP16<CP31,\"u\",\"g\"))))","v":"t"},{"$f":"IF(OR(ISERROR(FIND(\"-\",V16)),AJ16<='export html'!$AR$7),\"\",IF(AND(LEFT(V16)=\"*\",RIGHT(V16)=\"*\"),\"ff\",IF(CQ16>CQ31,\"t\",IF(CQ16<CQ31,\"u\",\"g\"))))","v":""},{"$f":"IF(OR(ISERROR(FIND(\"-\",W16)),AK16<='export html'!$AR$7),\"\",IF(AND(LEFT(W16)=\"*\",RIGHT(W16)=\"*\"),\"ff\",IF(CR16>CR31,\"t\",IF(CR16<CR31,\"u\",\"g\"))))","v":""},{"$f":"IF(OR(ISERROR(FIND(\"-\",X16)),AL16<='export html'!$AR$7),\"\",IF(AND(LEFT(X16)=\"*\",RIGHT(X16)=\"*\"),\"ff\",IF(CS16>CS31,\"t\",IF(CS16<CS31,\"u\",\"g\"))))","v":"t"},{"$f":"IF(OR(ISERROR(FIND(\"-\",Y16)),AM16<='export html'!$AR$7),\"\",IF(AND(LEFT(Y16)=\"*\",RIGHT(Y16)=\"*\"),\"ff\",IF(CT16>CT31,\"t\",IF(CT16<CT31,\"u\",\"g\"))))","v":"t"},{"$f":"IF(OR(ISERROR(FIND(\"-\",Z16)),AN16<='export html'!$AR$7),\"\",IF(AND(LEFT(Z16)=\"*\",RIGHT(Z16)=\"*\"),\"ff\",IF(CU16>CU31,\"t\",IF(CU16<CU31,\"u\",\"g\"))))","v":""},{"$f":"IF(OR(ISERROR(FIND(\"-\",AA16)),AO16<='export html'!$AR$7),\"\",IF(AND(LEFT(AA16)=\"*\",RIGHT(AA16)=\"*\"),\"ff\",IF(CV16>CV31,\"t\",IF(CV16<CV31,\"u\",\"g\"))))","v":""},null,{"$f":"IF(OR(ISERROR(FIND(\"-\",AC16)),AQ16<='export html'!$AR$7),\"\",IF(AND(LEFT(AC16)=\"*\",RIGHT(AC16)=\"*\"),\"ff\",IF(CX16>CX31,\"t\",IF(CX16<CX31,\"u\",\"g\"))))","v":""},{"$f":"IF(OR(ISERROR(FIND(\"-\",AD16)),AR16<='export html'!$AR$7),\"\",IF(AND(LEFT(AD16)=\"*\",RIGHT(AD16)=\"*\"),\"ff\",IF(CY16>CY31,\"t\",IF(CY16<CY31,\"u\",\"g\"))))","v":"u"},12]
[null,null,null,null,null,null,null,null,null,null,null,null,null,null,null,null,null,null,null,null,null,null,null,null,null,null,null,null,null,null,null,null,null,null,null,null,null,null,null,null,null,null,null,null,null,null,null,null,null,null,null,null,null,null,null,null,null,null,null,null,null,null,null,null,null,null,null,null,null,null,null,null,null,13,{"$f":"IF(OR(ISERROR(FIND(\"-\",Q17)),AE17>'export html'!$AR$7),\"\",IF(AND(LEFT(Q17)=\"*\",RIGHT(Q17)=\"*\"),\"ff\",IF(BW17>BW32,\"t\",IF(BW17<BW32,\"u\",\"g\"))))","v":""},{"$f":"IF(OR(ISERROR(FIND(\"-\",R17)),AF17>'export html'!$AR$7),\"\",IF(AND(LEFT(R17)=\"*\",RIGHT(R17)=\"*\"),\"ff\",IF(BX17>BX32,\"t\",IF(BX17<BX32,\"u\",\"g\"))))","v":""},{"$f":"IF(OR(ISERROR(FIND(\"-\",S17)),AG17>'export html'!$AR$7),\"\",IF(AND(LEFT(S17)=\"*\",RIGHT(S17)=\"*\"),\"ff\",IF(BY17>BY32,\"t\",IF(BY17<BY32,\"u\",\"g\"))))","v":""},{"$f":"IF(OR(ISERROR(FIND(\"-\",T17)),AH17>'export html'!$AR$7),\"\",IF(AND(LEFT(T17)=\"*\",RIGHT(T17)=\"*\"),\"ff\",IF(BZ17>BZ32,\"t\",IF(BZ17<BZ32,\"u\",\"g\"))))","v":"g"},{"$f":"IF(OR(ISERROR(FIND(\"-\",U17)),AI17>'export html'!$AR$7),\"\",IF(AND(LEFT(U17)=\"*\",RIGHT(U17)=\"*\"),\"ff\",IF(CA17>CA32,\"t\",IF(CA17<CA32,\"u\",\"g\"))))","v":"g"},{"$f":"IF(OR(ISERROR(FIND(\"-\",V17)),AJ17>'export html'!$AR$7),\"\",IF(AND(LEFT(V17)=\"*\",RIGHT(V17)=\"*\"),\"ff\",IF(CB17>CB32,\"t\",IF(CB17<CB32,\"u\",\"g\"))))","v":""},{"$f":"IF(OR(ISERROR(FIND(\"-\",W17)),AK17>'export html'!$AR$7),\"\",IF(AND(LEFT(W17)=\"*\",RIGHT(W17)=\"*\"),\"ff\",IF(CC17>CC32,\"t\",IF(CC17<CC32,\"u\",\"g\"))))","v":"t"},{"$f":"IF(OR(ISERROR(FIND(\"-\",X17)),AL17>'export html'!$AR$7),\"\",IF(AND(LEFT(X17)=\"*\",RIGHT(X17)=\"*\"),\"ff\",IF(CD17>CD32,\"t\",IF(CD17<CD32,\"u\",\"g\"))))","v":"t"},{"$f":"IF(OR(ISERROR(FIND(\"-\",Y17)),AM17>'export html'!$AR$7),\"\",IF(AND(LEFT(Y17)=\"*\",RIGHT(Y17)=\"*\"),\"ff\",IF(CE17>CE32,\"t\",IF(CE17<CE32,\"u\",\"g\"))))","v":""},{"$f":"IF(OR(ISERROR(FIND(\"-\",Z17)),AN17>'export html'!$AR$7),\"\",IF(AND(LEFT(Z17)=\"*\",RIGHT(Z17)=\"*\"),\"ff\",IF(CF17>CF32,\"t\",IF(CF17<CF32,\"u\",\"g\"))))","v":"t"},{"$f":"IF(OR(ISERROR(FIND(\"-\",AA17)),AO17>'export html'!$AR$7),\"\",IF(AND(LEFT(AA17)=\"*\",RIGHT(AA17)=\"*\"),\"ff\",IF(CG17>CG32,\"t\",IF(CG17<CG32,\"u\",\"g\"))))","v":"u"},{"$f":"IF(OR(ISERROR(FIND(\"-\",AB17)),AP17>'export html'!$AR$7),\"\",IF(AND(LEFT(AB17)=\"*\",RIGHT(AB17)=\"*\"),\"ff\",IF(CH17>CH32,\"t\",IF(CH17<CH32,\"u\",\"g\"))))","v":""},null,{"$f":"IF(OR(ISERROR(FIND(\"-\",AD17)),AR17>'export html'!$AR$7),\"\",IF(AND(LEFT(AD17)=\"*\",RIGHT(AD17)=\"*\"),\"ff\",IF(CJ17>CJ32,\"t\",IF(CJ17<CJ32,\"u\",\"g\"))))","v":""},13,{"$f":"IF(OR(ISERROR(FIND(\"-\",Q17)),AE17<='export html'!$AR$7),\"\",IF(AND(LEFT(Q17)=\"*\",RIGHT(Q17)=\"*\"),\"ff\",IF(CL17>CL32,\"t\",IF(CL17<CL32,\"u\",\"g\"))))","v":"g"},{"$f":"IF(OR(ISERROR(FIND(\"-\",R17)),AF17<='export html'!$AR$7),\"\",IF(AND(LEFT(R17)=\"*\",RIGHT(R17)=\"*\"),\"ff\",IF(CM17>CM32,\"t\",IF(CM17<CM32,\"u\",\"g\"))))","v":"g"},{"$f":"IF(OR(ISERROR(FIND(\"-\",S17)),AG17<='export html'!$AR$7),\"\",IF(AND(LEFT(S17)=\"*\",RIGHT(S17)=\"*\"),\"ff\",IF(CN17>CN32,\"t\",IF(CN17<CN32,\"u\",\"g\"))))","v":"t"},{"$f":"IF(OR(ISERROR(FIND(\"-\",T17)),AH17<='export html'!$AR$7),\"\",IF(AND(LEFT(T17)=\"*\",RIGHT(T17)=\"*\"),\"ff\",IF(CO17>CO32,\"t\",IF(CO17<CO32,\"u\",\"g\"))))","v":""},{"$f":"IF(OR(ISERROR(FIND(\"-\",U17)),AI17<='export html'!$AR$7),\"\",IF(AND(LEFT(U17)=\"*\",RIGHT(U17)=\"*\"),\"ff\",IF(CP17>CP32,\"t\",IF(CP17<CP32,\"u\",\"g\"))))","v":""},{"$f":"IF(OR(ISERROR(FIND(\"-\",V17)),AJ17<='export html'!$AR$7),\"\",IF(AND(LEFT(V17)=\"*\",RIGHT(V17)=\"*\"),\"ff\",IF(CQ17>CQ32,\"t\",IF(CQ17<CQ32,\"u\",\"g\"))))","v":"g"},{"$f":"IF(OR(ISERROR(FIND(\"-\",W17)),AK17<='export html'!$AR$7),\"\",IF(AND(LEFT(W17)=\"*\",RIGHT(W17)=\"*\"),\"ff\",IF(CR17>CR32,\"t\",IF(CR17<CR32,\"u\",\"g\"))))","v":""},{"$f":"IF(OR(ISERROR(FIND(\"-\",X17)),AL17<='export html'!$AR$7),\"\",IF(AND(LEFT(X17)=\"*\",RIGHT(X17)=\"*\"),\"ff\",IF(CS17>CS32,\"t\",IF(CS17<CS32,\"u\",\"g\"))))","v":""},{"$f":"IF(OR(ISERROR(FIND(\"-\",Y17)),AM17<='export html'!$AR$7),\"\",IF(AND(LEFT(Y17)=\"*\",RIGHT(Y17)=\"*\"),\"ff\",IF(CT17>CT32,\"t\",IF(CT17<CT32,\"u\",\"g\"))))","v":"t"},{"$f":"IF(OR(ISERROR(FIND(\"-\",Z17)),AN17<='export html'!$AR$7),\"\",IF(AND(LEFT(Z17)=\"*\",RIGHT(Z17)=\"*\"),\"ff\",IF(CU17>CU32,\"t\",IF(CU17<CU32,\"u\",\"g\"))))","v":""},{"$f":"IF(OR(ISERROR(FIND(\"-\",AA17)),AO17<='export html'!$AR$7),\"\",IF(AND(LEFT(AA17)=\"*\",RIGHT(AA17)=\"*\"),\"ff\",IF(CV17>CV32,\"t\",IF(CV17<CV32,\"u\",\"g\"))))","v":""},{"$f":"IF(OR(ISERROR(FIND(\"-\",AB17)),AP17<='export html'!$AR$7),\"\",IF(AND(LEFT(AB17)=\"*\",RIGHT(AB17)=\"*\"),\"ff\",IF(CW17>CW32,\"t\",IF(CW17<CW32,\"u\",\"g\"))))","v":"g"},null,{"$f":"IF(OR(ISERROR(FIND(\"-\",AD17)),AR17<='export html'!$AR$7),\"\",IF(AND(LEFT(AD17)=\"*\",RIGHT(AD17)=\"*\"),\"ff\",IF(CY17>CY32,\"t\",IF(CY17<CY32,\"u\",\"g\"))))","v":"u"},13]
[null,null,null,null,null,null,null,null,null,null,null,null,null,null,null,null,null,null,null,null,null,null,null,null,null,null,null,null,null,null,null,null,null,null,null,null,null,null,null,null,null,null,null,null,null,null,null,null,null,null,null,null,null,null,null,null,null,null,null,null,null,null,null,null,null,null,null,null,null,null,null,null,null,14,{"$f":"IF(OR(ISERROR(FIND(\"-\",Q18)),AE18>'export html'!$AR$7),\"\",IF(AND(LEFT(Q18)=\"*\",RIGHT(Q18)=\"*\"),\"ff\",IF(BW18>BW33,\"t\",IF(BW18<BW33,\"u\",\"g\"))))","v":""},{"$f":"IF(OR(ISERROR(FIND(\"-\",R18)),AF18>'export html'!$AR$7),\"\",IF(AND(LEFT(R18)=\"*\",RIGHT(R18)=\"*\"),\"ff\",IF(BX18>BX33,\"t\",IF(BX18<BX33,\"u\",\"g\"))))","v":""},{"$f":"IF(OR(ISERROR(FIND(\"-\",S18)),AG18>'export html'!$AR$7),\"\",IF(AND(LEFT(S18)=\"*\",RIGHT(S18)=\"*\"),\"ff\",IF(BY18>BY33,\"t\",IF(BY18<BY33,\"u\",\"g\"))))","v":""},{"$f":"IF(OR(ISERROR(FIND(\"-\",T18)),AH18>'export html'!$AR$7),\"\",IF(AND(LEFT(T18)=\"*\",RIGHT(T18)=\"*\"),\"ff\",IF(BZ18>BZ33,\"t\",IF(BZ18<BZ33,\"u\",\"g\"))))","v":"t"},{"$f":"IF(OR(ISERROR(FIND(\"-\",U18)),AI18>'export html'!$AR$7),\"\",IF(AND(LEFT(U18)=\"*\",RIGHT(U18)=\"*\"),\"ff\",IF(CA18>CA33,\"t\",IF(CA18<CA33,\"u\",\"g\"))))","v":""},{"$f":"IF(OR(ISERROR(FIND(\"-\",V18)),AJ18>'export html'!$AR$7),\"\",IF(AND(LEFT(V18)=\"*\",RIGHT(V18)=\"*\"),\"ff\",IF(CB18>CB33,\"t\",IF(CB18<CB33,\"u\",\"g\"))))","v":"u"},{"$f":"IF(OR(ISERROR(FIND(\"-\",W18)),AK18>'export html'!$AR$7),\"\",IF(AND(LEFT(W18)=\"*\",RIGHT(W18)=\"*\"),\"ff\",IF(CC18>CC33,\"t\",IF(CC18<CC33,\"u\",\"g\"))))","v":"t"},{"$f":"IF(OR(ISERROR(FIND(\"-\",X18)),AL18>'export html'!$AR$7),\"\",IF(AND(LEFT(X18)=\"*\",RIGHT(X18)=\"*\"),\"ff\",IF(CD18>CD33,\"t\",IF(CD18<CD33,\"u\",\"g\"))))","v":""},{"$f":"IF(OR(ISERROR(FIND(\"-\",Y18)),AM18>'export html'!$AR$7),\"\",IF(AND(LEFT(Y18)=\"*\",RIGHT(Y18)=\"*\"),\"ff\",IF(CE18>CE33,\"t\",IF(CE18<CE33,\"u\",\"g\"))))","v":""},{"$f":"IF(OR(ISERROR(FIND(\"-\",Z18)),AN18>'export html'!$AR$7),\"\",IF(AND(LEFT(Z18)=\"*\",RIGHT(Z18)=\"*\"),\"ff\",IF(CF18>CF33,\"t\",IF(CF18<CF33,\"u\",\"g\"))))","v":""},{"$f":"IF(OR(ISERROR(FIND(\"-\",AA18)),AO18>'export html'!$AR$7),\"\",IF(AND(LEFT(AA18)=\"*\",RIGHT(AA18)=\"*\"),\"ff\",IF(CG18>CG33,\"t\",IF(CG18<CG33,\"u\",\"g\"))))","v":"t"},{"$f":"IF(OR(ISERROR(FIND(\"-\",AB18)),AP18>'export html'!$AR$7),\"\",IF(AND(LEFT(AB18)=\"*\",RIGHT(AB18)=\"*\"),\"ff\",IF(CH18>CH33,\"t\",IF(CH18<CH33,\"u\",\"g\"))))","v":"t"},{"$f":"IF(OR(ISERROR(FIND(\"-\",AC18)),AQ18>'export html'!$AR$7),\"\",IF(AND(LEFT(AC18)=\"*\",RIGHT(AC18)=\"*\"),\"ff\",IF(CI18>CI33,\"t\",IF(CI18<CI33,\"u\",\"g\"))))","v":"t"},null,14,{"$f":"IF(OR(ISERROR(FIND(\"-\",Q18)),AE18<='export html'!$AR$7),\"\",IF(AND(LEFT(Q18)=\"*\",RIGHT(Q18)=\"*\"),\"ff\",IF(CL18>CL33,\"t\",IF(CL18<CL33,\"u\",\"g\"))))","v":"t"},{"$f":"IF(OR(ISERROR(FIND(\"-\",R18)),AF18<='export html'!$AR$7),\"\",IF(AND(LEFT(R18)=\"*\",RIGHT(R18)=\"*\"),\"ff\",IF(CM18>CM33,\"t\",IF(CM18<CM33,\"u\",\"g\"))))","v":""},{"$f":"IF(OR(ISERROR(FIND(\"-\",S18)),AG18<='export html'!$AR$7),\"\",IF(AND(LEFT(S18)=\"*\",RIGHT(S18)=\"*\"),\"ff\",IF(CN18>CN33,\"t\",IF(CN18<CN33,\"u\",\"g\"))))","v":"u"},{"$f":"IF(OR(ISERROR(FIND(\"-\",T18)),AH18<='export html'!$AR$7),\"\",IF(AND(LEFT(T18)=\"*\",RIGHT(T18)=\"*\"),\"ff\",IF(CO18>CO33,\"t\",IF(CO18<CO33,\"u\",\"g\"))))","v":""},{"$f":"IF(OR(ISERROR(FIND(\"-\",U18)),AI18<='export html'!$AR$7),\"\",IF(AND(LEFT(U18)=\"*\",RIGHT(U18)=\"*\"),\"ff\",IF(CP18>CP33,\"t\",IF(CP18<CP33,\"u\",\"g\"))))","v":"t"},{"$f":"IF(OR(ISERROR(FIND(\"-\",V18)),AJ18<='export html'!$AR$7),\"\",IF(AND(LEFT(V18)=\"*\",RIGHT(V18)=\"*\"),\"ff\",IF(CQ18>CQ33,\"t\",IF(CQ18<CQ33,\"u\",\"g\"))))","v":""},{"$f":"IF(OR(ISERROR(FIND(\"-\",W18)),AK18<='export html'!$AR$7),\"\",IF(AND(LEFT(W18)=\"*\",RIGHT(W18)=\"*\"),\"ff\",IF(CR18>CR33,\"t\",IF(CR18<CR33,\"u\",\"g\"))))","v":""},{"$f":"IF(OR(ISERROR(FIND(\"-\",X18)),AL18<='export html'!$AR$7),\"\",IF(AND(LEFT(X18)=\"*\",RIGHT(X18)=\"*\"),\"ff\",IF(CS18>CS33,\"t\",IF(CS18<CS33,\"u\",\"g\"))))","v":"u"},{"$f":"IF(OR(ISERROR(FIND(\"-\",Y18)),AM18<='export html'!$AR$7),\"\",IF(AND(LEFT(Y18)=\"*\",RIGHT(Y18)=\"*\"),\"ff\",IF(CT18>CT33,\"t\",IF(CT18<CT33,\"u\",\"g\"))))","v":"t"},{"$f":"IF(OR(ISERROR(FIND(\"-\",Z18)),AN18<='export html'!$AR$7),\"\",IF(AND(LEFT(Z18)=\"*\",RIGHT(Z18)=\"*\"),\"ff\",IF(CU18>CU33,\"t\",IF(CU18<CU33,\"u\",\"g\"))))","v":"u"},{"$f":"IF(OR(ISERROR(FIND(\"-\",AA18)),AO18<='export html'!$AR$7),\"\",IF(AND(LEFT(AA18)=\"*\",RIGHT(AA18)=\"*\"),\"ff\",IF(CV18>CV33,\"t\",IF(CV18<CV33,\"u\",\"g\"))))","v":""},{"$f":"IF(OR(ISERROR(FIND(\"-\",AB18)),AP18<='export html'!$AR$7),\"\",IF(AND(LEFT(AB18)=\"*\",RIGHT(AB18)=\"*\"),\"ff\",IF(CW18>CW33,\"t\",IF(CW18<CW33,\"u\",\"g\"))))","v":""},{"$f":"IF(OR(ISERROR(FIND(\"-\",AC18)),AQ18<='export html'!$AR$7),\"\",IF(AND(LEFT(AC18)=\"*\",RIGHT(AC18)=\"*\"),\"ff\",IF(CX18>CX33,\"t\",IF(CX18<CX33,\"u\",\"g\"))))","v":""},null,14]
[null,null,null,null,null,null,null,null,null,null,null,null,null,null,null,null,null,null,null,null,null,null,null,null,null,null,null,null,null,null,null,null,null,null,null,null,null,null,null,null,null,null,null,null,null,null,null,null,null,null,null,null,null,null,null,null,null,null,null,null,null,null,null,null,null,null,null,null,null,null,null,null,null,null,1,2,3,4,5,6,7,8,9,10,11,12,13,14,null,1,2,3,4,5,6,7,8,9,10,11,12,13,14]

{"sheet":"kalender","index":1,"n_rows":39,"n_cols":7,"rows_kept":39,"cut":false,"hidden":false,"merged":[]}
[]
[null,"Spd.","Datum","Thuisploeg",null,"Uitploeg","Uitslag"]
["Competitie",{"$f":"IF(LEN('export html'!BF3),'export html'!BF3,\"\")","v":1},{"$f":"IF(LEN('export html'!BE3),'export html'!BE3,\"\")","v":"2024-09-01"},{"$f":"IF(LEN('export html'!BI3),'export html'!BI3,\"\")","v":"Lucyvo"},{"$f":"IF(LEN('export html'!BI3),\"-\",\"\")","v":"-"},{"$f":"IF(LEN('export html'!BJ3),'export html'!BJ3,\"\")","v":"Bar Patron"},{"$f":"IF(LEN('export html'!BH3),'export html'!BH3,\"\")","v":"2-4"}]
[null,{"$f":"IF(LEN('export html'!BF4),'export html'!BF4,\"\")","v":2},{"$f":"IF(LEN('export html'!BE4),'export html'!BE4,\"\")","v":"2024-09-08"},{"$f":"IF(LEN('export html'!BI4),'export html'!BI4,\"\")","v":"Goka"},{"$f":"IF(LEN('export html'!BI4),\"-\",\"\")","v":"-"},{"$f":"IF(LEN('export html'!BJ4),'export html'!BJ4,\"\")","v":"Lucyvo"},{"$f":"IF(LEN('export html'!BH4),'export html'!BH4,\"\")","v":"3-0"}]
[null,{"$f":"IF(LEN('export html'!BF5),'export html'!BF5,\"\")","v":3},{"$f":"IF(LEN('export html'!BE5),'export html'!BE5,\"\")","v":"2024-09-15"},{"$f":"IF(LEN('export html'!BI5),'export html'!BI5,\"\")","v":"Lucyvo"},{"$f":"IF(LEN('export html'!BI5),\"-\",\"\")","v":"-"},{"$f":"IF(LEN('export html'!BJ5),'export html'!BJ5,\"\")","v":"Alberta Schilde"},{"$f":"IF(LEN('export html'!BH5),'export html'!BH5,\"\")","v":"1-5"}]
[null,{"$f":"IF(LEN('export html'!BF6),'export html'!BF6,\"\")","v":4},{"$f":"IF(LEN('export html'!BE6),'export html'!BE6,\"\")","v":"2024-09-21"},{"$f":"IF(LEN('export html'!BI6),'export html'!BI6,\"\")","v":"SC Duffel"},{"$f":"IF(LEN('export html'!BI6),\"-\",\"\")","v":"-"},{"$f":"IF(LEN('export html'!BJ6),'export html'!BJ6,\"\")","v":"Lucyvo"},{"$f":"IF(LEN('export html'!BH6),'export html'!BH6,\"\")","v":"3-1"}]
[null,{"$f":"IF(LEN('export html'!BF7),'export html'!BF7,\"\")","v":5},{"$f":"IF(LEN('export html'!BE7),'export html'!BE7,\"\")","v":"2024-09-29"},{"$f":"IF(LEN('export html'!BI7),'export html'!BI7,\"\")","v":"Lucyvo"},{"$f":"IF(LEN('export html'!BI7),\"-\",\"\")","v":"-"},{"$f":"IF(LEN('export html'!BJ7),'export html'!BJ7,\"\")","v":"Hombeek"},{"$f":"IF(LEN('export html'!BH7),'export html'!BH7,\"\")","v":"5-1"}]
[null,{"$f":"IF(LEN('export html'!BF8),'export html'!BF8,\"\")","v":6},{"$f":"IF(LEN('export html'!BE8),'export html'!BE8,\"\")","v":"2024-10-06"},{"$f":"IF(LEN('export html'!BI8),'export html'!BI8,\"\")","v":"Daltons"},{"$f":"IF(LEN('export html'!BI8),\"-\",\"\")","v":"-"},{"$f":"IF(LEN('export html'!BJ8),'export html'!BJ8,\"\")","v":"Lucyvo"},{"$f":"IF(LEN('export html'!BH8),'export html'!BH8,\"\")","v":"3-0"}]
[null,{"$f":"IF(LEN('export html'!BF9),'export html'!BF9,\"\")","v":7},{"$f":"IF(LEN('export html'!BE9),'export html'!BE9,\"\")","v":"2024-10-13"},{"$f":"IF(LEN('export html'!BI9),'export html'!BI9,\"\")","v":"Lucyvo"},{"$f":"IF(LEN('export html'!BI9),\"-\",\"\")","v":"-"},{"$f":"IF(LEN('export html'!BJ9),'export html'!BJ9,\"\")","v":"Corum"},{"$f":"IF(LEN('export html'!BH9),'export html'!BH9,\"\")","v":"5-5"}]
[null,{"$f":"IF(LEN('export html'!BF10),'export html'!BF10,\"\")","v":8},{"$f":"IF(LEN('export html'!BE10),'export html'!BE10,\"\")","v":"2024-10-20"},{"$f":"IF(LEN('export html'!BI10),'export html'!BI10,\"\")","v":"Sint Anneke"},{"$f":"IF(LEN('export html'!BI10),\"-\",\"\")","v":"-"},{"$f":"IF(LEN('export html'!BJ10),'export html'!BJ10,\"\")","v":"Lucyvo"},{"$f":"IF(LEN('export html'!BH10),'export html'!BH10,\"\")","v":"4-0"}]
[null,{"$f":"IF(LEN('export html'!BF11),'export html'!BF11,\"\")","v":9},{"$f":"IF(LEN('export html'!BE11),'export html'!BE11,\"\")","v":"2024-11-03"},{"$f":"IF(LEN('export html'!BI11),'export html'!BI11,\"\")","v":"Jolika"},{"$f":"IF(LEN('export html'!BI11),\"-\",\"\")","v":"-"},{"$f":"IF(LEN('export html'!BJ11),'export html'!BJ11,\"\")","v":"Lucyvo"},{"$f":"IF(LEN('export html'!BH11),'export html'!BH11,\"\")","v":"1-1"}]
[null,{"$f":"IF(LEN('export html'!BF12),'export html'!BF12,\"\")","v":10},{"$f":"IF(LEN('export html'!BE12),'export html'!BE12,\"\")","v":"2024-11-10"},{"$f":"IF(LEN('export html'!BI12),'export html'!BI12,\"\")","v":"Lucyvo"},{"$f":"IF(LEN('export html'!BI12),\"-\",\"\")","v":"-"},{"$f":"IF(LEN('export html'!BJ12),'export html'!BJ12,\"\")","v":"Yerevan United"},{"$f":"IF(LEN('export html'!BH12),'export html'!BH12,\"\")","v":"6-2"}]
[null,{"$f":"IF(LEN('export html'!BF13),'export html'!BF13,\"\")","v":11},{"$f":"IF(LEN('export html'!BE13),'export html'!BE13,\"\")","v":"2024-11-17"},{"$f":"IF(LEN('export html'!BI13),'export html'!BI13,\"\")","v":"Bariton"},{"$f":"IF(LEN('export html'!BI13),\"-\",\"\")","v":"-"},{"$f":"IF(LEN('export html'!BJ13),'export html'!BJ13,\"\")","v":"Lucyvo"},{"$f":"IF(LEN('export html'!BH13),'export html'!BH13,\"\")","v":"1-1"}]
[null,{"$f":"IF(LEN('export html'!BF14),'export html'!BF14,\"\")","v":12},{"$f":"IF(LEN('export html'!BE14),'export html'!BE14,\"\")","v":"2024-11-24"},{"$f":"IF(LEN('export html'!BI14),'export html'!BI14,\"\")","v":"Lucyvo"},{"$f":"IF(LEN('export html'!BI14),\"-\",\"\")","v":"-"},{"$f":"IF(LEN('export html'!BJ14),'export html'!BJ14,\"\")","v":"Antwerp Global"},{"$f":"IF(LEN('export html'!BH14),'export html'!BH14,\"\")","v":"1-7"}]
[null,{"$f":"IF(LEN('export html'!BF15),'export html'!BF15,\"\")","v":13},{"$f":"IF(LEN('export html'!BE15),'export html'!BE15,\"\")","v":"2024-12-01"},{"$f":"IF(LEN('export html'!BI15),'export html'!BI15,\"\")","v":"Racing Emblem"},{"$f":"IF(LEN('export html'!BI15),\"-\",\"\")","v":"-"},{"$f":"IF(LEN('export html'!BJ15),'export html'!BJ15,\"\")","v":"Lucyvo"},{"$f":"IF(LEN('export html'!BH15),'export html'!BH15,\"\")","v":"8-2"}]
[null,{"$f":"IF(LEN('export html'!BF16),'export html'!BF16,\"\")","v":14},{"$f":"IF(LEN('export html'!BE16),'export html'!BE16,\"\")","v":"2024-12-08"},{"$f":"IF(LEN('export html'!BI16),'export html'!BI16,\"\")","v":"Bar Patron"},{"$f":"IF(LEN('export html'!BI16),\"-\",\"\")","v":"-"},{"$f":"IF(LEN('export html'!BJ16),'export html'!BJ16,\"\")","v":"Lucyvo"},{"$f":"IF(LEN('export html'!BH16),'export html'!BH16,\"\")","v":"3-3"}]
[null,{"$f":"IF(LEN('export html'!BF17),'export html'!BF17,\"\")","v":17},{"$f":"IF(LEN('export html'!BE17),'export html'!BE17,\"\")","v":"2024-12-22"},{"$f":"IF(LEN('export html'!BI17),'export html'!BI17,\"\")","v":"Lucyvo"},{"$f":"IF(LEN('export html'!BI17),\"-\",\"\")","v":"-"},{"$f":"IF(LEN('export html'!BJ17),'export html'!BJ17,\"\")","v":"SC Duffel"},{"$f":"IF(LEN('export html'!BH17),'export html'!BH17,\"\")","v":"4-8"}]
[null,{"$f":"IF(LEN('export html'!BF18),'export html'!BF18,\"\")","v":16},{"$f":"IF(LEN('export html'!BE18),'export html'!BE18,\"\")","v":"2025-01-19"},{"$f":"IF(LEN('export html'!BI18),'export html'!BI18,\"\")","v":"Alberta Schilde"},{"$f":"IF(LEN('export html'!BI18),\"-\",\"\")","v":"-"},{"$f":"IF(LEN('export html'!BJ18),'export html'!BJ18,\"\")","v":"Lucyvo"},{"$f":"IF(LEN('export html'!BH18),'export html'!BH18,\"\")","v":"4-5"}]
[null,{"$f":"IF(LEN('export html'!BF19),'export html'!BF19,\"\")","v":19},{"$f":"IF(LEN('export html'!BE19),'export html'!BE19,\"\")","v":"2025-02-09"},{"$f":"IF(LEN('export html'!BI19),'export html'!BI19,\"\")","v":"Lucyvo"},{"$f":"IF(LEN('export html'!BI19),\"-\",\"\")","v":"-"},{"$f":"IF(LEN('export html'!BJ19),'export html'!BJ19,\"\")","v":"Daltons"},{"$f":"IF(LEN('export html'!BH19),'export html'!BH19,\"\")","v":"0-5*"}]
[null,{"$f":"IF(LEN('export html'!BF20),'export html'!BF20,\"\")","v":20},{"$f":"IF(LEN('export html'!BE20),'export html'!BE20,\"\")","v":"2025-02-16"},{"$f":"IF(LEN('export html'!BI20),'export html'!BI20,\"\")","v":"Corum"},{"$f":"IF(LEN('export html'!BI20),\"-\",\"\")","v":"-"},{"$f":"IF(LEN('export html'!BJ20),'export html'!BJ20,\"\")","v":"Lucyvo"},{"$f":"IF(LEN('export html'!BH20),'export html'!BH20,\"\")","v":"9-0"}]
[null,{"$f":"IF(LEN('export html'!BF21),'export html'!BF21,\"\")","v":21},{"$f":"IF(LEN('export html'!BE21),'export html'!BE21,\"\")","v":"2025-02-23"},{"$f":"IF(LEN('export html'!BI21),'export html'!BI21,\"\")","v":"Lucyvo"},{"$f":"IF(LEN('export html'!BI21),\"-\",\"\")","v":"-"},{"$f":"IF(LEN('export html'!BJ21),'export html'!BJ21,\"\")","v":"Sint Anneke"},{"$f":"IF(LEN('export html'!BH21),'export html'!BH21,\"\")","v":"5-2"}]
[null,{"$f":"IF(LEN('export html'!BF22),'export html'!BF22,\"\")","v":15},{"$f":"IF(LEN('export html'!BE22),'export html'!BE22,\"\")","v":"2025-03-02"},{"$f":"IF(LEN('export html'!BI22),'export html'!BI22,\"\")","v":"Lucyvo"},{"$f":"IF(LEN('export html'!BI22),\"-\",\"\")","v":"-"},{"$f":"IF(LEN('export html'!BJ22),'export html'!BJ22,\"\")","v":"Goka"},{"$f":"IF(LEN('export html'!BH22),'export html'!BH22,\"\")","v":"3-0"}]
[null,{"$f":"IF(LEN('export html'!BF23),'export html'!BF23,\"\")","v":22},{"$f":"IF(LEN('export html'!BE23),'export html'!BE23,\"\")","v":"2025-03-09"},{"$f":"IF(LEN('export html'!BI23),'export html'!BI23,\"\")","v":"Lucyvo"},{"$f":"IF(LEN('export html'!BI23),\"-\",\"\")","v":"-"},{"$f":"IF(LEN('export html'!BJ23),'export html'!BJ23,\"\")","v":"Jolika"},{"$f":"IF(LEN('export html'!BH23),'export html'!BH23,\"\")","v":"2-2"}]
[null,{"$f":"IF(LEN('export html'!BF24),'export html'!BF24,\"\")","v":23},{"$f":"IF(LEN('export html'!BE24),'export html'!BE24,\"\")","v":"2025-03-16"},{"$f":"IF(LEN('export html'!BI24),'export html'!BI24,\"\")","v":"Yerevan United"},{"$f":"IF(LEN('export html'!BI24),\"-\",\"\")","v":"-"},{"$f":"IF(LEN('export html'!BJ24),'export html'!BJ24,\"\")","v":"Lucyvo"},{"$f":"IF(LEN('export html'!BH24),'export html'!BH24,\"\")","v":"1-7"}]
[null,{"$f":"IF(LEN('export html'!BF25),'export html'!BF25,\"\")","v":24},{"$f":"IF(LEN('export html'!BE25),'export html'!BE25,\"\")","v":"2025-03-23"},{"$f":"IF(LEN('export html'!BI25),'export html'!BI25,\"\")","v":"Lucyvo"},{"$f":"IF(LEN('export html'!BI25),\"-\",\"\")","v":"-"},{"$f":"IF(LEN('export html'!BJ25),'export html'!BJ25,\"\")","v":"Bariton"},{"$f":"IF(LEN('export html'!BH25),'export html'!BH25,\"\")","v":"2-1"}]
[null,{"$f":"IF(LEN('export html'!BF26),'export html'!BF26,\"\")","v":25},{"$f":"IF(LEN('export html'!BE26),'export html'!BE26,\"\")","v":"2025-03-30"},{"$f":"IF(LEN('export html'!BI26),'export html'!BI26,\"\")","v":"Antwerp Global"},{"$f":"IF(LEN('export html'!BI26),\"-\",\"\")","v":"-"},{"$f":"IF(LEN('export html'!BJ26),'export html'!BJ26,\"\")","v":"Lucyvo"},{"$f":"IF(LEN('export html'!BH26),'export html'!BH26,\"\")","v":"4-0"}]
[null,{"$f":"IF(LEN('export html'!BF27),'export html'!BF27,\"\")","v":26},{"$f":"IF(LEN('export html'!BE27),'export html'!BE27,\"\")","v":"2025-04-06"},{"$f":"IF(LEN('export html'!BI27),'export html'!BI27,\"\")","v":"Lucyvo"},{"$f":"IF(LEN('export html'!BI27),\"-\",\"\")","v":"-"},{"$f":"IF(LEN('export html'!BJ27),'export html'!BJ27,\"\")","v":"Racing Emblem"},{"$f":"IF(LEN('export html'!BH27),'export html'!BH27,\"\")","v":""}]
[null,{"$f":"IF(LEN('export html'!BF28),'export html'!BF28,\"\")","v":18},{"$f":"IF(LEN('export html'!BE28),'export html'!BE28,\"\")","v":"2025-04-13"},{"$f":"IF(LEN('export html'!BI28),'export html'!BI28,\"\")","v":"Hombeek"},{"$f":"IF(LEN('export html'!BI28),\"-\",\"\")","v":"-"},{"$f":"IF(LEN('export html'!BJ28),'export html'!BJ28,\"\")","v":"Lucyvo"},{"$f":"IF(LEN('export html'!BH28),'export html'!BH28,\"\")","v":""}]
[null,{"$f":"IF(LEN('export html'!BF29),'export html'!BF29,\"\")","v":""},{"$f":"IF(LEN('export html'!BE29),'export html'!BE29,\"\")","v":""},{"$f":"IF(LEN('export html'!BI29),'export html'!BI29,\"\")","v":""},{"$f":"IF(LEN('export html'!BI29),\"-\",\"\")","v":""},{"$f":"IF(LEN('export html'!BJ29),'export html'!BJ29,\"\")","v":""},{"$f":"IF(LEN('export html'!BH29),'export html'!BH29,\"\")","v":""}]
[null,{"$f":"IF(LEN('export html'!BF30),'export html'!BF30,\"\")","v":""},{"$f":"IF(LEN('export html'!BE30),'export html'!BE30,\"\")","v":""},{"$f":"IF(LEN('export html'!BI30),'export html'!BI30,\"\")","v":""},{"$f":"IF(LEN('export html'!BI30),\"-\",\"\")","v":""},{"$f":"IF(LEN('export html'!BJ30),'export html'!BJ30,\"\")","v":""}]
[]
[]
[]
["Oefenmatchen",1,null,null,"-"]
[null,2,null,null,"-"]
[null,3,null,null,"-"]
[null,4,null,null,"-"]
[]
["Beker",1,null,null,"-"]

{"sheet":"export html","index":2,"n_rows":34,"n_cols":62,"rows_kept":34,"cut":false,"hidden":true,"merged":[]}
[{"$f":"MAX(1,COUNTA(A3:A20))","v":7},null,null,null,"hulp: thuis","hulp: uit","hulp: uitslag",null,{"$f":"MAX(1,COUNT(I3:I9))","v":7},null,null,null,"hulp: thuis","hulp: uit","hulp: uitslag",null,null,null,null,{"$f":"MAX(1,COUNT(T3:T20))","v":5},null,"Recentste duels op ","uitslag",null,null,{"$f":"ROWS(_xlfn.ANCHORARRAY( Z3) )","v":5},null,null,null,null,null,{"$f":"ROWS(_xlfn.ANCHORARRAY( AF3) )","v":5},null,"Hulp: # goals",null,{"$f":"MAX(1,COUNTA(AJ3:AJ20))","v":1},null,null,null,null,null,{"$f":"RANK(spelersstatistieken!AB5,INDIRECT(\"spelersstatistieken!$\" & $AR$8 & \"$5:$\" & $AR$8 & \"$\" & 5+$AR$6-1))+ROW()/10^4","v":10.0001},null,null,null,null,{"$f":"MAX(1,COUNTA(AU3:AU40))","v":3},null,null,null,null,null,null,null,null,null,{"$f":"MAX(1,COUNT(BE3:BE30))","v":26},null,null,null,"hulp: thuis","hulp: uit"]
["Datum","Speeldag",{"$f":"\"Matchen van \" & IF('rooster en stand'!$J$31=0,\"speeldag \" & 'rooster en stand'!$F$31,TEXT('rooster en stand'!$J$31,\"dd/mm/jjjj\"))","v":"Matchen van speeldag 25"},"Uitslag",null,null,null,null,"Datum","Speeldag",{"$f":"\"Matchen van \" & IF('rooster en stand'!$J$31=0,\"speeldag \" & 'rooster en stand'!$F$31+1,TEXT('rooster en stand'!$J$31+'rooster en stand'!$K$31,\"dd/mm/jjjj\"))","v":"Matchen van speeldag 26"},"Uitslag / Plaatsen",null,null,null,null,null,null,null,"Datum","Speeldag",{"$f":"V1 & TEXT('rooster en stand'!$F$21,\"dd/mm/yyyy\")","v":"Recentste duels op 02/04/2025"},null,null,null,"Top-5","Assists",null,null,null,null,"Top-5","Goals",null,null,"Ronde","Datum","Uur","Match","Uitslag",null,{"$f":"RANK(spelersstatistieken!AB6,INDIRECT(\"spelersstatistieken!$\" & $AR$8 & \"$5:$\" & $AR$8 & \"$\" & 5+$AR$6-1))+ROW()/10^4","v":10.0002},null,1,"berekening stand",null,"Jaar",{"$f":"\"Uit het verleden...\" & IF(COUNTA(#REF!)>0,\" (\" & AU1 & \"x)\",\"\")","v":"Uit het verleden... (3x)"},"Uitslag","Datum","Speeldag",null,null,null,null,null,"Datum","Speeldag","Kalender","Uitslag"]
["2025-03-29",25,"SC Duffel - Jolika",{"$f":"IF(G3=0,\"\",G3)","v":"10-0"},"SC Duffel","Jolika","10-0",null,"2025-04-06",26,"Hombeek - SC Duffel",{"$f":"IF( O3 <> \"\", O3, \"plaats \" & MATCH( M3, 'rooster en stand'!$D$5:$D$18, 0 ) & \" - plaats \" & MATCH( N3, 'rooster en stand'!$D$5:$D$18, 0 ) )","v":"plaats 9 - plaats 8"},"Hombeek","SC Duffel",null,null,null,null,null,"2025-03-30",25,"Antwerp Global - Lucyvo","4-0",null,{"$f":"_xlfn.SEQUENCE(Z1)","v":1},{"$f":"_xlfn.ANCHORARRAY(spelersstatistieken!AK150)","v":"Stijn Hofmans"},11,null,null,null,{"$f":"_xlfn.SEQUENCE(AF1)","v":1},{"$f":"_xlfn.ANCHORARRAY(spelersstatistieken!AK100)","v":"Glenn De Vinster"},29,null,null,"Ronde 1",null,null,null,null,null,{"$f":"RANK(spelersstatistieken!AB7,INDIRECT(\"spelersstatistieken!$\" & $AR$8 & \"$5:$\" & $AR$8 & \"$\" & 5+$AR$6-1))+ROW()/10^4","v":10.000299999999999},null,"00:00:00","VO kleurtje speeldag",null,"2024-2025","Racing Emblem - Lucyvo","8-2",null,null,null,null,null,null,null,"2024-09-01",1,"Lucyvo - Bar Patron","2-4","Lucyvo","Bar Patron"]
["2025-03-30",25,"Antwerp Global - Lucyvo","4-0","Antwerp Global","Lucyvo","4-0",null,"2025-04-06",26,"Jolika - Bariton",{"$f":"IF( O4 <> \"\", O4, \"plaats \" & MATCH( M4, 'rooster en stand'!$D$5:$D$18, 0 ) & \" - plaats \" & MATCH( N4, 'rooster en stand'!$D$5:$D$18, 0 ) )","v":"plaats 14 - plaats 12"},"Jolika","Bariton",null,null,null,null,null,"2025-03-23",24,"Lucyvo - Bariton","2-1",null,2,"Glenn De Vinster",10,null,null,null,2,"Stijn Hofmans",18,null,null,null,null,null,null,null,null,{"$f":"RANK(spelersstatistieken!AB8,INDIRECT(\"spelersstatistieken!$\" & $AR$8 & \"$5:$\" & $AR$8 & \"$\" & 5+$AR$6-1))+ROW()/10^4","v":10.000400000000001},null,{"$f":"COUNTA( 'rooster en stand'!BI5:BI18 )","v":14},"aantal ploegen",null,"2023-2024","Lucyvo - Racing Emblem","3-5",null,null,null,null,null,null,null,"2024-09-08",2,"Goka - Lucyvo","3-0","Goka","Lucyvo"]
["2025-03-30",25,"Bar Patron - Corum","4-1","Bar Patron","Corum","4-1",null,"2025-04-06",26,"Lucyvo - Racing Emblem",{"$f":"IF( O5 <> \"\", O5, \"plaats \" & MATCH( M5, 'rooster en stand'!$D$5:$D$18, 0 ) & \" - plaats \" & MATCH( N5, 'rooster en stand'!$D$5:$D$18, 0 ) )","v":"plaats 10 - plaats 6"},"Lucyvo","Racing Emblem",null,null,null,null,null,"2025-03-16",23,"Yerevan United - Lucyvo","1-7",null,3,"Steven De Groof",5,null,null,null,3,"Jorn Verhellen",3,null,null,null,null,null,null,null,null,{"$f":"RANK(spelersstatistieken!AB9,INDIRECT(\"spelersstatistieken!$\" & $AR$8 & \"$5:$\" & $AR$8 & \"$\" & 5+$AR$6-1))+ROW()/10^4","v":4.0004999999999997},null,{"$f":"2 * ( AR4 - 1 )","v":26},"aantal matchen / ploeg",null,"2023-2024","Racing Emblem - Lucyvo","3-3",null,null,null,null,null,null,null,"2024-09-15",3,"Lucyvo - Alberta Schilde","1-5","Lucyvo","Alberta Schilde"]
["2025-03-30",25,"Bariton - Yerevan United","1-4","Bariton","Yerevan United","1-4",null,"2025-04-06",26,"Corum - Goka",{"$f":"IF( O6 <> \"\", O6, \"plaats \" & MATCH( M6, 'rooster en stand'!$D$5:$D$18, 0 ) & \" - plaats \" & MATCH( N6, 'rooster en stand'!$D$5:$D$18, 0 ) )","v":"plaats 11 - plaats 13"},"Corum","Goka",null,null,null,null,null,"2025-03-09",22,"Lucyvo - Jolika","2-2",null,4,"Stijn Verdickt",3,null,null,null,4,"Wout Beirinckx",1,null,null,null,null,null,null,null,null,{"$f":"RANK(spelersstatistieken!AB10,INDIRECT(\"spelersstatistieken!$\" & $AR$8 & \"$5:$\" & $AR$8 & \"$\" & 5+$AR$6-1))+ROW()/10^4","v":10.0006},null,34,"aantal spelers",null,null,null,null,null,null,null,null,null,null,null,"2024-09-21",4,"SC Duffel - Lucyvo","3-1","SC Duffel","Lucyvo"]
["2025-03-30",25,"Goka - Daltons","0-2","Goka","Daltons","0-2",null,"2025-04-06",26,"Daltons - Alberta Schilde",{"$f":"IF( O7 <> \"\", O7, \"plaats \" & MATCH( M7, 'rooster en stand'!$D$5:$D$18, 0 ) & \" - plaats \" & MATCH( N7, 'rooster en stand'!$D$5:$D$18, 0 ) )","v":"plaats 1 - plaats 3"},"Daltons","Alberta Schilde",null,null,null,null,null,"2025-03-02",15,"Lucyvo - Goka","3-0",null,5,"Wout Beirinckx",2,null,null,null,5,"Maarten De Groof",1,null,null,null,null,null,null,null,null,{"$f":"RANK(spelersstatistieken!AB11,INDIRECT(\"spelersstatistieken!$\" & $AR$8 & \"$5:$\" & $AR$8 & \"$\" & 5+$AR$6-1))+ROW()/10^4","v":10.0007},null,{"$f":"MatchenPerPloeg / 2 + ( ISODD( AR4 ))","v":13},"speeldagen in heenronde",null,null,null,null,null,null,null,null,null,null,null,"2024-09-29",5,"Lucyvo - Hombeek","5-1","Lucyvo","Hombeek"]
["2025-03-30",25,"Racing Emblem - Sint Anneke",{"$f":"IF(G8=0,\"\",G8)","v":"1-1"},"Racing Emblem","Sint Anneke","1-1",null,"2025-04-06",26,"Sint Anneke - Bar Patron",{"$f":"IF( O8 <> \"\", O8, \"plaats \" & MATCH( M8, 'rooster en stand'!$D$5:$D$18, 0 ) & \" - plaats \" & MATCH( N8, 'rooster en stand'!$D$5:$D$18, 0 ) )","v":"plaats 7 - plaats 5"},"Sint Anneke","Bar Patron",null,null,null,null,null,null,null,null,null,null,null,null,null,null,null,null,null,null,null,null,null,null,null,null,null,null,null,{"$f":"RANK(spelersstatistieken!AB12,INDIRECT(\"spelersstatistieken!$\" & $AR$8 & \"$5:$\" & $AR$8 & \"$\" & 5+$AR$6-1))+ROW()/10^4","v":10.0008},null,{"$f":"SUBSTITUTE( SUBSTITUTE( ADDRESS( 1, 1 + MatchenPerPloeg + 1 ), 1, \"\" ), \"$\", \"\" )","v":"AB"},"Kolom van de goal totalen",null,null,null,null,null,null,null,null,null,null,null,"2024-10-06",6,"Daltons - Lucyvo","3-0","Daltons","Lucyvo"]
["2025-03-30",25,"Alberta Schilde - Hombeek","9-2","Alberta Schilde","Hombeek","9-2",null,"2025-04-06",26,"Yerevan United - Antwerp Global",{"$f":"IF( O9 <> \"\", O9, \"plaats \" & MATCH( M9, 'rooster en stand'!$D$5:$D$18, 0 ) & \" - plaats \" & MATCH( N9, 'rooster en stand'!$D$5:$D$18, 0 ) )","v":"plaats 2 - plaats 4"},"Yerevan United","Antwerp Global",null,null,null,null,null,null,null,null,null,null,null,null,null,null,null,null,null,null,null,null,null,null,null,null,null,null,null,{"$f":"RANK(spelersstatistieken!AB13,INDIRECT(\"spelersstatistieken!$\" & $AR$8 & \"$5:$\" & $AR$8 & \"$\" & 5+$AR$6-1))+ROW()/10^4","v":10.0009},null,null,null,null,null,null,null,null,null,null,null,null,null,null,"2024-10-13",7,"Lucyvo - Corum","5-5","Lucyvo","Corum"]
[null,null,null,null,null,null,null,null,null,null,null,null,null,null,null,null,null,null,null,null,null,null,null,null,null,null,null,null,null,null,null,null,null,null,null,null,null,null,null,null,null,{"$f":"RANK(spelersstatistieken!AB14,INDIRECT(\"spelersstatistieken!$\" & $AR$8 & \"$5:$\" & $AR$8 & \"$\" & 5+$AR$6-1))+ROW()/10^4","v":10.000999999999999},null,null,null,null,null,null,null,null,null,null,null,null,null,null,"2024-10-20",8,"Sint Anneke - Lucyvo","4-0","Sint Anneke","Lucyvo"]
[null,null,null,null,null,null,null,null,null,null,null,null,null,null,null,null,null,null,null,null,null,null,null,null,null,null,null,null,null,null,null,null,null,null,null,null,null,null,null,null,null,{"$f":"RANK(spelersstatistieken!AB15,INDIRECT(\"spelersstatistieken!$\" & $AR$8 & \"$5:$\" & $AR$8 & \"$\" & 5+$AR$6-1))+ROW()/10^4","v":4.0011000000000001},null,null,null,null,null,null,null,null,null,null,null,null,null,null,"2024-11-03",9,"Jolika - Lucyvo","1-1","Jolika","Lucyvo"]
[null,null,null,null,null,null,null,null,null,null,null,null,null,null,null,null,null,null,null,null,null,null,null,null,null,null,null,null,null,null,null,null,null,null,null,null,null,null,null,null,null,{"$f":"RANK(spelersstatistieken!AB16,INDIRECT(\"spelersstatistieken!$\" & $AR$8 & \"$5:$\" & $AR$8 & \"$\" & 5+$AR$6-1))+ROW()/10^4","v":4.0011999999999999},null,null,null,null,null,null,null,null,null,null,null,null,null,null,"2024-11-10",10,"Lucyvo - Yerevan United","6-2","Lucyvo","Yerevan United"]
[null,null,null,null,null,null,null,null,null,null,null,null,null,null,null,null,null,null,null,null,null,null,null,null,null,null,null,null,null,null,null,null,null,null,null,null,null,null,null,null,null,{"$f":"RANK(spelersstatistieken!AB17,INDIRECT(\"spelersstatistieken!$\" & $AR$8 & \"$5:$\" & $AR$8 & \"$\" & 5+$AR$6-1))+ROW()/10^4","v":10.001300000000001},null,null,null,null,null,null,null,null,null,null,null,null,null,null,"2024-11-17",11,"Bariton - Lucyvo","1-1","Bariton","Lucyvo"]
[null,null,null,null,null,null,null,null,null,null,null,null,null,null,null,null,null,null,null,null,null,null,null,null,null,null,null,null,null,null,null,null,null,null,null,null,null,null,null,null,null,{"$f":"RANK(spelersstatistieken!AB18,INDIRECT(\"spelersstatistieken!$\" & $AR$8 & \"$5:$\" & $AR$8 & \"$\" & 5+$AR$6-1))+ROW()/10^4","v":1.0014000000000001},null,null,null,null,null,null,null,null,null,null,null,null,null,null,"2024-11-24",12,"Lucyvo - Antwerp Global","1-7","Lucyvo","Antwerp Global"]
[null,null,null,null,null,null,null,null,null,null,null,null,null,null,null,null,null,null,null,null,null,null,null,null,null,null,null,null,null,null,null,null,null,null,null,null,null,null,null,null,null,{"$f":"RANK(spelersstatistieken!AB19,INDIRECT(\"spelersstatistieken!$\" & $AR$8 & \"$5:$\" & $AR$8 & \"$\" & 5+$AR$6-1))+ROW()/10^4","v":10.0015},null,null,null,null,null,null,null,null,null,null,null,null,null,null,"2024-12-01",13,"Racing Emblem - Lucyvo","8-2","Racing Emblem","Lucyvo"]
[null,null,null,null,null,null,null,null,null,null,null,null,null,null,null,null,null,null,null,null,null,null,null,null,null,null,null,null,null,null,null,null,null,null,null,null,null,null,null,null,null,{"$f":"RANK(spelersstatistieken!AB20,INDIRECT(\"spelersstatistieken!$\" & $AR$8 & \"$5:$\" & $AR$8 & \"$\" & 5+$AR$6-1))+ROW()/10^4","v":10.0016},null,null,null,null,null,null,null,null,null,null,null,null,null,null,"2024-12-08",14,"Bar Patron - Lucyvo","3-3","Bar Patron","Lucyvo"]
[null,null,null,null,null,null,null,null,null,null,null,null,null,null,null,null,null,null,null,null,null,null,null,null,null,null,null,null,null,null,null,null,null,null,null,null,null,null,null,null,null,{"$f":"RANK(spelersstatistieken!AB21,INDIRECT(\"spelersstatistieken!$\" & $AR$8 & \"$5:$\" & $AR$8 & \"$\" & 5+$AR$6-1))+ROW()/10^4","v":10.0017},null,"=IF( O4 <> \"\"; O4; \"Pl. 4 - pl. 5\" )",null,null,null,null,null,null,null,null,null,null,null,null,"2024-12-22",17,"Lucyvo - SC Duffel","4-8","Lucyvo","SC Duffel"]
[null,null,null,null,null,null,null,null,null,null,null,null,null,null,null,null,null,null,null,null,null,null,null,null,null,null,null,null,null,null,null,null,null,null,null,null,null,null,null,null,null,{"$f":"RANK(spelersstatistieken!AB22,INDIRECT(\"spelersstatistieken!$\" & $AR$8 & \"$5:$\" & $AR$8 & \"$\" & 5+$AR$6-1))+ROW()/10^4","v":10.001799999999999},null,null,null,null,null,null,null,null,null,null,null,null,null,null,"2025-01-19",16,"Alberta Schilde - Lucyvo","4-5","Alberta Schilde","Lucyvo"]
[null,null,null,null,null,null,null,null,null,null,null,null,null,null,null,null,null,null,null,null,null,null,null,null,null,null,null,null,null,null,null,null,null,null,null,null,null,null,null,null,null,{"$f":"RANK(spelersstatistieken!AB23,INDIRECT(\"spelersstatistieken!$\" & $AR$8 & \"$5:$\" & $AR$8 & \"$\" & 5+$AR$6-1))+ROW()/10^4","v":2.0019},null,null,null,null,null,null,null,null,null,null,null,null,null,null,"2025-02-09",19,"Lucyvo - Daltons","0-5*","Lucyvo","Daltons"]
[null,null,null,null,null,null,null,null,null,null,null,null,null,null,null,null,null,null,null,null,null,null,null,null,null,null,null,null,null,null,null,null,null,null,null,null,null,null,null,null,null,{"$f":"RANK(spelersstatistieken!AB24,INDIRECT(\"spelersstatistieken!$\" & $AR$8 & \"$5:$\" & $AR$8 & \"$\" & 5+$AR$6-1))+ROW()/10^4","v":10.002000000000001},null,null,null,null,null,null,null,null,null,null,null,null,null,null,"2025-02-16",20,"Corum - Lucyvo","9-0","Corum","Lucyvo"]
[null,null,null,null,null,null,null,null,null,null,null,null,null,null,null,null,null,null,null,null,null,null,null,null,null,null,null,null,null,null,null,null,null,null,null,null,null,null,null,null,null,{"$f":"RANK(spelersstatistieken!AB25,INDIRECT(\"spelersstatistieken!$\" & $AR$8 & \"$5:$\" & $AR$8 & \"$\" & 5+$AR$6-1))+ROW()/10^4","v":10.0021},null,null,null,null,null,null,null,null,null,null,null,null,null,null,"2025-02-23",21,"Lucyvo - Sint Anneke","5-2","Lucyvo","Sint Anneke"]
[null,null,null,null,null,null,null,null,null,null,null,null,null,null,null,null,null,null,null,null,null,null,null,null,null,null,null,null,null,null,null,null,null,null,null,null,null,null,null,null,null,{"$f":"RANK(spelersstatistieken!AB26,INDIRECT(\"spelersstatistieken!$\" & $AR$8 & \"$5:$\" & $AR$8 & \"$\" & 5+$AR$6-1))+ROW()/10^4","v":10.0022},null,null,null,null,null,null,null,null,null,null,null,null,null,null,"2025-03-02",15,"Lucyvo - Goka","3-0","Lucyvo","Goka"]
[null,null,null,null,null,null,null,null,null,null,null,null,null,null,null,null,null,null,null,null,null,null,null,null,null,null,null,null,null,null,null,"#IF(OR($AE3#0;$AG3#\"\");\"(Niemand)\";OFFSET(spelersstatistieken!$A$4;MATCH(SMALL(coeffsspelers;AE3);coeffsspelers;0);0))","#IF($AE3#0;\"\";IF(AH3#0;\"\";AH3))","#OFFSET(spelersstatistieken!$A$4;MATCH(SMALL(coeffsspelers;AE3);coeffsspelers;0);MatchenPerPloeg+1)",null,null,null,null,null,null,null,{"$f":"RANK(spelersstatistieken!AB27,INDIRECT(\"spelersstatistieken!$\" & $AR$8 & \"$5:$\" & $AR$8 & \"$\" & 5+$AR$6-1))+ROW()/10^4","v":10.0023},null,null,null,null,null,null,null,null,null,null,null,null,null,null,"2025-03-09",22,"Lucyvo - Jolika","2-2","Lucyvo","Jolika"]
[null,null,null,null,null,null,null,null,null,null,null,null,null,null,null,null,null,null,null,null,null,null,null,null,null,null,null,null,null,null,null,"#IF(OR($AE4#0;$AG4#\"\");\"\";OFFSET(spelersstatistieken!$A$4;MATCH(SMALL(coeffsspelers;AE4);coeffsspelers;0);0))","#IF($AE4#0;\"\";IF(AH4#0;\"\";AH4))","#OFFSET(spelersstatistieken!$A$4;MATCH(SMALL(coeffsspelers;AE4);coeffsspelers;0);MatchenPerPloeg+1)",null,null,null,null,null,null,null,{"$f":"RANK(spelersstatistieken!AB28,INDIRECT(\"spelersstatistieken!$\" & $AR$8 & \"$5:$\" & $AR$8 & \"$\" & 5+$AR$6-1))+ROW()/10^4","v":10.0024},null,null,null,null,null,null,null,null,null,null,null,null,null,null,"2025-03-16",23,"Yerevan United - Lucyvo","1-7","Yerevan United","Lucyvo"]
[null,null,null,null,null,null,null,null,null,null,null,null,null,null,null,null,null,null,null,null,null,null,null,null,null,null,null,null,null,null,null,"#IF(OR($AE5#0;$AG5#\"\");\"\";OFFSET(spelersstatistieken!$A$4;MATCH(SMALL(coeffsspelers;AE5);coeffsspelers;0);0))","#IF($AE5#0;\"\";IF(AH5#0;\"\";AH5))","#OFFSET(spelersstatistieken!$A$4;MATCH(SMALL(coeffsspelers;AE5);coeffsspelers;0);MatchenPerPloeg+1)",null,null,null,null,null,null,null,{"$f":"RANK(spelersstatistieken!AB29,INDIRECT(\"spelersstatistieken!$\" & $AR$8 & \"$5:$\" & $AR$8 & \"$\" & 5+$AR$6-1))+ROW()/10^4","v":10.0025},null,null,null,null,null,null,null,null,null,null,null,null,null,null,"2025-03-23",24,"Lucyvo - Bariton","2-1","Lucyvo","Bariton"]
[null,null,null,null,null,null,null,null,null,null,null,null,null,null,null,null,null,null,null,null,null,null,null,null,null,null,null,null,null,null,null,"#IF(OR($AE6#0;$AG6#\"\");\"\";OFFSET(spelersstatistieken!$A$4;MATCH(SMALL(coeffsspelers;AE6);coeffsspelers;0);0))","#IF($AE6#0;\"\";IF(AH6#0;\"\";AH6))","#OFFSET(spelersstatistieken!$A$4;MATCH(SMALL(coeffsspelers;AE6);coeffsspelers;0);MatchenPerPloeg+1)",null,null,null,null,null,null,null,{"$f":"RANK(spelersstatistieken!AB30,INDIRECT(\"spelersstatistieken!$\" & $AR$8 & \"$5:$\" & $AR$8 & \"$\" & 5+$AR$6-1))+ROW()/10^4","v":10.002599999999999},null,null,null,null,null,null,null,null,null,null,null,null,null,null,"2025-03-30",25,"Antwerp Global - Lucyvo","4-0","Antwerp Global","Lucyvo"]
[null,null,null,null,null,null,null,null,null,null,null,null,null,null,null,null,null,null,null,null,null,null,null,null,null,null,null,null,null,null,null,"#IF(OR($AE7#0;$AG7#\"\");\"\";OFFSET(spelersstatistieken!$A$4;MATCH(SMALL(coeffsspelers;AE7);coeffsspelers;0);0))","#IF($AE7#0;\"\";IF(AH7#0;\"\";AH7))","#OFFSET(spelersstatistieken!$A$4;MATCH(SMALL(coeffsspelers;AE7);coeffsspelers;0);MatchenPerPloeg+1)",null,null,null,null,null,null,null,{"$f":"RANK(spelersstatistieken!AB31,INDIRECT(\"spelersstatistieken!$\" & $AR$8 & \"$5:$\" & $AR$8 & \"$\" & 5+$AR$6-1))+ROW()/10^4","v":10.002700000000001},null,null,null,null,null,null,null,null,null,null,null,null,null,null,"2025-04-06",26,"Lucyvo - Racing Emblem",null,"Lucyvo","Racing Emblem"]
[null,null,null,null,null,null,null,null,null,null,null,null,null,null,null,null,null,null,null,null,null,null,null,null,null,null,null,null,null,null,null,null,null,null,null,null,null,null,null,null,null,{"$f":"RANK(spelersstatistieken!AB32,INDIRECT(\"spelersstatistieken!$\" & $AR$8 & \"$5:$\" & $AR$8 & \"$\" & 5+$AR$6-1))+ROW()/10^4","v":10.002800000000001},null,null,null,null,null,null,null,null,null,null,null,null,null,null,"2025-04-13",18,"Hombeek - Lucyvo",null,"Hombeek","Lucyvo"]
[null,null,null,null,null,null,null,null,null,null,null,null,null,null,null,null,null,null,null,null,null,null,null,null,null,null,null,null,null,null,null,null,null,null,null,null,null,null,null,null,null,{"$f":"RANK(spelersstatistieken!AB33,INDIRECT(\"spelersstatistieken!$\" & $AR$8 & \"$5:$\" & $AR$8 & \"$\" & 5+$AR$6-1))+ROW()/10^4","v":10.0029}]
[null,null,null,null,null,null,null,null,null,null,null,null,null,null,null,null,null,null,null,null,null,null,null,null,null,null,null,null,null,null,null,null,null,null,null,null,null,null,null,null,null,{"$f":"RANK(spelersstatistieken!AB34,INDIRECT(\"spelersstatistieken!$\" & $AR$8 & \"$5:$\" & $AR$8 & \"$\" & 5+$AR$6-1))+ROW()/10^4","v":10.003}]
[null,null,null,null,null,null,null,null,null,null,null,null,null,null,null,null,null,null,null,null,null,null,null,null,null,null,null,null,null,null,null,null,null,null,null,null,null,null,null,null,null,{"$f":"RANK(spelersstatistieken!AB35,INDIRECT(\"spelersstatistieken!$\" & $AR$8 & \"$5:$\" & $AR$8 & \"$\" & 5+$AR$6-1))+ROW()/10^4","v":3.0030999999999999}]
[null,null,null,null,null,null,null,null,null,null,null,null,null,null,null,null,null,null,null,null,null,null,null,null,null,null,null,null,null,null,null,null,null,null,null,null,null,null,null,null,null,{"$f":"RANK(spelersstatistieken!AB36,INDIRECT(\"spelersstatistieken!$\" & $AR$8 & \"$5:$\" & $AR$8 & \"$\" & 5+$AR$6-1))+ROW()/10^4","v":4.0031999999999996}]
[null,null,null,null,null,null,null,null,null,null,null,null,null,null,null,null,null,null,null,null,null,null,null,null,null,null,null,null,null,null,null,null,null,null,null,null,null,null,null,null,null,{"$f":"RANK(spelersstatistieken!AB37,INDIRECT(\"spelersstatistieken!$\" & $AR$8 & \"$5:$\" & $AR$8 & \"$\" & 5+$AR$6-1))+ROW()/10^4","v":4.0033000000000003}]
[null,null,null,null,null,null,null,null,null,null,null,null,null,null,null,null,null,null,null,null,null,null,null,null,null,null,null,null,null,null,null,null,null,null,null,null,null,null,null,null,null,{"$f":"RANK(spelersstatistieken!AB38,INDIRECT(\"spelersstatistieken!$\" & $AR$8 & \"$5:$\" & $AR$8 & \"$\" & 5+$AR$6-1))+ROW()/10^4","v":4.0034000000000001}]

{"sheet":"spelersstatistieken","index":3,"n_rows":386,"n_cols":131,"rows_kept":386,"cut":false,"hidden":false,"merged":[[0,34,3,34],[0,33,3,33],[0,27,3,27],[0,28,3,28],[0,29,3,29],[0,30,3,30],[0,31,3,31],[0,32,3,32]]}
[null,{"$f":"IF(kalender!$D3='rooster en stand'!$C$3,kalender!$F3&\" (T)\",kalender!$D3&\" (U)\")","v":"Bar Patron (T)"},{"$f":"IF(kalender!$D4='rooster en stand'!$C$3,kalender!$F4&\" (T)\",kalender!$D4&\" (U)\")","v":"Goka (U)"},{"$f":"IF(kalender!$D5='rooster en stand'!$C$3,kalender!$F5&\" (T)\",kalender!$D5&\" (U)\")","v":"Alberta Schilde (T)"},{"$f":"IF(kalender!$D6='rooster en stand'!$C$3,kalender!$F6&\" (T)\",kalender!$D6&\" (U)\")","v":"SC Duffel (U)"},{"$f":"IF(kalender!$D7='rooster en stand'!$C$3,kalender!$F7&\" (T)\",kalender!$D7&\" (U)\")","v":"Hombeek (T)"},{"$f":"IF(kalender!$D8='rooster en stand'!$C$3,kalender!$F8&\" (T)\",kalender!$D8&\" (U)\")","v":"Daltons (U)"},{"$f":"IF(kalender!$D9='rooster en stand'!$C$3,kalender!$F9&\" (T)\",kalender!$D9&\" (U)\")","v":"Corum (T)"},{"$f":"IF(kalender!$D10='rooster en stand'!$C$3,kalender!$F10&\" (T)\",kalender!$D10&\" (U)\")","v":"Sint Anneke (U)"},{"$f":"IF(kalender!$D11='rooster en stand'!$C$3,kalender!$F11&\" (T)\",kalender!$D11&\" (U)\")","v":"Jolika (U)"},{"$f":"IF(kalender!$D12='rooster en stand'!$C$3,kalender!$F12&\" (T)\",kalender!$D12&\" (U)\")","v":"Yerevan United (T)"},{"$f":"IF(kalender!$D13='rooster en stand'!$C$3,kalender!$F13&\" (T)\",kalender!$D13&\" (U)\")","v":"Bariton (U)"},{"$f":"IF(kalender!$D14='rooster en stand'!$C$3,kalender!$F14&\" (T)\",kalender!$D14&\" (U)\")","v":"Antwerp Global (T)"},{"$f":"IF(kalender!$D15='rooster en stand'!$C$3,kalender!$F15&\" (T)\",kalender!$D15&\" (U)\")","v":"Racing Emblem (U)"},{"$f":"IF(kalender!$D16='rooster en stand'!$C$3,kalender!$F16&\" (T)\",kalender!$D16&\" (U)\")","v":"Bar Patron (U)"},{"$f":"IF(kalender!$D17='rooster en stand'!$C$3,kalender!$F17&\" (T)\",kalender!$D17&\" (U)\")","v":"SC Duffel (T)"},{"$f":"IF(kalender!$D18='rooster en stand'!$C$3,kalender!$F18&\" (T)\",kalender!$D18&\" (U)\")","v":"Alberta Schilde (U)"},{"$f":"IF(kalender!$D19='rooster en stand'!$C$3,kalender!$F19&\" (T)\",kalender!$D19&\" (U)\")","v":"Daltons (T)"},{"$f":"IF(kalender!$D20='rooster en stand'!$C$3,kalender!$F20&\" (T)\",kalender!$D20&\" (U)\")","v":"Corum (U)"},{"$f":"IF(kalender!$D21='rooster en stand'!$C$3,kalender!$F21&\" (T)\",kalender!$D21&\" (U)\")","v":"Sint Anneke (T)"},{"$f":"IF(kalender!$D22='rooster en stand'!$C$3,kalender!$F22&\" (T)\",kalender!$D22&\" (U)\")","v":"Goka (T)"},{"$f":"IF(kalender!$D23='rooster en stand'!$C$3,kalender!$F23&\" (T)\",kalender!$D23&\" (U)\")","v":"Jolika (T)"},{"$f":"IF(kalender!$D24='rooster en stand'!$C$3,kalender!$F24&\" (T)\",kalender!$D24&\" (U)\")","v":"Yerevan United (U)"},{"$f":"IF(kalender!$D25='rooster en stand'!$C$3,kalender!$F25&\" (T)\",kalender!$D25&\" (U)\")","v":"Bariton (T)"},{"$f":"IF(kalender!$D26='rooster en stand'!$C$3,kalender!$F26&\" (T)\",kalender!$D26&\" (U)\")","v":"Antwerp Global (U)"},{"$f":"IF(kalender!$D27='rooster en stand'!$C$3,kalender!$F27&\" (T)\",kalender!$D27&\" (U)\")","v":"Racing Emblem (T)"},{"$f":"IF(kalender!$D28='rooster en stand'!$C$3,kalender!$F28&\" (T)\",kalender!$D28&\" (U)\")","v":"Hombeek (U)"},"Totaal # goals","# matchen","Gem. # goals","Afwezig","Blessure","Schorsing","Niet gespeeld totaal","Keeper",null,null,null,{"$f":"IFERROR( _xlfn.XMATCH( AN2, B4:AA4, 0 ), 0 )","v":22},{"$f":"\"Hint: \" & _xlfn.XLOOKUP(TRUE, B4:AA4 <> \"\", B4:AA4,,,-1)","v":"Hint: 25"},null,{"$f":"B1","v":"Bar Patron (T)"},"Goka (U)","Alberta Schilde (T)","SC Duffel (U)","Hombeek (T)","Daltons (U)","Corum (T)","Sint Anneke (U)",{"$f":"J1","v":"Jolika (U)"},"Yerevan United (T)","Bariton (U)","Antwerp Global (T)",{"$f":"N1","v":"Racing Emblem (U)"},"Bar Patron (U)","SC Duffel (T)","Alberta Schilde (U)","Daltons (T)","Corum (U)","Sint Anneke (T)","Goka (T)","Jolika (T)","Yerevan United (U)","Bariton (T)","Antwerp Global (U)","Racing Emblem (T)","Hombeek (U)"]
["Uitslag",{"$f":"TRANSPOSE( kalender!G3:G28 )","v":"2-4"},"3-0","1-5","3-1","5-1","3-0","5-5","4-0","1-1","6-2","1-1","1-7","8-2","3-3","4-8","4-5","0-5*","9-0","5-2","3-0","2-2","1-7","2-1","4-0","","",null,null,null,null,null,null,null,null,null,null,null,null,23,null,null,null,null,null,null,null,null,null,null,null,null,null,null,null,null,null,null,null,null,null,null,null,null,null,null,null,null,"P","coeff","coeff aflopend",null,"P","coeff","coeff aflopend",null,"aantal","coeff","coeff aflopend",null,null,null,null,null,{"$f":"MAX( CG5:CG39 )","v":17.142857142857142},{"$f":"MAX( 1, CE5:CE37, CL5:CL37 )","v":29},null,null,null,null,null,{"$f":"MAX( CN5:CN39 )","v":243.6371292106586},null,null,null,null,null,null,null,null,null,null,{"$f":"MAX( 1, CX5:CX37, DC5:DC37 )","v":19},null,null,null,null,null,null,null,null,null,{"$f":"MAX( DI5:DI39 )","v":29.000050000000002},null,null,null,null,null,null,null,null,null,null,null,null,null,null,null,{"$f":"_xlfn.TAKE( _xlfn.SCAN( \"\", _xlfn._xlws.SORT( _xlfn.UNIQUE( _xlfn.TOCOL(_xlfn.ANCHORARRAY( DN5), 2 ))), _xlfn.LAMBDA(_xlpm.a,_xlpm.v, IF( COUNTIF( $CY$5:$CY$40, _xlpm.v ) > 0, _xlpm.a, _xlpm.a & \" / \" & _xlpm.v ))), -1 )","v":" / Beirinckx Wout / Celis Ive / Coolsaet Joy / De Groof Maarten / De Groof Steven / De Vinster Glenn / Delen Robbe / Elst Pieter / Gielis Bernd / Hofmans Stijn / Jordens Koen / Langenaeker Maarten / Nyckees Wannes / Stevens Siebe / Van de Vondel Rob / Van Den Brande Brent / Van Dessel Dieter / Verhellen Jorn / Verlooy Kaïn"}]
["Aanwezigen",{"$f":"IF(COUNTBLANK(B5:B37)='export html'!$AR$6,\"\",'export html'!$AR$6-COUNTIF(B5:B37,\"a\")-COUNTIF(B5:B37,\"b\")-COUNTIF(B5:B37,\"s\"))","v":21},{"$f":"IF(COUNTBLANK(C5:C37)='export html'!$AR$6,\"\",'export html'!$AR$6-COUNTIF(C5:C37,\"a\")-COUNTIF(C5:C37,\"b\")-COUNTIF(C5:C37,\"s\"))","v":18},{"$f":"IF(COUNTBLANK(D5:D37)='export html'!$AR$6,\"\",'export html'!$AR$6-COUNTIF(D5:D37,\"a\")-COUNTIF(D5:D37,\"b\")-COUNTIF(D5:D37,\"s\"))","v":23},{"$f":"IF(COUNTBLANK(E5:E37)='export html'!$AR$6,\"\",'export html'!$AR$6-COUNTIF(E5:E37,\"a\")-COUNTIF(E5:E37,\"b\")-COUNTIF(E5:E37,\"s\"))","v":18},{"$f":"IF(COUNTBLANK(F5:F37)='export html'!$AR$6,\"\",'export html'!$AR$6-COUNTIF(F5:F37,\"a\")-COUNTIF(F5:F37,\"b\")-COUNTIF(F5:F37,\"s\"))","v":19},{"$f":"IF(COUNTBLANK(G5:G37)='export html'!$AR$6,\"\",'export html'!$AR$6-COUNTIF(G5:G37,\"a\")-COUNTIF(G5:G37,\"b\")-COUNTIF(G5:G37,\"s\"))","v":16},{"$f":"IF(COUNTBLANK(H5:H37)='export html'!$AR$6,\"\",'export html'!$AR$6-COUNTIF(H5:H37,\"a\")-COUNTIF(H5:H37,\"b\")-COUNTIF(H5:H37,\"s\"))","v":18},{"$f":"IF(COUNTBLANK(I5:I37)='export html'!$AR$6,\"\",'export html'!$AR$6-COUNTIF(I5:I37,\"a\")-COUNTIF(I5:I37,\"b\")-COUNTIF(I5:I37,\"s\"))","v":15},{"$f":"IF(COUNTBLANK(J5:J37)='export html'!$AR$6,\"\",'export html'!$AR$6-COUNTIF(J5:J37,\"a\")-COUNTIF(J5:J37,\"b\")-COUNTIF(J5:J37,\"s\"))","v":18},{"$f":"IF(COUNTBLANK(K5:K37)='export html'!$AR$6,\"\",'export html'!$AR$6-COUNTIF(K5:K37,\"a\")-COUNTIF(K5:K37,\"b\")-COUNTIF(K5:K37,\"s\"))","v":18},{"$f":"IF(COUNTBLANK(L5:L37)='export html'!$AR$6,\"\",'export html'!$AR$6-COUNTIF(L5:L37,\"a\")-COUNTIF(L5:L37,\"b\")-COUNTIF(L5:L37,\"s\"))","v":16},{"$f":"IF(COUNTBLANK(M5:M37)='export html'!$AR$6,\"\",'export html'!$AR$6-COUNTIF(M5:M37,\"a\")-COUNTIF(M5:M37,\"b\")-COUNTIF(M5:M37,\"s\"))","v":17},{"$f":"IF(COUNTBLANK(N5:N37)='export html'!$AR$6,\"\",'export html'!$AR$6-COUNTIF(N5:N37,\"a\")-COUNTIF(N5:N37,\"b\")-COUNTIF(N5:N37,\"s\"))","v":19},{"$f":"IF(COUNTBLANK(O5:O37)='export html'!$AR$6,\"\",'export html'!$AR$6-COUNTIF(O5:O37,\"a\")-COUNTIF(O5:O37,\"b\")-COUNTIF(O5:O37,\"s\"))","v":16},{"$f":"IF(COUNTBLANK(P5:P37)='export html'!$AR$6,\"\",'export html'!$AR$6-COUNTIF(P5:P37,\"a\")-COUNTIF(P5:P37,\"b\")-COUNTIF(P5:P37,\"s\"))","v":19},{"$f":"IF(COUNTBLANK(Q5:Q37)='export html'!$AR$6,\"\",'export html'!$AR$6-COUNTIF(Q5:Q37,\"a\")-COUNTIF(Q5:Q37,\"b\")-COUNTIF(Q5:Q37,\"s\"))","v":15},{"$f":"IF(COUNTBLANK(R5:R37)='export html'!$AR$6,\"\",'export html'!$AR$6-COUNTIF(R5:R37,\"a\")-COUNTIF(R5:R37,\"b\")-COUNTIF(R5:R37,\"s\"))","v":34},{"$f":"IF(COUNTBLANK(S5:S37)='export html'!$AR$6,\"\",'export html'!$AR$6-COUNTIF(S5:S37,\"a\")-COUNTIF(S5:S37,\"b\")-COUNTIF(S5:S37,\"s\"))","v":16},{"$f":"IF(COUNTBLANK(T5:T37)='export html'!$AR$6,\"\",'export html'!$AR$6-COUNTIF(T5:T37,\"a\")-COUNTIF(T5:T37,\"b\")-COUNTIF(T5:T37,\"s\"))","v":19},{"$f":"IF(COUNTBLANK(U5:U37)='export html'!$AR$6,\"\",'export html'!$AR$6-COUNTIF(U5:U37,\"a\")-COUNTIF(U5:U37,\"b\")-COUNTIF(U5:U37,\"s\"))","v":15},{"$f":"IF(COUNTBLANK(V5:V37)='export html'!$AR$6,\"\",'export html'!$AR$6-COUNTIF(V5:V37,\"a\")-COUNTIF(V5:V37,\"b\")-COUNTIF(V5:V37,\"s\"))","v":16},{"$f":"IF(COUNTBLANK(W5:W37)='export html'!$AR$6,\"\",'export html'!$AR$6-COUNTIF(W5:W37,\"a\")-COUNTIF(W5:W37,\"b\")-COUNTIF(W5:W37,\"s\"))","v":15},{"$f":"IF(COUNTBLANK(X5:X37)='export html'!$AR$6,\"\",'export html'!$AR$6-COUNTIF(X5:X37,\"a\")-COUNTIF(X5:X37,\"b\")-COUNTIF(X5:X37,\"s\"))","v":17},{"$f":"IF(COUNTBLANK(Y5:Y37)='export html'!$AR$6,\"\",'export html'!$AR$6-COUNTIF(Y5:Y37,\"a\")-COUNTIF(Y5:Y37,\"b\")-COUNTIF(Y5:Y37,\"s\"))","v":18},{"$f":"IF(COUNTBLANK(Z5:Z37)='export html'!$AR$6,\"\",'export html'!$AR$6-COUNTIF(Z5:Z37,\"a\")-COUNTIF(Z5:Z37,\"b\")-COUNTIF(Z5:Z37,\"s\"))","v":34},{"$f":"IF(COUNTBLANK(AA5:AA37)='export html'!$AR$6,\"\",'export html'!$AR$6-COUNTIF(AA5:AA37,\"a\")-COUNTIF(AA5:AA37,\"b\")-COUNTIF(AA5:AA37,\"s\"))","v":34},null,null,null,null,null,null,null,null,null,"Match van de Man",null,null,null,null,null,null,null,null,null,null,null,null,null,null,null,null,null,null,null,null,null,null,null,null,null,null,null,null,null,null,null,"DEZE WEEK",null,null,null,"SEIZOEN",null,null,null,"WEEKOVERWINNINGEN",null,null,null,null,null,null,null,null,null,null,null,null,null,null,null,null,null,null,null,null,null,null,null,null,null,null,null,null,null,null,null,null,null,null,null,null,null,null,null,null,null,null,null,null,null,null,null,null,null,null,null,{"$f":"_xlfn.TEXTJOIN( \"|\",TRUE, _xlfn.DROP( _xlfn.TEXTSPLIT( DY2, , \" / \" ), 1 ))","v":"Beirinckx Wout|Celis Ive|Coolsaet Joy|De Groof Maarten|De Groof Steven|De Vinster Glenn|Delen Robbe|Elst Pieter|Gielis Bernd|Hofmans Stijn|Jordens Koen|Langenaeker Maarten|Nyckees Wannes|Stevens Siebe|Van de Vondel Rob|Van Den Brande Brent|Van Dessel Dieter|Verhellen Jorn|Verlooy Kaïn"}]
["Speeldag",{"$f":"IF(COUNTBLANK(B5:B38)='export html'!$AR$6,\"\",kalender!$B3)","v":1},{"$f":"IF(COUNTBLANK(C5:C38)='export html'!$AR$6,\"\",kalender!$B4)","v":2},{"$f":"IF(COUNTBLANK(D5:D38)='export html'!$AR$6,\"\",kalender!$B5)","v":3},{"$f":"IF(COUNTBLANK(E5:E38)='export html'!$AR$6,\"\",kalender!$B6)","v":4},{"$f":"IF(COUNTBLANK(F5:F38)='export html'!$AR$6,\"\",kalender!$B7)","v":5},{"$f":"IF(COUNTBLANK(G5:G38)='export html'!$AR$6,\"\",kalender!$B8)","v":6},{"$f":"IF(COUNTBLANK(H5:H38)='export html'!$AR$6,\"\",kalender!$B9)","v":7},{"$f":"IF(COUNTBLANK(I5:I38)='export html'!$AR$6,\"\",kalender!$B10)","v":8},{"$f":"IF(COUNTBLANK(J5:J38)='export html'!$AR$6,\"\",kalender!$B11)","v":9},{"$f":"IF(COUNTBLANK(K5:K38)='export html'!$AR$6,\"\",kalender!$B12)","v":10},{"$f":"IF(COUNTBLANK(L5:L38)='export html'!$AR$6,\"\",kalender!$B13)","v":11},{"$f":"IF(COUNTBLANK(M5:M38)='export html'!$AR$6,\"\",kalender!$B14)","v":12},{"$f":"IF(COUNTBLANK(N5:N38)='export html'!$AR$6,\"\",kalender!$B15)","v":13},{"$f":"IF(COUNTBLANK(O5:O38)='export html'!$AR$6,\"\",kalender!$B16)","v":14},{"$f":"IF(COUNTBLANK(P5:P38)='export html'!$AR$6,\"\",kalender!$B17)","v":17},{"$f":"IF(COUNTBLANK(Q5:Q38)='export html'!$AR$6,\"\",kalender!$B18)","v":16},{"$f":"IF(COUNTBLANK(R5:R38)='export html'!$AR$6,\"\",kalender!$B19)","v":19},{"$f":"IF(COUNTBLANK(S5:S38)='export html'!$AR$6,\"\",kalender!$B20)","v":20},{"$f":"IF(COUNTBLANK(T5:T38)='export html'!$AR$6,\"\",kalender!$B21)","v":21},{"$f":"IF(COUNTBLANK(U5:U38)='export html'!$AR$6,\"\",kalender!$B22)","v":15},{"$f":"IF(COUNTBLANK(V5:V38)='export html'!$AR$6,\"\",kalender!$B23)","v":22},{"$f":"IF(COUNTBLANK(W5:W38)='export html'!$AR$6,\"\",kalender!$B24)","v":23},{"$f":"IF(COUNTBLANK(X5:X38)='export html'!$AR$6,\"\",kalender!$B25)","v":24},{"$f":"IF(COUNTBLANK(Y5:Y38)='export html'!$AR$6,\"\",kalender!$B26)","v":25},{"$f":"IF(COUNTBLANK(Z5:Z38)='export html'!$AR$6,\"\",kalender!$B27)","v":""},{"$f":"IF(COUNTBLANK(AA5:AA38)='export html'!$AR$6,\"\",kalender!$B28)","v":""},null,null,null,null,null,null,null,null,null,"Speler","Totaal","Plaats",{"$f":"INDEX( B1:AA1, 1, MATCH( AN2, B4:AA4, 0 ))","v":"Yerevan United (U)"},"Plaats",null,null,null,null,null,null,null,null,null,null,null,null,null,null,null,null,null,null,null,null,null,null,null,null,null,null,null,null,null,null,null,null,null,null,null,null,null,null,null,null,null,null,{"$f":"\"Match tegen \" & AN4","v":"Match tegen Yerevan United (U)"},"Punten -\nGEWOGEN","Punten -\nONGEWOGEN",null,null,null,null,"Seizoenstotaal","Punten -\nGEWOGEN","Punten -\nONGEWOGEN","Matchen",null,null,"HULP 1","HULP 2","HULP 3","HULP 4",null,null,"Weekoverwinningen","Aantal","Matchen",null,null,"Podiumplaatsen","Goud","Zilver","Brons","Totaal","Goud = 3\nZilver = 2\nBrons = 1",null,null,"Ook op het podium:",null,null,"",null,null,"Speler","Plaats 1","Plaats 2","Plaats 3","Totaal","Gewogen som"]
["Beckx Pieter-Alexander","a","a","a",1,"a","a","b","b","b","a","a","a","a","a","a","a","ff","a","a","a","a","a","a","a",null,null,{"$f":"SUM( B102:AA102 )","v":0},{"$f":"COUNTIF( B5:AA5, \"k\" ) + SUM( B5:AA5 )","v":1},{"$f":"IFERROR( AB5 / COUNT($B$4:$AA$4), \"\" )","v":0},{"$f":"COUNTIF( B5:AA5, \"a\" )","v":19},{"$f":"COUNTIF( B5:AA5, \"b\" )","v":3},{"$f":"COUNTIF( B5:AA5, \"s\" )","v":0},{"$f":"COUNTIF( B5:AA5, \"ng\" ) + COUNTIF( B5:AA5, \"na\" ) + COUNTIF( B5:AA5, \"p\" ) + COUNTIF( B5:AA5, \"t\" )","v":0},{"$f":"COUNTIF(B5:AA5,\"k\")","v":0},null,{"$f":"A5","v":"Beckx Pieter-Alexander"},{"$f":"IF(SUM(AP5:BO5)=0,\"\",SUM(AP5:BO5))","v":""},{"$f":"IF(AL5=\"\",\"\",RANK(AL5,AL$5:AL$41))","v":""},{"$f":"_xlfn.LET( _xlpm.i, INDEX( $AP5:$BO5, 1, MAX( 1, MATCH( $AN$2, $B$4:$AA$4, 0 ))), IF( _xlpm.i = \"\", \"\", _xlpm.i ))","v":0},{"$f":"IF(AN5=\"\",\"\",RANK(AN5,AN$5:AN$41))","v":11},{"$f":"B352","v":0},{"$f":"C352","v":0},{"$f":"D352","v":0},{"$f":"E352","v":0},{"$f":"F352","v":0},{"$f":"G352","v":0},{"$f":"H352","v":0},{"$f":"I352","v":0},{"$f":"J352","v":0},{"$f":"K352","v":0},{"$f":"L352","v":0},{"$f":"M352","v":0},{"$f":"N352","v":0},{"$f":"O352","v":0},{"$f":"P352","v":0},{"$f":"Q352","v":0},{"$f":"R352","v":0},{"$f":"S352","v":0},{"$f":"T352","v":0},{"$f":"U352","v":0},{"$f":"V352","v":0},{"$f":"W352","v":0},{"$f":"X352","v":0},{"$f":"Y352","v":0},{"$f":"Z352","v":0},{"$f":"AA352","v":0},null,{"$f":"INDEX($AP5:$BO5,1,MAX(1,MATCH($AN$2,$B$4:$AA$4,0)))","v":0},{"$f":"BQ5-CC5/100","v":-0.01},{"$f":"LARGE(BR$5:BR$40,CC5)","v":17.002857142857142},null,{"$f":"SUM(AP5:BO5)","v":0},{"$f":"BU5-CC5/100","v":-0.01},{"$f":"LARGE(BV$5:BV$40,CC5)","v":243.49712921065861},null,{"$f":"COUNTIF( $AP$45:$BO$45, \"*\" & AK5 & \"*\" )","v":0},{"$f":"1000*BY5+BU5-CC5/100","v":-0.01},{"$f":"LARGE(BZ$5:BZ$40,CC5)","v":7243.4971292106584},null,{"$f":"_xlfn.SEQUENCE(AantalSpelers + 1)","v":1},null,{"$f":"IF( CG5 = \"\", \"\", CC5 )","v":1},{"$f":"_xlfn.XLOOKUP( CS5, $DZ$5:$DZ$39, $EA$5:$EA$39, \"\" )","v":"Glenn De Vinster"},{"$f":"IF( INDEX( $BQ$5:$BQ$40, MATCH( BS5, $BR$5:$BR$40, 0 )) = 0, \"\", INDEX( $BQ$5:$BQ$40, MATCH( BS5, $BR$5:$BR$40, 0 )))","v":17.142857142857142},{"$f":"IF( CS5 = \"\", \"\", _xlfn.XLOOKUP( CS5, $A$302:$A$336, INDEX( $B$302:$AA$336, , $AM$1 ), \"\" ))","v":12},null,null,null,{"$f":"IF( CN5 = \"\", \"\", CC5 )","v":1},{"$f":"_xlfn.XLOOKUP( CT5, $DZ$5:$DZ$39, $EA$5:$EA$39, \"\" )","v":"Glenn De Vinster"},{"$f":"IF( INDEX( $BU$5:$BU$40, MATCH( BW5, $BV$5:$BV$40, 0 )) = 0, \"\", INDEX( $BU$5:$BU$40, MATCH( BW5, $BV$5:$BV$40, 0 )))","v":243.6371292106586},{"$f":"IF( CT5 = \"\", \"\", _xlfn.XLOOKUP( CT5, $A$302:$A$336, $AB$302:$AB$336, \"\" ))","v":187},{"$f":"_xlfn.LET( _xlpm.m, INDEX( $AC$5:$AC$40, MATCH( CT5, $AK$5:$AK$40, 0 )),\nIF( CN5 = \"\", \"\", \"(\" & IF( _xlpm.m = \"\", 0, _xlpm.m ) & \")\" ))","v":"(20)"},{"$f":"IFERROR(IF(CN5=\"\",\"\",ABS(CN5/CP5)),0)","v":12.181856460532931},null,{"$f":"IF( CG5 = \"\", \"\", INDEX( $AK$5:$AK$41, MATCH( BS5, $BR$5:$BR$40, 0 )))","v":"De Vinster Glenn"},{"$f":"IF( CN5 = \"\", \"\", INDEX( $AK$5:$AK$40, MATCH( BW5, $BV$5:$BV$40, 0 )))","v":"De Vinster Glenn"},{"$f":"IF( CZ5 = \"\", \"\", INDEX( $AK$5:$AK$40, MATCH( CA5, $BZ$5:$BZ$40, 0 )))","v":"De Vinster Glenn"},{"$f":"_xlfn.TAKE( _xlfn.SORTBY( OFFSET( DR5:DW19, , , COUNT(_xlfn.ANCHORARRAY( DW5) ), ),_xlfn.ANCHORARRAY( DW5), -1 ), , 1 )","v":"De Vinster Glenn"},null,{"$f":"IF(CZ5=\"\",\"\",CC5)","v":1},{"$f":"_xlfn.XLOOKUP( CU5, $DZ$5:$DZ$39, $EA$5:$EA$39, \"\" )","v":"Glenn De Vinster"},{"$f":"IF(INDEX($BY$5:$BY$40,MATCH(CA5,$BZ$5:$BZ$40,0))=0,\"\",INDEX($BY$5:$BY$40,MATCH(CA5,$BZ$5:$BZ$40,0)))","v":7},{"$f":"IF(CZ5=\"\",\"\",\"(\" & INDEX($AC$5:$AC$40,MATCH(CU5,$AK$5:$AK$40,0)) & \")\")","v":"(20)"},null,{"$f":"_xlfn.SEQUENCE( ROWS(_xlfn.ANCHORARRAY( DR5) ))","v":1},{"$f":"_xlfn.XLOOKUP(_xlfn.ANCHORARRAY( CV5), $DZ$5:$DZ$39, $EA$5:$EA$39, \"\" )","v":"Glenn De Vinster"},{"$f":"_xlfn.DROP( _xlfn.SORTBY( OFFSET( DR5:DW19, , , COUNT(_xlfn.ANCHORARRAY( DW5) ), ),_xlfn.ANCHORARRAY( DW5), -1 ), , 1 )","v":7},3,2,12,29.000050000000002,null,null,{"$f":"_xlfn.LET( _xlpm.n, _xlfn.TOCOL( AP45:BO47, 1 ),\n_xlfn._xlws.FILTER( _xlpm.n, _xlpm.n <> \"\", \"Niets weer te geven.\" ))","v":"Nyckees Wannes"},null,{"$f":"_xlfn.LET(\n     _xlpm.a,_xlfn.ANCHORARRAY( DL5),\n     _xlpm.b, (LEN(_xlpm.a) - LEN(SUBSTITUTE(_xlpm.a, \" / \",)))/LEN( \" / \" ) +1,\n     _xlpm.c, _xlfn.SEQUENCE( , MAX(_xlpm.b)),\n     IFERROR( _xlfn.TEXTSPLIT( _xlfn.TEXTAFTER( \" / \" & _xlpm.a & \" / \",\" / \", _xlpm.c ), \" / \"), NA() ))","v":"Nyckees Wannes"},{"$error":"#N/A"},{"$error":"#N/A"},null,{"$f":"_xlfn.UNIQUE( _xlfn.TOCOL(_xlfn.ANCHORARRAY( DN5), 2 ))","v":"Nyckees Wannes"},{"$f":"COUNTIF( $AP$45:$BO$45, \"*\" &_xlfn.ANCHORARRAY( DR5) & \"*\" )","v":1},{"$f":"COUNTIF( $AP$46:$BO$46, \"*\" &_xlfn.ANCHORARRAY( DR5) & \"*\" )","v":0},{"$f":"COUNTIF( $AP$47:$BO$47, \"*\" &_xlfn.ANCHORARRAY( DR5) & \"*\" )","v":1},{"$f":"_xlfn.ANCHORARRAY(DS5) +_xlfn.ANCHORARRAY( DT5) +_xlfn.ANCHORARRAY( DU5)","v":2},{"$f":"3 *_xlfn.ANCHORARRAY( DS5) + 2 *_xlfn.ANCHORARRAY( DT5) + 1 *_xlfn.ANCHORARRAY( DU5) + ROW()/100000","v":4.0000499999999999},null,null,{"$f":"A5","v":"Beckx Pieter-Alexander"},"Pieter-Alexander Beckx"]
["Beirinckx Geert","p","a","t","t","t","a","t","a","a","p","p","p","t","a","t","t","ff","a","as","a","t","a","td","a",null,null,0,0,0,9,0,0,12,{"$f":"COUNTIF(B6:AA6,\"k\")","v":0},null,"Beirinckx Geert",{"$f":"IF(SUM(AP6:BO6)=0,\"\",SUM(AP6:BO6))","v":""},"",{"$f":"_xlfn.LET( _xlpm.i, INDEX( $AP6:$BO6, 1, MAX( 1, MATCH( $AN$2, $B$4:$AA$4, 0 ))), IF( _xlpm.i = \"\", \"\", _xlpm.i ))","v":0},11,0,0,0,0,0,0,0,0,0,0,0,0,0,0,0,0,0,0,0,0,0,0,0,0,0,0,null,{"$f":"INDEX($AP6:$BO6,1,MAX(1,MATCH($AN$2,$B$4:$AA$4,0)))","v":0},-0.02,16.952857142857141,null,0,{"$f":"BU6-CC6/100","v":-0.02},165.93033477358554,null,0,{"$f":"1000*BY6+BU6-CC6/100","v":-0.02},5165.9303347735859,null,2,null,2,"Stijn Hofmans",17.142857142857142,{"$f":"IF( CS6 = \"\", \"\", _xlfn.XLOOKUP( CS6, $A$302:$A$336, INDEX( $B$302:$AA$336, , $AM$1 ), \"\" ))","v":12},null,null,null,2,"Stijn Hofmans",166.12033477358554,135,"(16)",10.382520923349096,null,"Hofmans Stijn","Hofmans Stijn","Hofmans Stijn","Hofmans Stijn",null,2,"Stijn Hofmans",5,"(16)",null,2,"Stijn Hofmans",5,3,0,8,21.000050000000002,null,null,"De Vinster Glenn",null,"De Vinster Glenn",{"$error":"#N/A"},{"$error":"#N/A"},null,"De Vinster Glenn",7,3,2,12,29.000050000000002,null,null,{"$f":"A6","v":"Beirinckx Geert"},"Geert Beirinckx"]
["Beirinckx Jurgen",1,"ng","ng",1,"p","p","p","ng","p","a","ng",1,"ng",1,"p","p","ff","p","p","p","p","p","p","p",null,null,0,4,0,1,0,0,18,0,null,"Beirinckx Jurgen",8.8293650793650791,26,{"$f":"_xlfn.LET( _xlpm.i, INDEX( $AP7:$BO7, 1, MAX( 1, MATCH( $AN$2, $B$4:$AA$4, 0 ))), IF( _xlpm.i = \"\", \"\", _xlpm.i ))","v":0},11,2.2222222222222223,0,0,0,0,0,0,0,0,0,0,3.75,0,1.4285714285714286,0,0,0,1.4285714285714286,0,0,0,0,0,0,0,0,null,{"$f":"INDEX($AP7:$BO7,1,MAX(1,MATCH($AN$2,$B$4:$AA$4,0)))","v":0},-0.03,15.504285714285713,null,8.8293650793650791,{"$f":"BU7-CC7/100","v":8.7993650793650797},155.20707844271314,null,0,{"$f":"1000*BY7+BU7-CC7/100","v":8.7993650793650797},2127.1825608516015,null,3,null,3,"Maarten Langenaeker",15.714285714285714,{"$f":"IF( CS7 = \"\", \"\", _xlfn.XLOOKUP( CS7, $A$302:$A$336, INDEX( $B$302:$AA$336, , $AM$1 ), \"\" ))","v":11},null,null,null,3,"Kaïn Verlooy",155.52707844271313,125,"(18)",8.6403932468173963,null,"Langenaeker Maarten","Verlooy Kaïn","Jordens Koen","Langenaeker Maarten",null,3,"Koen Jordens",2,"(19)",null,3,"Maarten Langenaeker",1,1,6,8,11.00005,null,null,"Delen Robbe",null,"Delen Robbe",{"$error":"#N/A"},{"$error":"#N/A"},null,"Delen Robbe",1,0,0,1,3.0000499999999999,null,null,"Beirinckx Jurgen","Jurgen Beirinckx"]
["Beirinckx Rani",null,null,null,null,null,null,null,null,null,null,null,null,null,null,null,null,null,null,null,null,null,null,null,null,null,null,0,{"$f":"COUNTIF( B8:AA8, \"k\" ) + SUM( B8:AA8 )","v":0},{"$f":"IFERROR( AB8 / COUNT($B$4:$AA$4), \"\" )","v":0},{"$f":"COUNTIF( B8:AA8, \"a\" )","v":0},{"$f":"COUNTIF( B8:AA8, \"b\" )","v":0},{"$f":"COUNTIF( B8:AA8, \"s\" )","v":0},{"$f":"COUNTIF( B8:AA8, \"ng\" ) + COUNTIF( B8:AA8, \"na\" ) + COUNTIF( B8:AA8, \"p\" ) + COUNTIF( B8:AA8, \"t\" )","v":0},{"$f":"COUNTIF(B8:AA8,\"k\")","v":0},null,{"$f":"A8","v":"Beirinckx Rani"},{"$f":"IF(SUM(AP8:BO8)=0,\"\",SUM(AP8:BO8))","v":2.3611111111111112},29,{"$f":"_xlfn.LET( _xlpm.i, INDEX( $AP8:$BO8, 1, MAX( 1, MATCH( $AN$2, $B$4:$AA$4, 0 ))), IF( _xlpm.i = \"\", \"\", _xlpm.i ))","v":0},11,1.1111111111111112,0,0,0,0,0,0,0,0,0,0,1.25,0,0,0,0,0,0,0,0,0,0,0,0,0,0,null,{"$f":"INDEX($AP8:$BO8,1,MAX(1,MATCH($AN$2,$B$4:$AA$4,0)))","v":0},{"$f":"BQ8-CC8/100","v":-0.04},15.394285714285713,null,{"$f":"SUM(AP8:BO8)","v":2.3611111111111112},{"$f":"BU8-CC8/100","v":2.3211111111111111},149.34248509660273,null,0,{"$f":"1000*BY8+BU8-CC8/100","v":2.3211111111111111},2074.4082662538699,null,4,null,{"$f":"IF( CG8 = \"\", \"\", CC8 )","v":4},"Kaïn Verlooy",15.714285714285714,{"$f":"IF( CS8 = \"\", \"\", _xlfn.XLOOKUP( CS8, $A$302:$A$336, INDEX( $B$302:$AA$336, , $AM$1 ), \"\" ))","v":11},null,null,null,{"$f":"IF( CN8 = \"\", \"\", CC8 )","v":4},"Maarten Langenaeker",149.55248509660274,116,"(19)",{"$f":"IFERROR(IF(CN8=\"\",\"\",ABS(CN8/CP8)),0)","v":7.8711834261369864},null,"Verlooy Kaïn","Langenaeker Maarten","Verhellen Jorn","Jordens Koen",null,{"$f":"IF(CZ8=\"\",\"\",CC8)","v":4},"Jorn Verhellen",2,"(5)",null,4,"Koen Jordens",2,0,5,7,11.00005,null,null,"Langenaeker Maarten",null,"Langenaeker Maarten",{"$error":"#N/A"},{"$error":"#N/A"},null,"Langenaeker Maarten",1,1,6,8,11.00005,null,null,"Beirinckx Rani","Rani Beirinckx"]
["Beirinckx Wout","a",1,1,1,1,1,1,"k",1,1,"b","t","k",1,1,1,"ff",1,1,"a",1,1,1,1,null,null,1,19,4.1666666666666664E-2,2,1,0,1,2,null,"Beirinckx Wout",75.175778813549712,11,{"$f":"_xlfn.LET( _xlpm.i, INDEX( $AP9:$BO9, 1, MAX( 1, MATCH( $AN$2, $B$4:$AA$4, 0 ))), IF( _xlpm.i = \"\", \"\", _xlpm.i ))","v":10},5,0,9.3333333333333339,7,1.3333333333333333,0,8.5714285714285712,2.6666666666666665,9.2307692307692299,0,0,0,0,6.666666666666667,0,3.1578947368421053,4.2857142857142856,0,5.7142857142857144,1.3333333333333333,0,5.882352941176471,10,0,0,0,0,null,{"$f":"INDEX($AP9:$BO9,1,MAX(1,MATCH($AN$2,$B$4:$AA$4,0)))","v":10},9.9499999999999993,9.9499999999999993,null,75.175778813549712,75.125778813549715,134.18717865553776,null,0,75.125778813549715,2045.2753679447487,null,5,null,5,"Wout Beirinckx",10,{"$f":"IF( CS9 = \"\", \"\", _xlfn.XLOOKUP( CS9, $A$302:$A$336, INDEX( $B$302:$AA$336, , $AM$1 ), \"\" ))","v":7},null,null,null,5,"Maarten De Groof",134.29717865553778,106,"(19)",7.0682725608177774,null,"Beirinckx Wout","De Groof Maarten","Van Den Brande Brent","Verhellen Jorn",null,5,"Brent Van Den Brande",2,"(4)",null,5,"Jorn Verhellen",2,1,2,5,10.00005,null,null,"De Vinster Glenn / Verhellen Jorn",null,"De Vinster Glenn","Verhellen Jorn",{"$error":"#N/A"},null,"Verhellen Jorn",2,1,2,5,10.00005,null,null,"Beirinckx Wout","Wout Beirinckx"]
["Boes Dieuwer",1,1,1,1,"a",1,"b","b","b","b","b","b","b","a",1,"a","ff","a","a","a","a","a","a",1,null,null,0,7,0,9,7,0,0,0,null,"Boes Dieuwer",21.010025062656641,21,{"$f":"_xlfn.LET( _xlpm.i, INDEX( $AP10:$BO10, 1, MAX( 1, MATCH( $AN$2, $B$4:$AA$4, 0 ))), IF( _xlpm.i = \"\", \"\", _xlpm.i ))","v":0},11,0,5.333333333333333,1,4,0,8.5714285714285712,0,0,0,0,0,0,0,0,2.1052631578947367,0,0,0,0,0,0,0,0,0,0,0,null,{"$f":"INDEX($AP10:$BO10,1,MAX(1,MATCH($AN$2,$B$4:$AA$4,0)))","v":0},-0.06,8.4014285714285712,null,21.010025062656641,20.950025062656643,127.1825608516011,null,0,20.950025062656643,1155.2070784427133,null,6,null,6,"Bernd Gielis",8.5714285714285712,{"$f":"IF( CS10 = \"\", \"\", _xlfn.XLOOKUP( CS10, $A$302:$A$336, INDEX( $B$302:$AA$336, , $AM$1 ), \"\" ))","v":6},null,null,null,6,"Koen Jordens",127.3825608516011,98,"(19)",6.704345307979005,null,"Gielis Bernd","Jordens Koen","Verlooy Kaïn","Gielis Bernd",null,6,"Kaïn Verlooy",1,"(18)",null,6,"Bernd Gielis",1,3,1,5,10.00005,null,null,"Gielis Bernd",null,"Gielis Bernd",{"$error":"#N/A"},{"$error":"#N/A"},null,"Gielis Bernd",1,3,1,5,10.00005,null,null,"Boes Dieuwer","Dieuwer Boes"]
["Celis Ive","a","a",1,"a",1,1,1,"a","a","a",1,1,1,1,1,"a","ff","a","a","a","a","a","a","a",null,null,0,9,0,14,0,0,0,0,null,"Celis Ive",73.277642636001772,13,{"$f":"_xlfn.LET( _xlpm.i, INDEX( $AP11:$BO11, 1, MAX( 1, MATCH( $AN$2, $B$4:$AA$4, 0 ))), IF( _xlpm.i = \"\", \"\", _xlpm.i ))","v":0},11,0,0,3,0,12.941176470588236,12.857142857142858,4,0,0,0,6.666666666666667,8.75,13.333333333333334,8.5714285714285712,3.1578947368421053,0,0,0,0,0,0,0,0,0,0,0,null,{"$f":"INDEX($AP11:$BO11,1,MAX(1,MATCH($AN$2,$B$4:$AA$4,0)))","v":0},-7.0000000000000007E-2,7.0228571428571431,null,73.277642636001772,73.207642636001779,123.46553113553112,null,0,73.207642636001779,1149.3424850966028,null,7,null,7,"Steven De Groof",7.1428571428571432,{"$f":"IF( CS11 = \"\", \"\", _xlfn.XLOOKUP( CS11, $A$302:$A$336, INDEX( $B$302:$AA$336, , $AM$1 ), \"\" ))","v":5},null,null,null,7,"Bernd Gielis",123.63553113553112,93,"(14)",8.831109366823652,null,"De Groof Steven","Gielis Bernd","Langenaeker Maarten","Verlooy Kaïn",null,7,"Maarten Langenaeker",1,"(19)",null,7,"Kaïn Verlooy",1,3,0,4,9.0000499999999999,null,null,"De Vinster Glenn",null,"De Vinster Glenn",{"$error":"#N/A"},{"$error":"#N/A"},null,"Van Den Brande Brent",2,0,0,2,6.0000499999999999,null,null,"Celis Ive","Ive Celis"]
["Coolsaet Joy","a","a","td",1,"td",1,"td","a",1,"td",1,1,1,"a",1,"a","ff",1,"td",1,1,"a",1,1,null,null,0,12,0,6,0,0,0,0,null,"Coolsaet Joy",73.270523594053017,14,{"$f":"_xlfn.LET( _xlpm.i, INDEX( $AP12:$BO12, 1, MAX( 1, MATCH( $AN$2, $B$4:$AA$4, 0 ))), IF( _xlpm.i = \"\", \"\", _xlpm.i ))","v":0},11,0,0,1,9.3333333333333339,0,10,0,0,7.5,0,10.666666666666666,10,2.8571428571428572,0,0,0,0,5.7142857142857144,0,13.846153846153847,2.3529411764705883,0,0,0,0,0,null,{"$f":"INDEX($AP12:$BO12,1,MAX(1,MATCH($AN$2,$B$4:$AA$4,0)))","v":0},-0.08,4.1757142857142853,null,73.270523594053017,73.190523594053019,114.39264567905434,null,0,{"$f":"1000*BY12+BU12-CC12/100","v":73.190523594053019},1123.4655311355311,null,8,null,8,"Maarten De Groof",4.2857142857142856,{"$f":"IF( CS12 = \"\", \"\", _xlfn.XLOOKUP( CS12, $A$302:$A$336, INDEX( $B$302:$AA$336, , $AM$1 ), \"\" ))","v":3},null,null,null,8,"Steven De Groof",114.51264567905434,88,"(20)",5.7256322839527174,null,"De Groof Maarten","De Groof Steven","Gielis Bernd","De Groof Maarten",null,8,"Bernd Gielis",1,"(14)",null,8,"Maarten De Groof",0,3,2,5,8.0000499999999999,null,null,"Van Den Brande Brent",null,"Van Den Brande Brent",{"$error":"#N/A"},{"$error":"#N/A"},null,"Jordens Koen",2,0,5,7,11.00005,null,null,"Coolsaet Joy","Joy Coolsaet"]
["De Clerck Tom","a","a","a","a","a","a","a","a","a","a","b","a","a","a","a","a","ff","a","a","a","a","a","a","a",null,null,0,0,0,22,1,0,0,0,null,"De Clerck Tom",{"$f":"IF(SUM(AP13:BO13)=0,\"\",SUM(AP13:BO13))","v":""},"",{"$f":"_xlfn.LET( _xlpm.i, INDEX( $AP13:$BO13, 1, MAX( 1, MATCH( $AN$2, $B$4:$AA$4, 0 ))), IF( _xlpm.i = \"\", \"\", _xlpm.i ))","v":0},11,0,0,0,0,0,0,0,0,0,0,0,0,0,0,0,0,0,0,0,0,0,0,0,0,0,0,null,{"$f":"INDEX($AP13:$BO13,1,MAX(1,MATCH($AN$2,$B$4:$AA$4,0)))","v":0},-0.09,2.6971428571428571,null,0,{"$f":"BU13-CC13/100","v":-0.09},110.87516899337335,null,0,{"$f":"1000*BY13+BU13-CC13/100","v":-0.09},1070.4304761904762,null,9,null,9,"Pieter Elst",2.8571428571428572,{"$f":"IF( CS13 = \"\", \"\", _xlfn.XLOOKUP( CS13, $A$302:$A$336, INDEX( $B$302:$AA$336, , $AM$1 ), \"\" ))","v":2},null,null,null,9,"Pieter Elst",111.03516899337335,88,"(17)",6.5314805290219615,null,"Elst Pieter","Elst Pieter","Van de Vondel Rob","Van Den Brande Brent",null,9,"Rob Van de Vondel",1,"(11)",null,9,"Brent Van Den Brande",2,0,0,2,6.0000499999999999,null,null,"Van Den Brande Brent",null,"Van Den Brande Brent",{"$error":"#N/A"},{"$error":"#N/A"},null,"Verlooy Kaïn",1,3,0,4,9.0000499999999999,null,null,"De Clerck Tom","Tom De Clerck"]
["De Graeve Robbe",1,1,"a","a","a","a","a","a","a",1,"b","b","b","b","b","b","ff","b","b","b","b","b","b","b",null,null,0,3,0,7,13,0,0,0,null,"De Graeve Robbe",8.4444444444444446,27,{"$f":"_xlfn.LET( _xlpm.i, INDEX( $AP14:$BO14, 1, MAX( 1, MATCH( $AN$2, $B$4:$AA$4, 0 ))), IF( _xlpm.i = \"\", \"\", _xlpm.i ))","v":0},11,4.4444444444444446,2.6666666666666665,0,0,0,0,0,0,0,1.3333333333333333,0,0,0,0,0,0,0,0,0,0,0,0,0,0,0,0,null,{"$f":"INDEX($AP14:$BO14,1,MAX(1,MATCH($AN$2,$B$4:$AA$4,0)))","v":0},-0.1,1.0885714285714285,null,{"$f":"SUM(AP14:BO14)","v":8.4444444444444446},{"$f":"BU14-CC14/100","v":8.344444444444445},110.63774024049566,null,0,{"$f":"1000*BY14+BU14-CC14/100","v":8.344444444444445},1037.9922222222222,null,10,null,10,"Ryan Verrijdt",1.4285714285714286,{"$f":"IF( CS14 = \"\", \"\", _xlfn.XLOOKUP( CS14, $A$302:$A$336, INDEX( $B$302:$AA$336, , $AM$1 ), \"\" ))","v":1},null,null,null,10,"Dieter Van Dessel",110.91774024049566,88,"(18)",6.1620966800275365,null,"Verrijdt Ryan","Van Dessel Dieter","Nyckees Wannes","Coolsaet Joy",null,10,"Wannes Nyckees",1,"(2)",null,10,"Joy Coolsaet",0,2,2,4,6.0000499999999999,null,null,"De Vinster Glenn",null,"De Vinster Glenn",{"$error":"#N/A"},{"$error":"#N/A"},null,"Hofmans Stijn",5,3,0,8,21.000050000000002,null,null,"De Graeve Robbe","Robbe De Graeve"]
["De Groof Maarten",1,1,1,1,1,"t","ng",1,1,1,1,"a","ng",1,1,1,"ff",1,1,1,1,1,1,1,null,null,1,19,4.1666666666666664E-2,1,0,0,3,{"$f":"COUNTIF(B15:AA15,\"k\")","v":0},null,"De Groof Maarten",134.29717865553778,5,{"$f":"_xlfn.LET( _xlpm.i, INDEX( $AP15:$BO15, 1, MAX( 1, MATCH( $AN$2, $B$4:$AA$4, 0 ))), IF( _xlpm.i = \"\", \"\", _xlpm.i ))","v":4.2857142857142856},8,7.7777777777777777,14.666666666666666,16,6.666666666666667,2.3529411764705883,0,0,12.307692307692308,8.75,8,9.3333333333333339,0,0.95238095238095233,1.4285714285714286,3.1578947368421053,8.5714285714285712,0,5.7142857142857144,10.666666666666666,3.0769230769230771,10.588235294117647,4.2857142857142856,0,0,0,0,null,{"$f":"INDEX($AP15:$BO15,1,MAX(1,MATCH($AN$2,$B$4:$AA$4,0)))","v":4.2857142857142856},4.1757142857142853,-0.01,null,134.29717865553778,134.18717865553776,75.125778813549715,null,0,134.18717865553776,1019.85,null,11,null,"","","",{"$f":"IF( CS15 = \"\", \"\", _xlfn.XLOOKUP( CS15, $A$302:$A$336, INDEX( $B$302:$AA$336, , $AM$1 ), \"\" ))","v":""},null,null,null,11,"Wout Beirinckx",75.175778813549712,59,"(19)",3.956619937555248,null,"","Beirinckx Wout","Delen Robbe","Van de Vondel Rob",null,11,"Robbe Delen",1,"(1)",null,11,"Rob Van de Vondel",1,1,0,2,5.0000499999999999,null,null,"Jordens Koen",null,"Jordens Koen",{"$error":"#N/A"},{"$error":"#N/A"},null,"Van de Vondel Rob",1,1,0,2,5.0000499999999999,null,null,"De Groof Maarten","Maarten De Groof"]
["De Groof Steven",1,"b","p",1,1,1,1,1,1,1,1,"a",1,1,1,1,"ff",1,1,1,1,1,1,1,null,null,1,20,4.1666666666666664E-2,1,1,0,1,0,null,"De Groof Steven",114.51264567905434,8,{"$f":"_xlfn.LET( _xlpm.i, INDEX( $AP16:$BO16, 1, MAX( 1, MATCH( $AN$2, $B$4:$AA$4, 0 ))), IF( _xlpm.i = \"\", \"\", _xlpm.i ))","v":7.1428571428571432},7,2.2222222222222223,0,0,0,0,12.857142857142858,9.3333333333333339,6.1538461538461542,3.75,10.666666666666666,8,0,6.666666666666667,12.857142857142858,8.4210526315789469,1.4285714285714286,0,7.1428571428571432,2.6666666666666665,4.615384615384615,10.588235294117647,7.1428571428571432,0,0,0,0,null,{"$f":"INDEX($AP16:$BO16,1,MAX(1,MATCH($AN$2,$B$4:$AA$4,0)))","v":7.1428571428571432},7.0228571428571431,-0.02,null,114.51264567905434,114.39264567905434,74.408266253869968,null,0,114.39264567905434,134.18717865553776,null,12,null,"","","",{"$f":"IF( CS16 = \"\", \"\", _xlfn.XLOOKUP( CS16, $A$302:$A$336, INDEX( $B$302:$AA$336, , $AM$1 ), \"\" ))","v":""},null,null,null,12,"Jorn Verhellen",74.71826625386997,62,"(5)",14.943653250773995,null,"","Verhellen Jorn","","Elst Pieter",null,"","","","",null,12,"Pieter Elst",0,2,1,3,5.0000499999999999,null,null,"Verlooy Kaïn",null,"Verlooy Kaïn",{"$error":"#N/A"},{"$error":"#N/A"},null,"De Groof Maarten",0,3,2,5,8.0000499999999999,null,null,"De Groof Steven","Steven De Groof"]
["De Swert Erlend","a",1,"a","a","a",1,"a",1,"a","a","a",1,"a","a","a","a","ff","a","a","a","a","a",1,"a",null,null,0,5,0,18,0,0,0,0,null,"De Swert Erlend",24.20787545787546,19,{"$f":"_xlfn.LET( _xlpm.i, INDEX( $AP17:$BO17, 1, MAX( 1, MATCH( $AN$2, $B$4:$AA$4, 0 ))), IF( _xlpm.i = \"\", \"\", _xlpm.i ))","v":0},11,0,6.666666666666667,0,0,0,5.7142857142857144,0,3.0769230769230771,0,0,0,8.75,0,0,0,0,0,0,0,0,0,0,0,0,0,0,null,{"$f":"INDEX($AP17:$BO17,1,MAX(1,MATCH($AN$2,$B$4:$AA$4,0)))","v":0},-0.13,-0.03,null,24.20787545787546,24.077875457875461,73.207642636001779,null,0,24.077875457875461,114.39264567905434,null,13,null,"","","",{"$f":"IF( CS17 = \"\", \"\", _xlfn.XLOOKUP( CS17, $A$302:$A$336, INDEX( $B$302:$AA$336, , $AM$1 ), \"\" ))","v":""},null,null,null,13,"Ive Celis",73.277642636001772,61,"(9)",8.1419602928890864,null,"","Celis Ive","","Celis Ive",null,"","","","",null,13,"Ive Celis",0,2,1,3,5.0000499999999999,null,null,"Hofmans Stijn",null,"Hofmans Stijn",{"$error":"#N/A"},{"$error":"#N/A"},null,"Elst Pieter",0,2,1,3,5.0000499999999999,null,null,"De Swert Erlend","Erlend De Swert"]
["De Vinster Glenn",1,1,1,"a",1,1,1,1,1,1,1,1,1,1,"s",1,"ff",1,1,1,1,1,1,"t",null,null,29,20,1.2083333333333333,1,0,1,1,0,null,"De Vinster Glenn",243.6371292106586,1,{"$f":"_xlfn.LET( _xlpm.i, INDEX( $AP18:$BO18, 1, MAX( 1, MATCH( $AN$2, $B$4:$AA$4, 0 ))), IF( _xlpm.i = \"\", \"\", _xlpm.i ))","v":17.142857142857142},1,7.7777777777777777,16,7,0,18.823529411764707,7.1428571428571432,26.666666666666668,7.6923076923076925,11.25,17.333333333333332,10.666666666666666,5,12.380952380952381,17.142857142857142,0,17.142857142857142,0,15.714285714285714,16,9.2307692307692299,3.5294117647058822,17.142857142857142,0,0,0,0,null,{"$f":"INDEX($AP18:$BO18,1,MAX(1,MATCH($AN$2,$B$4:$AA$4,0)))","v":17.142857142857142},17.002857142857142,-0.04,null,243.6371292106586,243.49712921065861,73.190523594053019,null,7,7243.4971292106584,110.87516899337335,null,14,null,"","","",{"$f":"IF( CS18 = \"\", \"\", _xlfn.XLOOKUP( CS18, $A$302:$A$336, INDEX( $B$302:$AA$336, , $AM$1 ), \"\" ))","v":""},null,null,null,14,"Joy Coolsaet",73.270523594053017,55,"(12)",6.1058769661710848,null,"","Coolsaet Joy","","De Groof Steven",null,"","","","",null,14,"Steven De Groof",0,2,1,3,5.0000499999999999,null,null,"De Vinster Glenn",null,"De Vinster Glenn",{"$error":"#N/A"},{"$error":"#N/A"},null,"Celis Ive",0,2,1,3,5.0000499999999999,null,null,"De Vinster Glenn","Glenn De Vinster"]
["Delen Robbe","na","a",1,"a","a","a","a","a","a","a","a","a","a","a","a","a","ff","a","a","a","a","a","a","a",null,null,0,{"$f":"COUNTIF( B19:AA19, \"k\" ) + SUM( B19:AA19 )","v":1},{"$f":"IFERROR( AB19 / COUNT($B$4:$AA$4), \"\" )","v":0},{"$f":"COUNTIF( B19:AA19, \"a\" )","v":21},{"$f":"COUNTIF( B19:AA19, \"b\" )","v":0},{"$f":"COUNTIF( B19:AA19, \"s\" )","v":0},{"$f":"COUNTIF( B19:AA19, \"ng\" ) + COUNTIF( B19:AA19, \"na\" ) + COUNTIF( B19:AA19, \"p\" ) + COUNTIF( B19:AA19, \"t\" )","v":1},{"$f":"COUNTIF(B19:AA19,\"k\")","v":0},null,"Delen Robbe",20,22,{"$f":"_xlfn.LET( _xlpm.i, INDEX( $AP19:$BO19, 1, MAX( 1, MATCH( $AN$2, $B$4:$AA$4, 0 ))), IF( _xlpm.i = \"\", \"\", _xlpm.i ))","v":0},11,0,0,20,0,0,0,0,0,0,0,0,0,0,0,0,0,0,0,0,0,0,0,0,0,0,0,null,{"$f":"INDEX($AP19:$BO19,1,MAX(1,MATCH($AN$2,$B$4:$AA$4,0)))","v":0},-0.15,-0.06,null,{"$f":"SUM(AP19:BO19)","v":20},{"$f":"BU19-CC19/100","v":19.850000000000001},70.430476190476185,null,1,{"$f":"1000*BY19+BU19-CC19/100","v":1019.85},110.63774024049566,null,15,null,"","","",{"$f":"IF( CS19 = \"\", \"\", _xlfn.XLOOKUP( CS19, $A$302:$A$336, INDEX( $B$302:$AA$336, , $AM$1 ), \"\" ))","v":""},null,null,null,15,"Rob Van de Vondel",70.69047619047619,55,"(11)",{"$f":"IFERROR(IF(CN19=\"\",\"\",ABS(CN19/CP19)),0)","v":6.4264069264069263},null,"","Van de Vondel Rob","","Nyckees Wannes",null,{"$f":"IF(CZ19=\"\",\"\",CC19)","v":""},"","","",null,15,"Wannes Nyckees",1,0,1,2,4.0000499999999999,null,null,"Hofmans Stijn / Verhellen Jorn",null,"Hofmans Stijn","Verhellen Jorn",{"$error":"#N/A"},null,"De Groof Steven",0,2,1,3,5.0000499999999999,null,null,"Delen Robbe","Robbe Delen"]
["Elst Pieter",1,1,1,"a",1,"a",1,1,"a",1,"a",1,1,1,1,"a","ff",1,1,1,1,1,"a",1,null,null,0,17,0,6,0,0,0,0,null,"Elst Pieter",111.03516899337335,9,{"$f":"_xlfn.LET( _xlpm.i, INDEX( $AP20:$BO20, 1, MAX( 1, MATCH( $AN$2, $B$4:$AA$4, 0 ))), IF( _xlpm.i = \"\", \"\", _xlpm.i ))","v":2.8571428571428572},9,7.7777777777777777,14.666666666666666,11,0,2.3529411764705883,0,5.333333333333333,10.76923076923077,0,8,0,7.5,2.8571428571428572,5.7142857142857144,4.2105263157894735,0,0,4.2857142857142856,0,10.76923076923077,12.941176470588236,2.8571428571428572,0,0,0,0,null,{"$f":"INDEX($AP20:$BO20,1,MAX(1,MATCH($AN$2,$B$4:$AA$4,0)))","v":2.8571428571428572},2.6971428571428571,-7.0000000000000007E-2,null,111.03516899337335,110.87516899337335,53.47075702075702,null,0,110.87516899337335,75.125778813549715,null,16,null,"","","",{"$f":"IF( CS20 = \"\", \"\", _xlfn.XLOOKUP( CS20, $A$302:$A$336, INDEX( $B$302:$AA$336, , $AM$1 ), \"\" ))","v":""},null,null,null,16,"Stijn Verdickt",53.770757020757017,39,"(16)",3.3606723137973136,null,"","Verdickt Stijn","","Van Dessel Dieter",null,"","","","",null,16,"Dieter Van Dessel",0,1,2,3,4.0000499999999999,null,null,"Jordens Koen",null,"Jordens Koen",{"$error":"#N/A"},{"$error":"#N/A"},null,"Coolsaet Joy",0,2,2,4,6.0000499999999999,null,null,"Elst Pieter","Pieter Elst"]
["Gielis Bernd","a","a",1,"b","b",1,1,1,1,1,"a","a",1,1,"a",1,"ff",1,1,"a","a",1,1,1,null,null,0,14,0,7,2,0,0,0,null,"Gielis Bernd",123.63553113553112,7,{"$f":"_xlfn.LET( _xlpm.i, INDEX( $AP21:$BO21, 1, MAX( 1, MATCH( $AN$2, $B$4:$AA$4, 0 ))), IF( _xlpm.i = \"\", \"\", _xlpm.i ))","v":8.5714285714285712},6,0,0,2,0,0,14.285714285714286,13.333333333333334,9.2307692307692299,12.5,13.333333333333334,0,0,9.5238095238095237,10,0,14.285714285714286,0,8.5714285714285712,8,0,0,8.5714285714285712,0,0,0,0,null,{"$f":"INDEX($AP21:$BO21,1,MAX(1,MATCH($AN$2,$B$4:$AA$4,0)))","v":8.5714285714285712},8.4014285714285712,-0.08,null,123.63553113553112,123.46553113553112,45.275367944748744,null,1,1123.4655311355311,73.207642636001779,null,17,null,"","","",{"$f":"IF( CS21 = \"\", \"\", _xlfn.XLOOKUP( CS21, $A$302:$A$336, INDEX( $B$302:$AA$336, , $AM$1 ), \"\" ))","v":""},null,null,null,17,"Brent Van Den Brande",45.545367944748747,35,"(4)",11.386341986187187,null,"","Van Den Brande Brent","","Delen Robbe",null,"","","","",null,17,"Robbe Delen",1,0,0,1,3.0000499999999999,null,null,"De Vinster Glenn",null,"De Vinster Glenn",{"$error":"#N/A"},{"$error":"#N/A"},null,"Van Dessel Dieter",0,1,2,3,4.0000499999999999,null,null,"Gielis Bernd","Bernd Gielis"]
["Gielis Wim",1,1,1,1,"b",1,1,"b",1,"b",1,1,"ng","a","b",1,"ff","b",1,1,1,1,1,1,null,null,0,16,0,1,5,0,1,0,null,"Gielis Wim",17.964285714285712,23,{"$f":"_xlfn.LET( _xlpm.i, INDEX( $AP22:$BO22, 1, MAX( 1, MATCH( $AN$2, $B$4:$AA$4, 0 ))), IF( _xlpm.i = \"\", \"\", _xlpm.i ))","v":0},11,0,4,1,0,0,0,1.3333333333333333,0,1.25,0,8,0,0.95238095238095233,0,0,1.4285714285714286,0,0,0,0,0,0,0,0,0,0,null,{"$f":"INDEX($AP22:$BO22,1,MAX(1,MATCH($AN$2,$B$4:$AA$4,0)))","v":0},-0.18,-0.09,null,{"$f":"SUM(AP22:BO22)","v":17.964285714285712},{"$f":"BU22-CC22/100","v":17.784285714285712},37.992222222222225,null,0,{"$f":"1000*BY22+BU22-CC22/100","v":17.784285714285712},73.190523594053019,null,18,null,"","","",{"$f":"IF( CS22 = \"\", \"\", _xlfn.XLOOKUP( CS22, $A$302:$A$336, INDEX( $B$302:$AA$336, , $AM$1 ), \"\" ))","v":""},null,null,null,18,"Wannes Nyckees",38.222222222222221,32,"(2)",{"$f":"IFERROR(IF(CN22=\"\",\"\",ABS(CN22/CP22)),0)","v":19.111111111111111},null,"","Nyckees Wannes","","Stevens Siebe",null,"","","","",null,18,"Siebe Stevens",0,0,1,1,1.0000500000000001,null,null,"Van de Vondel Rob",null,"Van de Vondel Rob",{"$error":"#N/A"},{"$error":"#N/A"},null,"Stevens Siebe",0,0,1,1,1.0000500000000001,null,null,"Gielis Wim","Wim Gielis"]
["Hofmans Stijn",1,1,1,"a",1,"a",1,"a","a",1,1,"a",1,1,1,1,"ff","a",1,1,1,1,1,"a",null,null,18,{"$f":"COUNTIF( B23:AA23, \"k\" ) + SUM( B23:AA23 )","v":16},{"$f":"IFERROR( AB23 / COUNT($B$4:$AA$4), \"\" )","v":0.75},{"$f":"COUNTIF( B23:AA23, \"a\" )","v":7},{"$f":"COUNTIF( B23:AA23, \"b\" )","v":0},{"$f":"COUNTIF( B23:AA23, \"s\" )","v":0},{"$f":"COUNTIF( B23:AA23, \"ng\" ) + COUNTIF( B23:AA23, \"na\" ) + COUNTIF( B23:AA23, \"p\" ) + COUNTIF( B23:AA23, \"t\" )","v":0},{"$f":"COUNTIF(B23:AA23,\"k\")","v":0},null,"Hofmans Stijn",{"$f":"IF(SUM(AP23:BO23)=0,\"\",SUM(AP23:BO23))","v":166.12033477358554},2,{"$f":"_xlfn.LET( _xlpm.i, INDEX( $AP23:$BO23, 1, MAX( 1, MATCH( $AN$2, $B$4:$AA$4, 0 ))), IF( _xlpm.i = \"\", \"\", _xlpm.i ))","v":17.142857142857142},1,13.333333333333334,8,3,0,16.470588235294116,0,2.6666666666666665,0,0,13.333333333333334,2.6666666666666665,0,14.285714285714286,8.5714285714285712,17.894736842105264,5.7142857142857144,0,0,12,16.923076923076923,14.117647058823529,17.142857142857142,0,0,0,0,null,{"$f":"INDEX($AP23:$BO23,1,MAX(1,MATCH($AN$2,$B$4:$AA$4,0)))","v":17.142857142857142},16.952857142857141,-0.1,null,166.12033477358554,165.93033477358554,24.077875457875461,null,5,5165.9303347735859,53.47075702075702,null,19,null,"","","",{"$f":"IF( CS23 = \"\", \"\", _xlfn.XLOOKUP( CS23, $A$302:$A$336, INDEX( $B$302:$AA$336, , $AM$1 ), \"\" ))","v":""},null,null,null,19,"Erlend De Swert",24.20787545787546,18,"(5)",4.8415750915750921,null,"","De Swert Erlend","","Beirinckx Wout",null,null,null,null,null,null,19,"Wout Beirinckx",0,0,1,1,1.0000500000000001,null,null,"Hofmans Stijn",null,"Hofmans Stijn",{"$error":"#N/A"},{"$error":"#N/A"},null,"Beirinckx Wout",0,0,1,1,1.0000500000000001,null,null,"Hofmans Stijn","Stijn Hofmans"]
["Jordens Koen",1,1,1,"a",1,1,1,"a",1,1,1,"a",1,"k","k","k","ff","a",1,1,1,1,1,1,null,null,0,19,0,4,0,0,0,3,null,"Jordens Koen",127.3825608516011,6,{"$f":"_xlfn.LET( _xlpm.i, INDEX( $AP24:$BO24, 1, MAX( 1, MATCH( $AN$2, $B$4:$AA$4, 0 ))), IF( _xlpm.i = \"\", \"\", _xlpm.i ))","v":0},11,5.5555555555555554,10.666666666666666,2,0,0,5.7142857142857144,9.3333333333333339,0,2.5,5.333333333333333,17.333333333333332,0,2.8571428571428572,11.428571428571429,10.526315789473685,18.571428571428573,0,0,2.6666666666666665,12.307692307692308,10.588235294117647,0,0,0,0,0,null,{"$f":"INDEX($AP24:$BO24,1,MAX(1,MATCH($AN$2,$B$4:$AA$4,0)))","v":0},-0.2,-0.13,null,127.3825608516011,127.1825608516011,23.01,null,2,2127.1825608516015,24.077875457875461,null,20,null,"","","",{"$f":"IF( CS24 = \"\", \"\", _xlfn.XLOOKUP( CS24, $A$302:$A$336, INDEX( $B$302:$AA$336, , $AM$1 ), \"\" ))","v":""},null,null,null,20,"Siebe Stevens",23.25,18,"(2)",11.625,null,"","Stevens Siebe","",null,null,null,null,null,null,null,null,null,null,null,null,null,null,null,null,"Hofmans Stijn",null,"Hofmans Stijn",{"$error":"#N/A"},{"$error":"#N/A"},null,null,null,null,null,null,null,null,null,"Jordens Koen","Koen Jordens"]
["Langenaeker Maarten","k","k","k","k","k","k","k","k","k","k","k","k","b","b","b","b","ff","k","k","k","k","k","k","k",null,null,0,19,0,0,4,0,0,19,null,"Langenaeker Maarten",149.55248509660274,4,{"$f":"_xlfn.LET( _xlpm.i, INDEX( $AP25:$BO25, 1, MAX( 1, MATCH( $AN$2, $B$4:$AA$4, 0 ))), IF( _xlpm.i = \"\", \"\", _xlpm.i ))","v":15.714285714285714},3,12.222222222222221,2.6666666666666665,13,20,2.3529411764705883,10,8,4.615384615384615,8.75,12,5.333333333333333,0,0,0,0,0,0,11.428571428571429,13.333333333333334,3.0769230769230771,7.0588235294117645,15.714285714285714,0,0,0,0,null,{"$f":"INDEX($AP25:$BO25,1,MAX(1,MATCH($AN$2,$B$4:$AA$4,0)))","v":15.714285714285714},15.504285714285713,-0.15,null,149.55248509660274,149.34248509660273,20.950025062656643,null,1,1149.3424850966028,23.01,null,21,null,"","","",{"$f":"IF( CS25 = \"\", \"\", _xlfn.XLOOKUP( CS25, $A$302:$A$336, INDEX( $B$302:$AA$336, , $AM$1 ), \"\" ))","v":""},null,null,null,21,"Dieuwer Boes",21.010025062656641,16,"(7)",3.0014321518080918,null,"","Boes Dieuwer","",null,null,null,null,null,null,null,null,null,null,null,null,null,null,null,null,"De Vinster Glenn / Hofmans Stijn",null,"De Vinster Glenn","Hofmans Stijn",{"$error":"#N/A"},null,null,null,null,null,null,null,null,null,"Langenaeker Maarten","Maarten Langenaeker"]
["Lenaerts Jordy","a","a","a","a","a","a","a",1,"a","a","a","a","a","a","a","a","ff","a","a","a","a","a","a","a",null,null,0,1,0,22,0,0,0,0,null,"Lenaerts Jordy",6.1538461538461542,28,{"$f":"_xlfn.LET( _xlpm.i, INDEX( $AP26:$BO26, 1, MAX( 1, MATCH( $AN$2, $B$4:$AA$4, 0 ))), IF( _xlpm.i = \"\", \"\", _xlpm.i ))","v":0},11,0,0,0,0,0,0,0,6.1538461538461542,0,0,0,0,0,0,0,0,0,0,0,0,0,0,0,0,0,0,null,{"$f":"INDEX($AP26:$BO26,1,MAX(1,MATCH($AN$2,$B$4:$AA$4,0)))","v":0},-0.22,-0.18,null,6.1538461538461542,5.9338461538461544,19.850000000000001,null,0,5.9338461538461544,20.950025062656643,null,22,null,"","","",{"$f":"IF( CS26 = \"\", \"\", _xlfn.XLOOKUP( CS26, $A$302:$A$336, INDEX( $B$302:$AA$336, , $AM$1 ), \"\" ))","v":""},null,null,null,22,"Robbe Delen",20,20,"(1)",20,null,"","Delen Robbe","",null,null,null,null,null,null,null,null,null,null,null,null,null,null,null,null,"Hofmans Stijn",null,"Hofmans Stijn",{"$error":"#N/A"},{"$error":"#N/A"},null,null,null,null,null,null,null,null,null,"Lenaerts Jordy","Jordy Lenaerts"]
["Nyckees Wannes",1,"b","a",1,"b","b","b","b","b","b","b","b","b","b","b","b","ff","b","b","b","b","b","b","b",null,null,0,2,0,1,20,0,0,0,null,"Nyckees Wannes",38.222222222222221,18,{"$f":"_xlfn.LET( _xlpm.i, INDEX( $AP27:$BO27, 1, MAX( 1, MATCH( $AN$2, $B$4:$AA$4, 0 ))), IF( _xlpm.i = \"\", \"\", _xlpm.i ))","v":0},11,22.222222222222221,0,0,16,0,0,0,0,0,0,0,0,0,0,0,0,0,0,0,0,0,0,0,0,0,0,null,{"$f":"INDEX($AP27:$BO27,1,MAX(1,MATCH($AN$2,$B$4:$AA$4,0)))","v":0},-0.23,-0.2,null,38.222222222222221,37.992222222222225,17.784285714285712,null,1,1037.9922222222222,17.784285714285712,null,23,null,"","","",{"$f":"IF( CS27 = \"\", \"\", _xlfn.XLOOKUP( CS27, $A$302:$A$336, INDEX( $B$302:$AA$336, , $AM$1 ), \"\" ))","v":""},null,null,null,23,"Wim Gielis",17.964285714285712,14,"(16)",1.122767857142857,null,"","Gielis Wim","",null,null,null,null,null,null,null,null,null,null,null,null,null,null,null,null,"De Groof Maarten / Elst Pieter",null,"De Groof Maarten","Elst Pieter",{"$error":"#N/A"},null,null,null,null,null,null,null,null,null,"Nyckees Wannes","Wannes Nyckees"]
["Stevens Siebe","b","b","b",1,"a","a","a","a",1,"a","a","a","a","a","a","a","ff","a","a","b","b","b","b","b",null,null,0,2,0,13,8,0,0,0,null,"Stevens Siebe",23.25,20,{"$f":"_xlfn.LET( _xlpm.i, INDEX( $AP28:$BO28, 1, MAX( 1, MATCH( $AN$2, $B$4:$AA$4, 0 ))), IF( _xlpm.i = \"\", \"\", _xlpm.i ))","v":0},11,0,0,0,12,0,0,0,0,11.25,0,0,0,0,0,0,0,0,0,0,0,0,0,0,0,0,0,null,{"$f":"INDEX($AP28:$BO28,1,MAX(1,MATCH($AN$2,$B$4:$AA$4,0)))","v":0},-0.24,-0.22,null,23.25,23.01,15.471587793011942,null,0,23.01,15.471587793011942,null,24,null,"","","",{"$f":"IF( CS28 = \"\", \"\", _xlfn.XLOOKUP( CS28, $A$302:$A$336, INDEX( $B$302:$AA$336, , $AM$1 ), \"\" ))","v":""},null,null,null,24,"Ryan Verrijdt",15.811587793011942,13,"(6)",2.6352646321686568,null,"","Verrijdt Ryan","",null,null,"",{"$f":"_xlfn.XLOOKUP( CU28, $DZ$5:$DZ$39, $EA$5:$EA$39, \"\" )","v":""},{"$f":"IF(INDEX($BY$5:$BY$40,MATCH(CA28,$BZ$5:$BZ$40,0))=0,\"\",INDEX($BY$5:$BY$40,MATCH(CA28,$BZ$5:$BZ$40,0)))","v":""},{"$f":"IF(CZ28=\"\",\"\",\"(\" & INDEX($AC$5:$AC$40,MATCH(CU28,$AK$5:$AK$40,0)) & \")\")","v":""},null,null,null,null,null,null,null,null,null,null,"De Groof Maarten",null,"De Groof Maarten",{"$error":"#N/A"},{"$error":"#N/A"},null,null,null,null,null,null,null,null,null,"Stevens Siebe","Siebe Stevens"]
["Tielemans Tom","a","a","a","a","a","a","a","a","a","a","a","a","a","a","a","a","ff","a","a","a","a","a","a","a",null,null,0,0,0,23,0,0,0,{"$f":"COUNTIF(B29:AA29,\"k\")","v":0},null,"Tielemans Tom","","",{"$f":"_xlfn.LET( _xlpm.i, INDEX( $AP29:$BO29, 1, MAX( 1, MATCH( $AN$2, $B$4:$AA$4, 0 ))), IF( _xlpm.i = \"\", \"\", _xlpm.i ))","v":0},11,0,0,0,0,0,0,0,0,0,0,0,0,0,0,0,0,0,0,0,0,0,0,0,0,0,0,null,{"$f":"INDEX($AP29:$BO29,1,MAX(1,MATCH($AN$2,$B$4:$AA$4,0)))","v":0},-0.25,-0.23,null,0,{"$f":"BU29-CC29/100","v":-0.25},10.348571428571429,null,0,{"$f":"1000*BY29+BU29-CC29/100","v":-0.25},10.348571428571429,null,25,null,"","","",{"$f":"IF( CS29 = \"\", \"\", _xlfn.XLOOKUP( CS29, $A$302:$A$336, INDEX( $B$302:$AA$336, , $AM$1 ), \"\" ))","v":""},null,null,null,25,"Jason Vermeylen",10.678571428571429,9,"(5)",2.1357142857142857,null,"","Vermeylen Jason","",null,null,"",null,"","",null,null,null,null,null,null,null,null,null,null,"Verhellen Jorn",null,"Verhellen Jorn",{"$error":"#N/A"},{"$error":"#N/A"},null,null,null,null,null,null,null,null,null,"Tielemans Tom","Tom Tielemans"]
["Van de Vondel Rob","b","b","b","b","b","b","b","b",1,1,1,1,1,1,1,1,"ff",1,1,"a","a","a","a",1,null,null,0,11,0,4,8,0,0,0,null,"Van de Vondel Rob",70.69047619047619,15,{"$f":"_xlfn.LET( _xlpm.i, INDEX( $AP30:$BO30, 1, MAX( 1, MATCH( $AN$2, $B$4:$AA$4, 0 ))), IF( _xlpm.i = \"\", \"\", _xlpm.i ))","v":0},11,0,0,0,0,0,0,0,0,3.75,0,4,8.75,8.5714285714285712,2.8571428571428572,0,8.5714285714285712,0,12.857142857142858,21.333333333333332,0,0,0,0,0,0,0,null,{"$f":"INDEX($AP30:$BO30,1,MAX(1,MATCH($AN$2,$B$4:$AA$4,0)))","v":0},-0.26,-0.24,null,70.69047619047619,{"$f":"BU30-CC30/100","v":70.430476190476185},8.7993650793650797,null,1,{"$f":"1000*BY30+BU30-CC30/100","v":1070.4304761904762},8.7993650793650797,null,26,null,"","","",{"$f":"IF( CS30 = \"\", \"\", _xlfn.XLOOKUP( CS30, $A$302:$A$336, INDEX( $B$302:$AA$336, , $AM$1 ), \"\" ))","v":""},null,null,null,26,"Jurgen Beirinckx",8.8293650793650791,7,"(4)",2.2073412698412698,null,"","Beirinckx Jurgen","",null,null,"",{"$f":"_xlfn.XLOOKUP( CU30, $DZ$5:$DZ$39, $EA$5:$EA$39, \"\" )","v":""},"","",null,null,null,null,null,null,null,null,null,null,"Hofmans Stijn",null,"Hofmans Stijn",{"$error":"#N/A"},{"$error":"#N/A"},null,null,null,null,null,null,null,null,null,"Van de Vondel Rob","Rob Van de Vondel"]
["Van Den Brande Brent","ng","ng","na","na",1,"a","a",1,1,"a","a","a","a","a",1,"a","ff","b","b","b","b","b","b","b",null,null,0,{"$f":"COUNTIF( B31:AA31, \"k\" ) + SUM( B31:AA31 )","v":4},{"$f":"IFERROR( AB31 / COUNT($B$4:$AA$4), \"\" )","v":0},{"$f":"COUNTIF( B31:AA31, \"a\" )","v":8},{"$f":"COUNTIF( B31:AA31, \"b\" )","v":7},{"$f":"COUNTIF( B31:AA31, \"s\" )","v":0},{"$f":"COUNTIF( B31:AA31, \"ng\" ) + COUNTIF( B31:AA31, \"na\" ) + COUNTIF( B31:AA31, \"p\" ) + COUNTIF( B31:AA31, \"t\" )","v":4},{"$f":"COUNTIF(B31:AA31,\"k\")","v":0},null,"Van Den Brande Brent",{"$f":"IF(SUM(AP31:BO31)=0,\"\",SUM(AP31:BO31))","v":45.545367944748747},17,{"$f":"_xlfn.LET( _xlpm.i, INDEX( $AP31:$BO31, 1, MAX( 1, MATCH( $AN$2, $B$4:$AA$4, 0 ))), IF( _xlpm.i = \"\", \"\", _xlpm.i ))","v":0},11,0,0,0,0,9.4117647058823533,0,0,16.923076923076923,15,0,0,0,0,0,4.2105263157894735,0,0,0,0,0,0,0,0,0,0,0,null,{"$f":"INDEX($AP31:$BO31,1,MAX(1,MATCH($AN$2,$B$4:$AA$4,0)))","v":0},-0.27,-0.25,null,{"$f":"SUM(AP31:BO31)","v":45.545367944748747},{"$f":"BU31-CC31/100","v":45.275367944748744},8.344444444444445,null,2,{"$f":"1000*BY31+BU31-CC31/100","v":2045.2753679447487},8.344444444444445,null,27,null,"","","",{"$f":"IF( CS31 = \"\", \"\", _xlfn.XLOOKUP( CS31, $A$302:$A$336, INDEX( $B$302:$AA$336, , $AM$1 ), \"\" ))","v":""},null,null,null,27,"Robbe De Graeve",8.4444444444444446,7,"(3)",{"$f":"IFERROR(IF(CN31=\"\",\"\",ABS(CN31/CP31)),0)","v":2.8148148148148149},null,"","De Graeve Robbe","",null,null,{"$f":"IF(CZ31=\"\",\"\",CC31)","v":""},"","","",null,null,null,null,null,null,null,null,null,null,"Celis Ive / De Groof Steven",null,"Celis Ive","De Groof Steven",{"$error":"#N/A"},null,null,null,null,null,null,null,null,null,"Van Den Brande Brent","Brent Van Den Brande"]
["Van Dessel Dieter",1,1,1,"a",1,1,1,1,1,1,"a",1,1,1,1,"a","ff",1,1,1,1,"s","a",1,null,null,0,{"$f":"COUNTIF( B32:AA32, \"k\" ) + SUM( B32:AA32 )","v":18},{"$f":"IFERROR( AB32 / COUNT($B$4:$AA$4), \"\" )","v":0},{"$f":"COUNTIF( B32:AA32, \"a\" )","v":4},{"$f":"COUNTIF( B32:AA32, \"b\" )","v":0},1,0,0,null,"Van Dessel Dieter",110.91774024049566,10,{"$f":"_xlfn.LET( _xlpm.i, INDEX( $AP32:$BO32, 1, MAX( 1, MATCH( $AN$2, $B$4:$AA$4, 0 ))), IF( _xlpm.i = \"\", \"\", _xlpm.i ))","v":0},11,4.4444444444444446,4,2,0,7.0588235294117645,4.2857142857142856,10.666666666666666,10.76923076923077,3.75,5.333333333333333,0,12.5,10.476190476190476,8.5714285714285712,5.2631578947368425,0,0,5.7142857142857144,1.3333333333333333,7.6923076923076925,7.0588235294117645,0,0,0,0,0,null,{"$f":"INDEX($AP32:$BO32,1,MAX(1,MATCH($AN$2,$B$4:$AA$4,0)))","v":0},-0.28000000000000003,-0.26,null,110.91774024049566,{"$f":"BU32-CC32/100","v":110.63774024049566},5.9338461538461544,null,0,{"$f":"1000*BY32+BU32-CC32/100","v":110.63774024049566},5.9338461538461544,null,28,null,"","","",{"$f":"IF( CS32 = \"\", \"\", _xlfn.XLOOKUP( CS32, $A$302:$A$336, INDEX( $B$302:$AA$336, , $AM$1 ), \"\" ))","v":""},null,null,null,28,"Jordy Lenaerts",6.1538461538461542,4,"(1)",6.1538461538461542,null,"","Lenaerts Jordy","",null,null,"","","","",null,null,null,null,null,null,null,null,null,null,"Gielis Bernd",null,"Gielis Bernd",{"$error":"#N/A"},{"$error":"#N/A"},null,null,null,null,null,null,null,null,null,"Van Dessel Dieter","Dieter Van Dessel"]
["Van Gehuchten Vincent","a","a","a","b","b","b","b","b","b","b","b","b","b","b","b","b","ff","b","b","b","b","b","b","b",null,null,0,0,0,3,20,0,0,0,null,"Van Gehuchten Vincent","","",{"$f":"_xlfn.LET( _xlpm.i, INDEX( $AP33:$BO33, 1, MAX( 1, MATCH( $AN$2, $B$4:$AA$4, 0 ))), IF( _xlpm.i = \"\", \"\", _xlpm.i ))","v":0},11,0,0,0,0,0,0,0,0,0,0,0,0,0,0,0,0,0,0,0,0,0,0,0,0,0,0,null,{"$f":"INDEX($AP33:$BO33,1,MAX(1,MATCH($AN$2,$B$4:$AA$4,0)))","v":0},-0.28999999999999998,-0.27,null,0,-0.28999999999999998,2.3211111111111111,null,0,-0.28999999999999998,2.3211111111111111,null,29,null,"","","",{"$f":"IF( CS33 = \"\", \"\", _xlfn.XLOOKUP( CS33, $A$302:$A$336, INDEX( $B$302:$AA$336, , $AM$1 ), \"\" ))","v":""},null,null,null,29,"Rani Beirinckx",2.3611111111111112,2,"(0)",0,null,"","Beirinckx Rani","",null,null,"","","","",null,null,null,null,null,null,null,null,null,null,"De Groof Maarten",null,"De Groof Maarten",{"$error":"#N/A"},{"$error":"#N/A"},null,null,null,null,null,null,null,null,null,"Van Gehuchten Vincent","Vincent Van Gehuchten"]
["Verdickt Stijn",1,"a",1,1,1,"b","b",1,"a",1,1,1,"ng",1,1,1,"ff",1,1,1,"a",1,1,"a",null,null,0,16,0,4,2,0,1,0,null,"Verdickt Stijn",53.770757020757017,16,{"$f":"_xlfn.LET( _xlpm.i, INDEX( $AP34:$BO34, 1, MAX( 1, MATCH( $AN$2, $B$4:$AA$4, 0 ))), IF( _xlpm.i = \"\", \"\", _xlpm.i ))","v":0},11,2.2222222222222223,0,1,8,0,0,0,3.0769230769230771,0,2.6666666666666665,8,3.75,0,1.4285714285714286,0,5.7142857142857144,0,7.1428571428571432,0,10.76923076923077,0,0,0,0,0,0,null,{"$f":"INDEX($AP34:$BO34,1,MAX(1,MATCH($AN$2,$B$4:$AA$4,0)))","v":0},-0.3,-0.28000000000000003,null,53.770757020757017,53.47075702075702,-0.01,null,0,53.47075702075702,-0.01,null,30,null,"","","",{"$f":"IF( CS34 = \"\", \"\", _xlfn.XLOOKUP( CS34, $A$302:$A$336, INDEX( $B$302:$AA$336, , $AM$1 ), \"\" ))","v":""},null,null,null,"","","","","","",null,"","","",null,null,"","","","",null,null,null,null,null,null,null,null,null,null,"Gielis Bernd",null,"Gielis Bernd",{"$error":"#N/A"},{"$error":"#N/A"},null,null,null,null,null,null,null,null,null,"Verdickt Stijn","Stijn Verdickt"]
["Verhellen Jorn","na","na","na",1,1,"a","b","b","a","a",1,1,"b","b",1,"a","ff","a","a","a","a","a","a","a",null,null,3,{"$f":"COUNTIF( B35:AA35, \"k\" ) + SUM( B35:AA35 )","v":5},{"$f":"IFERROR( AB35 / COUNT($B$4:$AA$4), \"\" )","v":0.125},{"$f":"COUNTIF( B35:AA35, \"a\" )","v":11},{"$f":"COUNTIF( B35:AA35, \"b\" )","v":4},{"$f":"COUNTIF( B35:AA35, \"s\" )","v":0},{"$f":"COUNTIF( B35:AA35, \"ng\" ) + COUNTIF( B35:AA35, \"na\" ) + COUNTIF( B35:AA35, \"p\" ) + COUNTIF( B35:AA35, \"t\" )","v":3},{"$f":"COUNTIF(B35:AA35,\"k\")","v":0},null,"Verhellen Jorn",{"$f":"IF(SUM(AP35:BO35)=0,\"\",SUM(AP35:BO35))","v":74.71826625386997},12,{"$f":"_xlfn.LET( _xlpm.i, INDEX( $AP35:$BO35, 1, MAX( 1, MATCH( $AN$2, $B$4:$AA$4, 0 ))), IF( _xlpm.i = \"\", \"\", _xlpm.i ))","v":0},11,0,0,0,18.666666666666668,18.823529411764707,0,0,0,0,0,9.3333333333333339,10,0,0,17.894736842105264,0,0,0,0,0,0,0,0,0,0,0,null,{"$f":"INDEX($AP35:$BO35,1,MAX(1,MATCH($AN$2,$B$4:$AA$4,0)))","v":0},-0.31,-0.28999999999999998,null,{"$f":"SUM(AP35:BO35)","v":74.71826625386997},{"$f":"BU35-CC35/100","v":74.408266253869968},-0.02,null,2,{"$f":"1000*BY35+BU35-CC35/100","v":2074.4082662538699},-0.02,null,31,null,"","","",{"$f":"IF( CS35 = \"\", \"\", _xlfn.XLOOKUP( CS35, $A$302:$A$336, INDEX( $B$302:$AA$336, , $AM$1 ), \"\" ))","v":""},null,null,null,"","","","","",{"$f":"IFERROR(IF(CN35=\"\",\"\",ABS(CN35/CP35)),0)","v":""},null,"","",null,null,null,{"$f":"IF(CZ35=\"\",\"\",CC35)","v":""},"","","",null,null,null,null,null,null,null,null,null,null,"Gielis Bernd / Hofmans Stijn",null,"Gielis Bernd","Hofmans Stijn",{"$error":"#N/A"},null,null,null,null,null,null,null,null,null,"Verhellen Jorn","Jorn Verhellen"]
["Verlooy Kaïn","a","a",1,1,1,"a",1,"a",1,1,"a",1,1,1,1,1,"ff",1,1,1,1,1,1,1,null,null,1,18,4.1666666666666664E-2,5,0,0,0,0,null,"Verlooy Kaïn",155.52707844271313,3,{"$f":"_xlfn.LET( _xlpm.i, INDEX( $AP36:$BO36, 1, MAX( 1, MATCH( $AN$2, $B$4:$AA$4, 0 ))), IF( _xlpm.i = \"\", \"\", _xlpm.i ))","v":15.714285714285714},3,0,0,10,4,9.4117647058823533,0,6.666666666666667,0,8.75,2.6666666666666665,0,20,7.6190476190476186,10,13.684210526315789,8.5714285714285712,0,7.1428571428571432,10.666666666666666,7.6923076923076925,12.941176470588236,15.714285714285714,0,0,0,0,null,{"$f":"INDEX($AP36:$BO36,1,MAX(1,MATCH($AN$2,$B$4:$AA$4,0)))","v":15.714285714285714},15.394285714285713,-0.3,null,155.52707844271313,{"$f":"BU36-CC36/100","v":155.20707844271314},-0.09,null,1,{"$f":"1000*BY36+BU36-CC36/100","v":1155.2070784427133},-0.09,null,32,null,"","","",{"$f":"IF( CS36 = \"\", \"\", _xlfn.XLOOKUP( CS36, $A$302:$A$336, INDEX( $B$302:$AA$336, , $AM$1 ), \"\" ))","v":""},null,null,null,"","","","","","",null,"","",{"$f":"IF(CZ36=\"\",\"\",INDEX($AK$5:$AK$40,MATCH(CA36,$BZ$5:$BZ$40,0)))","v":""},null,null,"","","","",null,null,null,null,null,null,null,null,null,null,"Coolsaet Joy / De Vinster Glenn",null,"Coolsaet Joy","De Vinster Glenn",{"$error":"#N/A"},null,null,null,null,null,null,null,null,null,"Verlooy Kaïn","Kaïn Verlooy"]
["Vermeylen Jason",1,1,"b","b","b","b","b","b",1,"b","b","b","b","b","b","b","ff",1,"a","a","a","a","a",1,null,null,1,5,4.1666666666666664E-2,5,13,0,0,{"$f":"COUNTIF(B37:AA37,\"k\")","v":0},null,"Vermeylen Jason",10.678571428571429,25,{"$f":"_xlfn.LET( _xlpm.i, INDEX( $AP37:$BO37, 1, MAX( 1, MATCH( $AN$2, $B$4:$AA$4, 0 ))), IF( _xlpm.i = \"\", \"\", _xlpm.i ))","v":0},11,6.666666666666667,1.3333333333333333,0,0,0,0,0,0,1.25,0,0,0,0,0,0,0,0,1.4285714285714286,0,0,0,0,0,0,0,0,null,{"$f":"INDEX($AP37:$BO37,1,MAX(1,MATCH($AN$2,$B$4:$AA$4,0)))","v":0},-0.33,-0.31,null,10.678571428571429,{"$f":"BU37-CC37/100","v":10.348571428571429},-0.25,null,0,{"$f":"1000*BY37+BU37-CC37/100","v":10.348571428571429},-0.25,null,33,null,"","","",{"$f":"IF( CS37 = \"\", \"\", _xlfn.XLOOKUP( CS37, $A$302:$A$336, INDEX( $B$302:$AA$336, , $AM$1 ), \"\" ))","v":""},null,null,null,"","","","","","",null,"","",{"$f":"IF(CZ37=\"\",\"\",INDEX($AK$5:$AK$40,MATCH(CA37,$BZ$5:$BZ$40,0)))","v":""},null,null,"","","","",null,null,null,null,null,null,null,null,null,null,"Van Dessel Dieter",null,"Van Dessel Dieter",{"$error":"#N/A"},{"$error":"#N/A"},null,null,null,null,null,null,null,null,null,"Vermeylen Jason","Jason Vermeylen"]
["Verrijdt Ryan","na","na","na","na","na","na","na","na","na","na","na","na","na","na",1,1,"ff","b","as","b",1,1,1,1,null,null,1,{"$f":"COUNTIF( B38:AA38, \"k\" ) + SUM( B38:AA38 )","v":6},{"$f":"IFERROR( AB38 / COUNT($B$4:$AA$4), \"\" )","v":4.1666666666666664E-2},{"$f":"COUNTIF( B38:AA38, \"a\" )","v":0},{"$f":"COUNTIF( B38:AA38, \"b\" )","v":2},{"$f":"COUNTIF( B38:AA38, \"s\" )","v":0},{"$f":"COUNTIF( B38:AA38, \"ng\" ) + COUNTIF( B38:AA38, \"na\" ) + COUNTIF( B38:AA38, \"p\" ) + COUNTIF( B38:AA38, \"t\" )","v":14},{"$f":"COUNTIF(B38:AA38,\"k\")","v":0},null,{"$f":"A38","v":"Verrijdt Ryan"},{"$f":"IF(SUM(AP38:BO38)=0,\"\",SUM(AP38:BO38))","v":15.811587793011942},24,{"$f":"_xlfn.LET( _xlpm.i, INDEX( $AP38:$BO38, 1, MAX( 1, MATCH( $AN$2, $B$4:$AA$4, 0 ))), IF( _xlpm.i = \"\", \"\", _xlpm.i ))","v":1.4285714285714286},10,0,0,0,0,0,0,0,0,0,0,0,0,0,0,6.3157894736842106,5.7142857142857144,0,0,0,0,2.3529411764705883,1.4285714285714286,0,0,0,0,null,{"$f":"INDEX($AP38:$BO38,1,MAX(1,MATCH($AN$2,$B$4:$AA$4,0)))","v":1.4285714285714286},{"$f":"BQ38-CC38/100","v":1.0885714285714285},-0.33,null,{"$f":"SUM(AP38:BO38)","v":15.811587793011942},{"$f":"BU38-CC38/100","v":15.471587793011942},-0.28999999999999998,null,0,{"$f":"1000*BY38+BU38-CC38/100","v":15.471587793011942},-0.28999999999999998,null,34,null,{"$f":"IF( CG38 = \"\", \"\", CC38 )","v":""},"","",{"$f":"IF( CS38 = \"\", \"\", _xlfn.XLOOKUP( CS38, $A$302:$A$336, INDEX( $B$302:$AA$336, , $AM$1 ), \"\" ))","v":""},null,null,null,{"$f":"IF( CN38 = \"\", \"\", CC38 )","v":""},"","","","",{"$f":"IFERROR(IF(CN38=\"\",\"\",ABS(CN38/CP38)),0)","v":""},null,"","",{"$f":"IF(CZ38=\"\",\"\",INDEX($AK$5:$AK$40,MATCH(CA38,$BZ$5:$BZ$40,0)))","v":""},null,null,{"$f":"IF(CZ38=\"\",\"\",CC38)","v":""},"","","",null,null,null,null,null,null,null,null,null,null,"Celis Ive",null,"Celis Ive",{"$error":"#N/A"},{"$error":"#N/A"},null,null,null,null,null,null,null,null,null,"Verrijdt Ryan","Ryan Verrijdt"]
["Own-goals/ff-goals",null,null,null,null,null,null,null,null,null,null,null,null,null,null,null,null,null,null,null,null,null,null,null,null,null,null,{"$f":"SUM( B134:AA134 )","v":1},null,4.1666666666666664E-2,0,0,0,0,0,null,{"$f":"A39","v":"Own-goals/ff-goals"},"","",{"$f":"_xlfn.LET( _xlpm.i, INDEX( $AP39:$BO39, 1, MAX( 1, MATCH( $AN$2, $B$4:$AA$4, 0 ))), IF( _xlpm.i = \"\", \"\", _xlpm.i ))","v":0},11,0,0,0,0,0,0,0,0,0,0,0,0,0,0,0,0,0,0,0,0,0,0,0,0,0,0,null,{"$f":"INDEX($AP39:$BO39,1,MAX(1,MATCH($AN$2,$B$4:$AA$4,0)))","v":0},-0.35,-0.35,null,{"$f":"SUM(AP39:BO39)","v":0},{"$f":"BU39-CC39/100","v":-0.35},-0.35,null,0,{"$f":"1000*BY39+BU39-CC39/100","v":-0.35},-0.35,null,35,null,"",{"$f":"_xlfn.XLOOKUP( CS39, $DZ$5:$DZ$39, $EA$5:$EA$39, \"\" )","v":""},"",{"$f":"IF( CS39 = \"\", \"\", _xlfn.XLOOKUP( CS39, $A$302:$A$336, INDEX( $B$302:$AA$336, , $AM$1 ), \"\" ))","v":""},null,null,null,"","","","","","",null,"","",{"$f":"IF(CZ39=\"\",\"\",INDEX($AK$5:$AK$40,MATCH(CA39,$BZ$5:$BZ$40,0)))","v":""},null,null,"","","","",null,null,null,null,null,null,null,null,null,null,"De Groof Steven",null,"De Groof Steven",{"$error":"#N/A"},{"$error":"#N/A"},null,null,null,null,null,null,null,null,null,"Own-goals/ff-goals","Own-goals/ff-goals"]
[null,null,null,null,null,null,null,null,null,null,null,null,null,null,null,null,null,null,null,null,null,null,null,null,null,null,null,null,null,null,null,null,null,null,null,null,null,null,null,null,null,null,null,null,null,null,null,null,null,null,null,null,null,null,null,null,null,null,null,null,null,null,null,null,null,null,null,null,null,null,null,null,null,null,null,null,null,null,null,null,null,null,null,null,null,null,null,null,null,null,null,null,null,null,null,null,null,null,null,null,null,null,null,null,null,null,null,null,null,null,null,null,null,null,null,"Verlooy Kaïn",null,"Verlooy Kaïn",{"$error":"#N/A"},{"$error":"#N/A"}]
["Legende:",null,null,null,null,null,null,null,null,null,null,null,null,null,null,null,null,null,null,null,null,null,null,null,null,null,null,null,null,null,null,null,null,null,null,null,null,null,null,null,null,null,null,null,null,null,null,null,null,null,null,null,null,null,null,null,null,null,null,null,null,null,null,null,null,null,null,null,null,null,null,null,null,null,null,null,null,null,null,null,null,null,null,null,null,null,null,null,null,null,null,null,null,null,null,null,null,null,null,null,null,null,null,null,null,null,null,null,null,null,null,null,null,null,null,"De Vinster Glenn",null,"De Vinster Glenn",{"$error":"#N/A"},{"$error":"#N/A"}]
[null,null,null,null,null,null,null,null,null,null,null,null,null,null,null,null,null,null,null,null,null,null,null,null,null,null,null,null,null,null,null,null,null,null,null,null,"Niet toegekend",{"$f":"IF(SUM(AP42:BO42)=0,\"\",SUM(AP42:BO42))","v":""},{"$f":"IF(AL42=\"\",\"\",RANK(AL42,AL$5:AL$42))","v":""},{"$f":"IF(INDEX($AP42:$BO42,1,MAX(1,COUNT($B$4:$AA$4)))=0,\"\",INDEX($AP42:$BO42,1,MAX(1,COUNT($B$4:$AA$4))))","v":""},{"$f":"IF(AN42=\"\",\"\",RANK(AN42,AN$5:AN$41))","v":""},null,null,null,null,null,null,null,null,null,null,null,null,null,null,null,null,null,null,null,null,null,null,null,null,null,null,null,null,null,null,null,null,null,null,null,null,null,null,null,null,null,null,null,null,null,null,null,null,null,null,null,null,null,null,null,null,null,null,null,null,null,null,null,null,null,null,null,null,null,null,null,null,null,null,"Van de Vondel Rob",null,"Van de Vondel Rob",{"$error":"#N/A"},{"$error":"#N/A"}]
["Uitleg en afkorting",null,null,null,null,null,null,null,null,null,null,null,null,null,null,null,null,null,null,null,null,null,null,null,null,null,null,null,null,null,null,null,null,null,null,null,"Som",null,null,null,null,{"$f":"SUM( AP5:AP42 )","v":100.00000000000003},100,100,100.00000000000001,100,100.00000000000001,100.00000000000001,100,100,100,99.999999999999986,100,100.00000000000001,100.00000000000001,100,99.999999999999986,0,99.999999999999986,99.999999999999986,100.00000000000001,100.00000000000001,99.999999999999986,0,0,0,0,null,null,null,null,null,null,null,null,null,null,null,null,null,null,null,null,null,null,null,null,null,null,null,null,null,null,null,null,null,null,null,null,null,null,null,null,null,null,null,null,null,null,null,null,null,null,null,null,"De Vinster Glenn",null,"De Vinster Glenn",{"$error":"#N/A"},{"$error":"#N/A"}]
["Thuiswedstrijd","T",null,"Aantal doelpunten","Getal (Goals)",null,null,null,null,null,null,null,null,null,null,null,null,null,null,null,null,null,null,null,null,null,null,null,null,null,null,null,null,null,null,null,"Aantal invullers",null,null,null,null,{"$f":"AP43 / 5","v":20.000000000000007},{"$f":"AQ43 / 5","v":20},20,20.000000000000004,20,20.000000000000004,20.000000000000004,20,{"$f":"AX43 / 5","v":20},20,19.999999999999996,20,20.000000000000004,20.000000000000004,20,19.999999999999996,0,19.999999999999996,19.999999999999996,20.000000000000004,20.000000000000004,19.999999999999996,0,0,0,0,null,null,null,null,null,null,null,null,null,null,null,null,null,null,null,null,null,null,null,null,null,null,null,null,null,null,null,null,null,null,null,null,null,null,null,null,null,null,null,null,null,null,null,null,null,null,null,null,"Coolsaet Joy",null,"Coolsaet Joy",{"$error":"#N/A"},{"$error":"#N/A"}]
["Uitwedstrijd","U",null,"Aantal assists","Getal (Assists)",null,null,null,null,null,null,null,null,null,null,null,null,null,null,null,null,null,null,null,null,null,null,null,null,null,null,null,null,null,null,null,"Winnaar(s)",null,null,null,null,{"$f":"IF( AP$43 = 0, \"\", _xlfn.TEXTJOIN( \" / \",TRUE,  _xlfn._xlws.FILTER( $AK$5:$AK$41, AP$5:AP$41 = LARGE( _xlfn.UNIQUE( AP$5:AP$41 ), 1 ))))","v":"Nyckees Wannes"},{"$f":"IF( AQ$43 = 0, \"\", _xlfn.TEXTJOIN( \" / \",TRUE,  _xlfn._xlws.FILTER( $AK$5:$AK$41, AQ$5:AQ$41 = LARGE( _xlfn.UNIQUE( AQ$5:AQ$41 ), 1 ))))","v":"De Vinster Glenn"},{"$f":"IF( AR$43 = 0, \"\", _xlfn.TEXTJOIN( \" / \",TRUE,  _xlfn._xlws.FILTER( $AK$5:$AK$41, AR$5:AR$41 = LARGE( _xlfn.UNIQUE( AR$5:AR$41 ), 1 ))))","v":"Delen Robbe"},{"$f":"IF( AS$43 = 0, \"\", _xlfn.TEXTJOIN( \" / \",TRUE,  _xlfn._xlws.FILTER( $AK$5:$AK$41, AS$5:AS$41 = LARGE( _xlfn.UNIQUE( AS$5:AS$41 ), 1 ))))","v":"Langenaeker Maarten"},{"$f":"IF( AT$43 = 0, \"\", _xlfn.TEXTJOIN( \" / \",TRUE,  _xlfn._xlws.FILTER( $AK$5:$AK$41, AT$5:AT$41 = LARGE( _xlfn.UNIQUE( AT$5:AT$41 ), 1 ))))","v":"De Vinster Glenn / Verhellen Jorn"},{"$f":"IF( AU$43 = 0, \"\", _xlfn.TEXTJOIN( \" / \",TRUE,  _xlfn._xlws.FILTER( $AK$5:$AK$41, AU$5:AU$41 = LARGE( _xlfn.UNIQUE( AU$5:AU$41 ), 1 ))))","v":"Gielis Bernd"},{"$f":"IF( AV$43 = 0, \"\", _xlfn.TEXTJOIN( \" / \",TRUE,  _xlfn._xlws.FILTER( $AK$5:$AK$41, AV$5:AV$41 = LARGE( _xlfn.UNIQUE( AV$5:AV$41 ), 1 ))))","v":"De Vinster Glenn"},{"$f":"IF( AW$43 = 0, \"\", _xlfn.TEXTJOIN( \" / \",TRUE,  _xlfn._xlws.FILTER( $AK$5:$AK$41, AW$5:AW$41 = LARGE( _xlfn.UNIQUE( AW$5:AW$41 ), 1 ))))","v":"Van Den Brande Brent"},{"$f":"IF( AX$43 = 0, \"\", _xlfn.TEXTJOIN( \" / \",TRUE,  _xlfn._xlws.FILTER( $AK$5:$AK$41, AX$5:AX$41 = LARGE( _xlfn.UNIQUE( AX$5:AX$41 ), 1 ))))","v":"Van Den Brande Brent"},{"$f":"IF( AY$43 = 0, \"\", _xlfn.TEXTJOIN( \" / \",TRUE,  _xlfn._xlws.FILTER( $AK$5:$AK$41, AY$5:AY$41 = LARGE( _xlfn.UNIQUE( AY$5:AY$41 ), 1 ))))","v":"De Vinster Glenn"},{"$f":"IF( AZ$43 = 0, \"\", _xlfn.TEXTJOIN( \" / \",TRUE,  _xlfn._xlws.FILTER( $AK$5:$AK$41, AZ$5:AZ$41 = LARGE( _xlfn.UNIQUE( AZ$5:AZ$41 ), 1 ))))","v":"Jordens Koen"},{"$f":"IF( BA$43 = 0, \"\", _xlfn.TEXTJOIN( \" / \",TRUE,  _xlfn._xlws.FILTER( $AK$5:$AK$41, BA$5:BA$41 = LARGE( _xlfn.UNIQUE( BA$5:BA$41 ), 1 ))))","v":"Verlooy Kaïn"},{"$f":"IF( BB$43 = 0, \"\", _xlfn.TEXTJOIN( \" / \",TRUE,  _xlfn._xlws.FILTER( $AK$5:$AK$41, BB$5:BB$41 = LARGE( _xlfn.UNIQUE( BB$5:BB$41 ), 1 ))))","v":"Hofmans Stijn"},{"$f":"IF( BC$43 = 0, \"\", _xlfn.TEXTJOIN( \" / \",TRUE,  _xlfn._xlws.FILTER( $AK$5:$AK$41, BC$5:BC$41 = LARGE( _xlfn.UNIQUE( BC$5:BC$41 ), 1 ))))","v":"De Vinster Glenn"},{"$f":"IF( BD$43 = 0, \"\", _xlfn.TEXTJOIN( \" / \",TRUE,  _xlfn._xlws.FILTER( $AK$5:$AK$41, BD$5:BD$41 = LARGE( _xlfn.UNIQUE( BD$5:BD$41 ), 1 ))))","v":"Hofmans Stijn / Verhellen Jorn"},{"$f":"IF( BE$43 = 0, \"\", _xlfn.TEXTJOIN( \" / \",TRUE,  _xlfn._xlws.FILTER( $AK$5:$AK$41, BE$5:BE$41 = LARGE( _xlfn.UNIQUE( BE$5:BE$41 ), 1 ))))","v":"Jordens Koen"},{"$f":"IF( BF$43 = 0, \"\", _xlfn.TEXTJOIN( \" / \",TRUE,  _xlfn._xlws.FILTER( $AK$5:$AK$41, BF$5:BF$41 = LARGE( _xlfn.UNIQUE( BF$5:BF$41 ), 1 ))))","v":""},{"$f":"IF( BG$43 = 0, \"\", _xlfn.TEXTJOIN( \" / \",TRUE,  _xlfn._xlws.FILTER( $AK$5:$AK$41, BG$5:BG$41 = LARGE( _xlfn.UNIQUE( BG$5:BG$41 ), 1 ))))","v":"De Vinster Glenn"},{"$f":"IF( BH$43 = 0, \"\", _xlfn.TEXTJOIN( \" / \",TRUE,  _xlfn._xlws.FILTER( $AK$5:$AK$41, BH$5:BH$41 = LARGE( _xlfn.UNIQUE( BH$5:BH$41 ), 1 ))))","v":"Van de Vondel Rob"},{"$f":"IF( BI$43 = 0, \"\", _xlfn.TEXTJOIN( \" / \",TRUE,  _xlfn._xlws.FILTER( $AK$5:$AK$41, BI$5:BI$41 = LARGE( _xlfn.UNIQUE( BI$5:BI$41 ), 1 ))))","v":"Hofmans Stijn"},{"$f":"IF( BJ$43 = 0, \"\", _xlfn.TEXTJOIN( \" / \",TRUE,  _xlfn._xlws.FILTER( $AK$5:$AK$41, BJ$5:BJ$41 = LARGE( _xlfn.UNIQUE( BJ$5:BJ$41 ), 1 ))))","v":"Hofmans Stijn"},{"$f":"IF( BK$43 = 0, \"\", _xlfn.TEXTJOIN( \" / \",TRUE,  _xlfn._xlws.FILTER( $AK$5:$AK$41, BK$5:BK$41 = LARGE( _xlfn.UNIQUE( BK$5:BK$41 ), 1 ))))","v":"De Vinster Glenn / Hofmans Stijn"},{"$f":"IF( BL$43 = 0, \"\", _xlfn.TEXTJOIN( \" / \",TRUE,  _xlfn._xlws.FILTER( $AK$5:$AK$41, BL$5:BL$41 = LARGE( _xlfn.UNIQUE( BL$5:BL$41 ), 1 ))))","v":""},{"$f":"IF( BM$43 = 0, \"\", _xlfn.TEXTJOIN( \" / \",TRUE,  _xlfn._xlws.FILTER( $AK$5:$AK$41, BM$5:BM$41 = LARGE( _xlfn.UNIQUE( BM$5:BM$41 ), 1 ))))","v":""},{"$f":"IF( BN$43 = 0, \"\", _xlfn.TEXTJOIN( \" / \",TRUE,  _xlfn._xlws.FILTER( $AK$5:$AK$41, BN$5:BN$41 = LARGE( _xlfn.UNIQUE( BN$5:BN$41 ), 1 ))))","v":""},{"$f":"IF( BO$43 = 0, \"\", _xlfn.TEXTJOIN( \" / \",TRUE,  _xlfn._xlws.FILTER( $AK$5:$AK$41, BO$5:BO$41 = LARGE( _xlfn.UNIQUE( BO$5:BO$41 ), 1 ))))","v":""},null,null,null,null,null,null,null,null,null,null,null,null,null,null,null,null,null,null,null,null,null,null,null,null,null,null,null,null,null,null,null,null,null,null,null,null,null,null,null,null,null,null,null,null,null,null,null,null,"Elst Pieter / Verlooy Kaïn",null,"Elst Pieter","Verlooy Kaïn",{"$error":"#N/A"}]
["Aanwezige speler","1 (Aanwezigheden)",null,"Strafschopdoelpunt","onderlijnd (Goals)",null,null,null,null,null,null,null,null,null,null,null,null,null,null,null,null,null,null,null,null,null,null,null,null,null,null,null,null,null,null,null,"Plaats 2",null,null,null,null,{"$f":"IF( AP$43 = 0, \"\", _xlfn.TEXTJOIN( \" / \",TRUE,  _xlfn._xlws.FILTER( $AK$5:$AK$41, AP$5:AP$41 = LARGE( _xlfn.UNIQUE( AP$5:AP$41 ), 2 ))))","v":"Hofmans Stijn"},{"$f":"IF( AQ$43 = 0, \"\", _xlfn.TEXTJOIN( \" / \",TRUE,  _xlfn._xlws.FILTER( $AK$5:$AK$41, AQ$5:AQ$41 = LARGE( _xlfn.UNIQUE( AQ$5:AQ$41 ), 2 ))))","v":"De Groof Maarten / Elst Pieter"},{"$f":"IF( AR$43 = 0, \"\", _xlfn.TEXTJOIN( \" / \",TRUE,  _xlfn._xlws.FILTER( $AK$5:$AK$41, AR$5:AR$41 = LARGE( _xlfn.UNIQUE( AR$5:AR$41 ), 2 ))))","v":"De Groof Maarten"},{"$f":"IF( AS$43 = 0, \"\", _xlfn.TEXTJOIN( \" / \",TRUE,  _xlfn._xlws.FILTER( $AK$5:$AK$41, AS$5:AS$41 = LARGE( _xlfn.UNIQUE( AS$5:AS$41 ), 2 ))))","v":"Verhellen Jorn"},{"$f":"IF( AT$43 = 0, \"\", _xlfn.TEXTJOIN( \" / \",TRUE,  _xlfn._xlws.FILTER( $AK$5:$AK$41, AT$5:AT$41 = LARGE( _xlfn.UNIQUE( AT$5:AT$41 ), 2 ))))","v":"Hofmans Stijn"},{"$f":"IF( AU$43 = 0, \"\", _xlfn.TEXTJOIN( \" / \",TRUE,  _xlfn._xlws.FILTER( $AK$5:$AK$41, AU$5:AU$41 = LARGE( _xlfn.UNIQUE( AU$5:AU$41 ), 2 ))))","v":"Celis Ive / De Groof Steven"},{"$f":"IF( AV$43 = 0, \"\", _xlfn.TEXTJOIN( \" / \",TRUE,  _xlfn._xlws.FILTER( $AK$5:$AK$41, AV$5:AV$41 = LARGE( _xlfn.UNIQUE( AV$5:AV$41 ), 2 ))))","v":"Gielis Bernd"},{"$f":"IF( AW$43 = 0, \"\", _xlfn.TEXTJOIN( \" / \",TRUE,  _xlfn._xlws.FILTER( $AK$5:$AK$41, AW$5:AW$41 = LARGE( _xlfn.UNIQUE( AW$5:AW$41 ), 2 ))))","v":"De Groof Maarten"},{"$f":"IF( AX$43 = 0, \"\", _xlfn.TEXTJOIN( \" / \",TRUE,  _xlfn._xlws.FILTER( $AK$5:$AK$41, AX$5:AX$41 = LARGE( _xlfn.UNIQUE( AX$5:AX$41 ), 2 ))))","v":"Gielis Bernd"},{"$f":"IF( AY$43 = 0, \"\", _xlfn.TEXTJOIN( \" / \",TRUE,  _xlfn._xlws.FILTER( $AK$5:$AK$41, AY$5:AY$41 = LARGE( _xlfn.UNIQUE( AY$5:AY$41 ), 2 ))))","v":"Gielis Bernd / Hofmans Stijn"},{"$f":"IF( AZ$43 = 0, \"\", _xlfn.TEXTJOIN( \" / \",TRUE,  _xlfn._xlws.FILTER( $AK$5:$AK$41, AZ$5:AZ$41 = LARGE( _xlfn.UNIQUE( AZ$5:AZ$41 ), 2 ))))","v":"Coolsaet Joy / De Vinster Glenn"},{"$f":"IF( BA$43 = 0, \"\", _xlfn.TEXTJOIN( \" / \",TRUE,  _xlfn._xlws.FILTER( $AK$5:$AK$41, BA$5:BA$41 = LARGE( _xlfn.UNIQUE( BA$5:BA$41 ), 2 ))))","v":"Van Dessel Dieter"},{"$f":"IF( BB$43 = 0, \"\", _xlfn.TEXTJOIN( \" / \",TRUE,  _xlfn._xlws.FILTER( $AK$5:$AK$41, BB$5:BB$41 = LARGE( _xlfn.UNIQUE( BB$5:BB$41 ), 2 ))))","v":"Celis Ive"},{"$f":"IF( BC$43 = 0, \"\", _xlfn.TEXTJOIN( \" / \",TRUE,  _xlfn._xlws.FILTER( $AK$5:$AK$41, BC$5:BC$41 = LARGE( _xlfn.UNIQUE( BC$5:BC$41 ), 2 ))))","v":"De Groof Steven"},{"$f":"IF( BD$43 = 0, \"\", _xlfn.TEXTJOIN( \" / \",TRUE,  _xlfn._xlws.FILTER( $AK$5:$AK$41, BD$5:BD$41 = LARGE( _xlfn.UNIQUE( BD$5:BD$41 ), 2 ))))","v":"Verlooy Kaïn"},{"$f":"IF( BE$43 = 0, \"\", _xlfn.TEXTJOIN( \" / \",TRUE,  _xlfn._xlws.FILTER( $AK$5:$AK$41, BE$5:BE$41 = LARGE( _xlfn.UNIQUE( BE$5:BE$41 ), 2 ))))","v":"De Vinster Glenn"},{"$f":"IF( BF$43 = 0, \"\", _xlfn.TEXTJOIN( \" / \",TRUE,  _xlfn._xlws.FILTER( $AK$5:$AK$41, BF$5:BF$41 = LARGE( _xlfn.UNIQUE( BF$5:BF$41 ), 2 ))))","v":""},{"$f":"IF( BG$43 = 0, \"\", _xlfn.TEXTJOIN( \" / \",TRUE,  _xlfn._xlws.FILTER( $AK$5:$AK$41, BG$5:BG$41 = LARGE( _xlfn.UNIQUE( BG$5:BG$41 ), 2 ))))","v":"Van de Vondel Rob"},{"$f":"IF( BH$43 = 0, \"\", _xlfn.TEXTJOIN( \" / \",TRUE,  _xlfn._xlws.FILTER( $AK$5:$AK$41, BH$5:BH$41 = LARGE( _xlfn.UNIQUE( BH$5:BH$41 ), 2 ))))","v":"De Vinster Glenn"},{"$f":"IF( BI$43 = 0, \"\", _xlfn.TEXTJOIN( \" / \",TRUE,  _xlfn._xlws.FILTER( $AK$5:$AK$41, BI$5:BI$41 = LARGE( _xlfn.UNIQUE( BI$5:BI$41 ), 2 ))))","v":"Coolsaet Joy"},{"$f":"IF( BJ$43 = 0, \"\", _xlfn.TEXTJOIN( \" / \",TRUE,  _xlfn._xlws.FILTER( $AK$5:$AK$41, BJ$5:BJ$41 = LARGE( _xlfn.UNIQUE( BJ$5:BJ$41 ), 2 ))))","v":"Elst Pieter / Verlooy Kaïn"},{"$f":"IF( BK$43 = 0, \"\", _xlfn.TEXTJOIN( \" / \",TRUE,  _xlfn._xlws.FILTER( $AK$5:$AK$41, BK$5:BK$41 = LARGE( _xlfn.UNIQUE( BK$5:BK$41 ), 2 ))))","v":"Langenaeker Maarten / Verlooy Kaïn"},{"$f":"IF( BL$43 = 0, \"\", _xlfn.TEXTJOIN( \" / \",TRUE,  _xlfn._xlws.FILTER( $AK$5:$AK$41, BL$5:BL$41 = LARGE( _xlfn.UNIQUE( BL$5:BL$41 ), 2 ))))","v":""},{"$f":"IF( BM$43 = 0, \"\", _xlfn.TEXTJOIN( \" / \",TRUE,  _xlfn._xlws.FILTER( $AK$5:$AK$41, BM$5:BM$41 = LARGE( _xlfn.UNIQUE( BM$5:BM$41 ), 2 ))))","v":""},{"$f":"IF( BN$43 = 0, \"\", _xlfn.TEXTJOIN( \" / \",TRUE,  _xlfn._xlws.FILTER( $AK$5:$AK$41, BN$5:BN$41 = LARGE( _xlfn.UNIQUE( BN$5:BN$41 ), 2 ))))","v":""},{"$f":"IF( BO$43 = 0, \"\", _xlfn.TEXTJOIN( \" / \",TRUE,  _xlfn._xlws.FILTER( $AK$5:$AK$41, BO$5:BO$41 = LARGE( _xlfn.UNIQUE( BO$5:BO$41 ), 2 ))))","v":""},null,null,null,null,null,null,null,null,null,null,null,null,null,null,null,null,null,null,null,null,null,null,null,null,null,null,null,null,null,null,null,null,null,null,null,null,null,null,null,null,null,null,null,null,null,null,null,null,"Langenaeker Maarten / Verlooy Kaïn",null,"Langenaeker Maarten","Verlooy Kaïn",{"$error":"#N/A"}]
["Afwezige speler/supporter","a",null,"Niet van toepassing","(blanco)",null,null,null,null,null,null,null,null,null,null,null,null,null,null,null,null,null,null,null,null,null,null,null,null,null,null,null,null,null,null,null,"Plaats 3",null,null,null,null,{"$f":"IF( AP$43 = 0, \"\", _xlfn.TEXTJOIN( \" / \",TRUE,  _xlfn._xlws.FILTER( $AK$5:$AK$41, AP$5:AP$41 = LARGE( _xlfn.UNIQUE( AP$5:AP$41 ), 3 ))))","v":"Langenaeker Maarten"},{"$f":"IF( AQ$43 = 0, \"\", _xlfn.TEXTJOIN( \" / \",TRUE,  _xlfn._xlws.FILTER( $AK$5:$AK$41, AQ$5:AQ$41 = LARGE( _xlfn.UNIQUE( AQ$5:AQ$41 ), 3 ))))","v":"Jordens Koen"},{"$f":"IF( AR$43 = 0, \"\", _xlfn.TEXTJOIN( \" / \",TRUE,  _xlfn._xlws.FILTER( $AK$5:$AK$41, AR$5:AR$41 = LARGE( _xlfn.UNIQUE( AR$5:AR$41 ), 3 ))))","v":"Langenaeker Maarten"},{"$f":"IF( AS$43 = 0, \"\", _xlfn.TEXTJOIN( \" / \",TRUE,  _xlfn._xlws.FILTER( $AK$5:$AK$41, AS$5:AS$41 = LARGE( _xlfn.UNIQUE( AS$5:AS$41 ), 3 ))))","v":"Nyckees Wannes"},{"$f":"IF( AT$43 = 0, \"\", _xlfn.TEXTJOIN( \" / \",TRUE,  _xlfn._xlws.FILTER( $AK$5:$AK$41, AT$5:AT$41 = LARGE( _xlfn.UNIQUE( AT$5:AT$41 ), 3 ))))","v":"Celis Ive"},{"$f":"IF( AU$43 = 0, \"\", _xlfn.TEXTJOIN( \" / \",TRUE,  _xlfn._xlws.FILTER( $AK$5:$AK$41, AU$5:AU$41 = LARGE( _xlfn.UNIQUE( AU$5:AU$41 ), 3 ))))","v":"Coolsaet Joy / Langenaeker Maarten"},{"$f":"IF( AV$43 = 0, \"\", _xlfn.TEXTJOIN( \" / \",TRUE,  _xlfn._xlws.FILTER( $AK$5:$AK$41, AV$5:AV$41 = LARGE( _xlfn.UNIQUE( AV$5:AV$41 ), 3 ))))","v":"Van Dessel Dieter"},{"$f":"IF( AW$43 = 0, \"\", _xlfn.TEXTJOIN( \" / \",TRUE,  _xlfn._xlws.FILTER( $AK$5:$AK$41, AW$5:AW$41 = LARGE( _xlfn.UNIQUE( AW$5:AW$41 ), 3 ))))","v":"Elst Pieter / Van Dessel Dieter"},{"$f":"IF( AX$43 = 0, \"\", _xlfn.TEXTJOIN( \" / \",TRUE,  _xlfn._xlws.FILTER( $AK$5:$AK$41, AX$5:AX$41 = LARGE( _xlfn.UNIQUE( AX$5:AX$41 ), 3 ))))","v":"De Vinster Glenn / Stevens Siebe"},{"$f":"IF( AY$43 = 0, \"\", _xlfn.TEXTJOIN( \" / \",TRUE,  _xlfn._xlws.FILTER( $AK$5:$AK$41, AY$5:AY$41 = LARGE( _xlfn.UNIQUE( AY$5:AY$41 ), 3 ))))","v":"Langenaeker Maarten"},{"$f":"IF( AZ$43 = 0, \"\", _xlfn.TEXTJOIN( \" / \",TRUE,  _xlfn._xlws.FILTER( $AK$5:$AK$41, AZ$5:AZ$41 = LARGE( _xlfn.UNIQUE( AZ$5:AZ$41 ), 3 ))))","v":"De Groof Maarten / Verhellen Jorn"},{"$f":"IF( BA$43 = 0, \"\", _xlfn.TEXTJOIN( \" / \",TRUE,  _xlfn._xlws.FILTER( $AK$5:$AK$41, BA$5:BA$41 = LARGE( _xlfn.UNIQUE( BA$5:BA$41 ), 3 ))))","v":"Coolsaet Joy / Verhellen Jorn"},{"$f":"IF( BB$43 = 0, \"\", _xlfn.TEXTJOIN( \" / \",TRUE,  _xlfn._xlws.FILTER( $AK$5:$AK$41, BB$5:BB$41 = LARGE( _xlfn.UNIQUE( BB$5:BB$41 ), 3 ))))","v":"De Vinster Glenn"},{"$f":"IF( BC$43 = 0, \"\", _xlfn.TEXTJOIN( \" / \",TRUE,  _xlfn._xlws.FILTER( $AK$5:$AK$41, BC$5:BC$41 = LARGE( _xlfn.UNIQUE( BC$5:BC$41 ), 3 ))))","v":"Jordens Koen"},{"$f":"IF( BD$43 = 0, \"\", _xlfn.TEXTJOIN( \" / \",TRUE,  _xlfn._xlws.FILTER( $AK$5:$AK$41, BD$5:BD$41 = LARGE( _xlfn.UNIQUE( BD$5:BD$41 ), 3 ))))","v":"Jordens Koen"},{"$f":"IF( BE$43 = 0, \"\", _xlfn.TEXTJOIN( \" / \",TRUE,  _xlfn._xlws.FILTER( $AK$5:$AK$41, BE$5:BE$41 = LARGE( _xlfn.UNIQUE( BE$5:BE$41 ), 3 ))))","v":"Gielis Bernd"},{"$f":"IF( BF$43 = 0, \"\", _xlfn.TEXTJOIN( \" / \",TRUE,  _xlfn._xlws.FILTER( $AK$5:$AK$41, BF$5:BF$41 = LARGE( _xlfn.UNIQUE( BF$5:BF$41 ), 3 ))))","v":""},{"$f":"IF( BG$43 = 0, \"\", _xlfn.TEXTJOIN( \" / \",TRUE,  _xlfn._xlws.FILTER( $AK$5:$AK$41, BG$5:BG$41 = LARGE( _xlfn.UNIQUE( BG$5:BG$41 ), 3 ))))","v":"Langenaeker Maarten"},{"$f":"IF( BH$43 = 0, \"\", _xlfn.TEXTJOIN( \" / \",TRUE,  _xlfn._xlws.FILTER( $AK$5:$AK$41, BH$5:BH$41 = LARGE( _xlfn.UNIQUE( BH$5:BH$41 ), 3 ))))","v":"Langenaeker Maarten"},{"$f":"IF( BI$43 = 0, \"\", _xlfn.TEXTJOIN( \" / \",TRUE,  _xlfn._xlws.FILTER( $AK$5:$AK$41, BI$5:BI$41 = LARGE( _xlfn.UNIQUE( BI$5:BI$41 ), 3 ))))","v":"Jordens Koen"},{"$f":"IF( BJ$43 = 0, \"\", _xlfn.TEXTJOIN( \" / \",TRUE,  _xlfn._xlws.FILTER( $AK$5:$AK$41, BJ$5:BJ$41 = LARGE( _xlfn.UNIQUE( BJ$5:BJ$41 ), 3 ))))","v":"De Groof Maarten / De Groof Steven / Jordens Koen"},{"$f":"IF( BK$43 = 0, \"\", _xlfn.TEXTJOIN( \" / \",TRUE,  _xlfn._xlws.FILTER( $AK$5:$AK$41, BK$5:BK$41 = LARGE( _xlfn.UNIQUE( BK$5:BK$41 ), 3 ))))","v":"Beirinckx Wout"},{"$f":"IF( BL$43 = 0, \"\", _xlfn.TEXTJOIN( \" / \",TRUE,  _xlfn._xlws.FILTER( $AK$5:$AK$41, BL$5:BL$41 = LARGE( _xlfn.UNIQUE( BL$5:BL$41 ), 3 ))))","v":""},{"$f":"IF( BM$43 = 0, \"\", _xlfn.TEXTJOIN( \" / \",TRUE,  _xlfn._xlws.FILTER( $AK$5:$AK$41, BM$5:BM$41 = LARGE( _xlfn.UNIQUE( BM$5:BM$41 ), 3 ))))","v":""},{"$f":"IF( BN$43 = 0, \"\", _xlfn.TEXTJOIN( \" / \",TRUE,  _xlfn._xlws.FILTER( $AK$5:$AK$41, BN$5:BN$41 = LARGE( _xlfn.UNIQUE( BN$5:BN$41 ), 3 ))))","v":""},{"$f":"IF( BO$43 = 0, \"\", _xlfn.TEXTJOIN( \" / \",TRUE,  _xlfn._xlws.FILTER( $AK$5:$AK$41, BO$5:BO$41 = LARGE( _xlfn.UNIQUE( BO$5:BO$41 ), 3 ))))","v":""},null,null,null,null,null,null,null,null,null,null,null,null,null,null,null,null,null,null,null,null,null,null,null,null,null,null,null,null,null,null,null,null,null,null,null,null,null,null,null,null,null,null,null,null,null,null,null,null,"Langenaeker Maarten",null,"Langenaeker Maarten",{"$error":"#N/A"},{"$error":"#N/A"}]
["Aanwezige supporter","as",null,"Gele kaart",null,null,null,null,null,null,null,null,null,null,null,null,null,null,null,null,null,null,null,null,null,null,null,null,null,null,null,null,null,null,null,null,null,null,null,null,null,null,null,null,null,null,null,null,null,null,null,null,null,null,null,null,null,null,null,null,null,null,null,null,null,null,null,null,null,null,null,null,null,null,null,null,null,null,null,null,null,null,null,null,null,null,null,null,null,null,null,null,null,null,null,null,null,null,null,null,null,null,null,null,null,null,null,null,null,null,null,null,null,null,null,"Jordens Koen",null,"Jordens Koen",{"$error":"#N/A"},{"$error":"#N/A"}]
["Blessure","b",null,"Rechtstreekse rode kaart",null,null,null,null,null,null,null,null,null,null,null,null,null,null,null,null,null,null,null,null,null,null,null,null,null,null,null,null,null,null,null,null,"Aantal spelers met punten",null,null,null,null,{"$f":"COUNTIF(AP$5:AP$39,\">0\")","v":14},13,16,10,10,11,12,12,14,12,12,12,14,13,13,12,0,14,11,11,12,10,0,0,0,0,null,null,null,null,null,null,null,null,null,null,null,null,null,null,null,null,null,null,null,null,null,null,null,null,null,null,null,null,null,null,null,null,null,null,null,null,null,null,null,null,null,null,null,null,null,null,null,null,"Langenaeker Maarten",null,"Langenaeker Maarten",{"$error":"#N/A"},{"$error":"#N/A"}]
["Keeper","k",null,"2 gele kaarten en dus rode kaart",null,null,null,null,null,null,null,null,null,null,null,null,null,null,null,null,null,null,null,null,null,null,null,null,null,null,null,null,null,null,null,null,null,null,null,null,null,null,null,null,null,null,null,null,null,null,null,null,null,null,null,null,null,null,null,null,null,null,null,null,null,null,null,null,null,null,null,null,null,null,null,null,null,null,null,null,null,null,null,null,null,null,null,null,null,null,null,null,null,null,null,null,null,null,null,null,null,null,null,null,null,null,null,null,null,null,null,null,null,null,null,"Nyckees Wannes",null,"Nyckees Wannes",{"$error":"#N/A"},{"$error":"#N/A"}]
["Niet aangesloten","na",null,"Gele kaart en nadien rechtstreekse rode kaart",null,null,null,null,null,null,null,null,null,null,null,null,null,null,null,null,null,null,null,null,null,null,null,null,null,null,null,null,null,null,null,null,null,null,null,null,null,null,null,null,null,null,null,null,null,null,null,null,null,null,null,null,null,null,null,null,null,null,null,null,null,null,null,null,null,null,null,null,null,null,null,null,null,null,null,null,null,null,null,null,null,null,null,null,null,null,null,null,null,null,null,null,null,null,null,null,null,null,null,null,null,null,null,null,null,null,null,null,null,null,null,"Celis Ive",null,"Celis Ive",{"$error":"#N/A"},{"$error":"#N/A"}]
["Niet gespeeld","ng",null,"Opmerking indien strafschopdoelpunt en 1 of meer extra doelpunten",null,null,null,null,null,null,null,null,null,null,null,null,null,null,null,null,null,null,null,null,null,null,null,null,null,null,null,null,null,null,null,null,null,null,null,null,null,null,null,null,null,null,null,null,null,null,null,null,null,null,null,null,null,null,null,null,null,null,null,null,null,null,null,null,null,null,null,null,null,null,null,null,null,null,null,null,null,null,null,null,null,null,null,null,null,null,null,null,null,null,null,null,null,null,null,null,null,null,null,null,null,null,null,null,null,null,null,null,null,null,null,"Coolsaet Joy / Langenaeker Maarten",null,"Coolsaet Joy","Langenaeker Maarten",{"$error":"#N/A"}]
["Ploegverantwoordelijke","p",null,null,null,null,null,null,null,null,null,null,null,null,null,null,null,null,null,null,null,null,null,null,null,null,null,null,null,null,null,null,null,null,null,null,null,null,null,null,null,null,null,null,null,null,null,null,null,null,null,null,null,null,null,null,null,null,null,null,null,null,null,null,null,null,null,null,null,null,null,null,null,null,null,null,null,null,null,null,null,null,null,null,null,null,null,null,null,null,null,null,null,null,null,null,null,null,null,null,null,null,null,null,null,null,null,null,null,null,null,null,null,null,null,"Van Dessel Dieter",null,"Van Dessel Dieter",{"$error":"#N/A"},{"$error":"#N/A"}]
["Schorsing","s",null,"Aantal forfaitnederlagen",0,null,null,null,null,null,null,null,null,null,null,null,null,null,null,null,null,null,null,null,null,null,null,null,null,null,null,null,null,null,null,null,null,null,null,null,null,null,null,null,null,null,null,null,null,null,null,null,null,null,null,null,null,null,null,null,null,null,null,null,null,null,null,null,null,null,null,null,null,null,null,null,null,null,null,null,null,null,null,null,null,null,null,null,null,null,null,null,null,null,null,null,null,null,null,null,null,null,null,null,null,null,null,null,null,null,null,null,null,null,null,"Elst Pieter / Van Dessel Dieter",null,"Elst Pieter","Van Dessel Dieter",{"$error":"#N/A"}]
["Trainer","t",null,null,null,null,null,null,null,null,null,null,null,null,null,null,null,null,null,null,null,null,null,null,null,null,null,null,null,null,null,null,null,null,null,null,null,null,null,null,null,null,null,null,null,null,null,null,null,null,null,null,null,null,null,null,null,null,null,null,null,null,null,null,null,null,null,null,null,null,null,null,null,null,null,null,null,null,null,null,null,null,null,null,null,null,null,null,null,null,null,null,null,null,null,null,null,null,null,null,null,null,null,null,null,null,null,null,null,null,null,null,null,null,null,"De Vinster Glenn / Stevens Siebe",null,"De Vinster Glenn","Stevens Siebe",{"$error":"#N/A"}]
[null,null,null,null,null,null,null,null,null,null,null,null,null,null,null,null,null,null,null,null,null,null,null,null,null,null,null,null,null,null,null,null,null,null,null,null,null,null,null,null,null,null,null,null,null,null,null,null,null,null,null,null,null,null,null,null,null,null,null,null,null,null,null,null,null,null,null,null,null,null,null,null,null,null,null,null,null,null,null,null,null,null,null,null,null,null,null,null,null,null,null,null,null,null,null,null,null,null,null,null,null,null,null,null,null,null,null,null,null,null,null,null,null,null,null,"Langenaeker Maarten",null,"Langenaeker Maarten",{"$error":"#N/A"},{"$error":"#N/A"}]
[null,null,null,null,null,null,null,null,null,null,null,null,null,null,null,null,null,null,null,null,null,null,null,null,null,null,null,null,null,null,null,null,null,null,null,null,null,null,null,null,null,null,null,null,null,null,null,null,null,null,null,null,null,null,null,null,null,null,null,null,null,null,null,null,null,null,null,null,null,null,null,null,null,null,null,null,null,null,null,null,null,null,null,null,null,null,null,null,null,null,null,null,null,null,null,null,null,null,null,null,null,null,null,null,null,null,null,null,null,null,null,null,null,null,null,"De Groof Maarten / Verhellen Jorn",null,"De Groof Maarten","Verhellen Jorn",{"$error":"#N/A"}]
[null,null,null,null,null,null,null,null,null,null,null,null,null,null,null,null,null,null,null,null,null,null,null,null,null,null,null,null,null,null,null,null,null,null,null,null,null,null,null,null,null,null,null,null,null,null,null,null,null,null,null,null,null,null,null,null,null,null,null,null,null,null,null,null,null,null,null,null,null,null,null,null,null,null,null,null,null,null,null,null,null,null,null,null,null,null,null,null,null,null,null,null,null,null,null,null,null,null,null,null,null,null,null,null,null,null,null,null,null,null,null,null,null,null,null,"Coolsaet Joy / Verhellen Jorn",null,"Coolsaet Joy","Verhellen Jorn",{"$error":"#N/A"}]
[null,null,null,null,null,null,null,null,null,null,null,null,null,null,null,null,null,null,null,null,null,null,null,null,null,null,null,null,null,null,null,null,null,null,null,null,null,null,null,null,null,null,null,null,null,null,null,null,null,null,null,null,null,null,null,null,null,null,null,null,null,null,null,null,null,null,null,null,null,null,null,null,null,null,null,null,null,null,null,null,null,null,null,null,null,null,null,null,null,null,null,null,null,null,null,null,null,null,null,null,null,null,null,null,null,null,null,null,null,null,null,null,null,null,null,"De Vinster Glenn",null,"De Vinster Glenn",{"$error":"#N/A"},{"$error":"#N/A"}]
[null,null,null,null,null,null,null,null,null,null,null,null,null,null,null,null,null,null,null,null,null,null,null,null,null,null,null,null,null,null,null,null,null,null,null,null,null,null,null,null,null,null,null,null,null,null,null,null,null,null,null,null,null,null,null,null,null,null,null,null,null,null,null,null,null,null,null,null,null,null,null,null,null,null,null,null,null,null,null,null,null,null,null,null,null,null,null,null,null,null,null,null,null,null,null,null,null,null,null,null,null,null,null,null,null,null,null,null,null,null,null,null,null,null,null,"Jordens Koen",null,"Jordens Koen",{"$error":"#N/A"},{"$error":"#N/A"}]
[null,null,null,null,null,null,null,null,null,null,null,null,null,null,null,null,null,null,null,null,null,null,null,null,null,null,null,null,null,null,null,null,null,null,null,null,null,null,null,null,null,null,null,null,null,null,null,null,null,null,null,null,null,null,null,null,null,null,null,null,null,null,null,null,null,null,null,null,null,null,null,null,null,null,null,null,null,null,null,null,null,null,null,null,null,null,null,null,null,null,null,null,null,null,null,null,null,null,null,null,null,null,null,null,null,null,null,null,null,null,null,null,null,null,null,"Jordens Koen",null,"Jordens Koen",{"$error":"#N/A"},{"$error":"#N/A"}]
[null,null,null,null,null,null,null,null,null,null,null,null,null,null,null,null,null,null,null,null,null,null,null,null,null,null,null,null,null,null,null,null,null,null,null,null,null,null,null,null,null,null,null,null,null,null,null,null,null,null,null,null,null,null,null,null,null,null,null,null,null,null,null,null,null,null,null,null,null,null,null,null,null,null,null,null,null,null,null,null,null,null,null,null,null,null,null,null,null,null,null,null,null,null,null,null,null,null,null,null,null,null,null,null,null,null,null,null,null,null,null,null,null,null,null,"Gielis Bernd",null,"Gielis Bernd",{"$error":"#N/A"},{"$error":"#N/A"}]
[null,null,null,null,null,null,null,null,null,null,null,null,null,null,null,null,null,null,null,null,null,null,null,null,null,null,null,null,null,null,null,null,null,null,null,null,null,null,null,null,null,null,null,null,null,null,null,null,null,null,null,null,null,null,null,null,null,null,null,null,null,null,null,null,null,null,null,null,null,null,null,null,null,null,null,null,null,null,null,null,null,null,null,null,null,null,null,null,null,null,null,null,null,null,null,null,null,null,null,null,null,null,null,null,null,null,null,null,null,null,null,null,null,null,null,"Langenaeker Maarten",null,"Langenaeker Maarten",{"$error":"#N/A"},{"$error":"#N/A"}]
[null,null,null,null,null,null,null,null,null,null,null,null,null,null,null,null,null,null,null,null,null,null,null,null,null,null,null,null,null,null,null,null,null,null,null,null,null,null,null,null,null,null,null,null,null,null,null,null,null,null,null,null,null,null,null,null,null,null,null,null,null,null,null,null,null,null,null,null,null,null,null,null,null,null,null,null,null,null,null,null,null,null,null,null,null,null,null,null,null,null,null,null,null,null,null,null,null,null,null,null,null,null,null,null,null,null,null,null,null,null,null,null,null,null,null,"Langenaeker Maarten",null,"Langenaeker Maarten",{"$error":"#N/A"},{"$error":"#N/A"}]
[null,null,null,null,null,null,null,null,null,null,null,null,null,null,null,null,null,null,null,null,null,null,null,null,null,null,null,null,null,null,null,null,null,null,null,null,null,null,null,null,null,null,null,null,null,null,null,null,null,null,null,null,null,null,null,null,null,null,null,null,null,null,null,null,null,null,null,null,null,null,null,null,null,null,null,null,null,null,null,null,null,null,null,null,null,null,null,null,null,null,null,null,null,null,null,null,null,null,null,null,null,null,null,null,null,null,null,null,null,null,null,null,null,null,null,"Jordens Koen",null,"Jordens Koen",{"$error":"#N/A"},{"$error":"#N/A"}]
[null,null,null,null,null,null,null,null,null,null,null,null,null,null,null,null,null,null,null,null,null,null,null,null,null,null,null,null,null,null,null,null,null,null,null,null,null,null,null,null,null,null,null,null,null,null,null,null,null,null,null,null,null,null,null,null,null,null,null,null,null,null,null,null,null,null,null,null,null,null,null,null,null,null,null,null,null,null,null,null,null,null,null,null,null,null,null,null,null,null,null,null,null,null,null,null,null,null,null,null,null,null,null,null,null,null,null,null,null,null,null,null,null,null,null,"De Groof Maarten / De Groof Steven / Jordens Koen",null,"De Groof Maarten","De Groof Steven","Jordens Koen"]
[null,null,null,null,null,null,null,null,null,null,null,null,null,null,null,null,null,null,null,null,null,null,null,null,null,null,null,null,null,null,null,null,null,null,null,null,null,null,null,null,null,null,null,null,null,null,null,null,null,null,null,null,null,null,null,null,null,null,null,null,null,null,null,null,null,null,null,null,null,null,null,null,null,null,null,null,null,null,null,null,null,null,null,null,null,null,null,null,null,null,null,null,null,null,null,null,null,null,null,null,null,null,null,null,null,null,null,null,null,null,null,null,null,null,null,"Beirinckx Wout",null,"Beirinckx Wout",{"$error":"#N/A"},{"$error":"#N/A"}]
[]
[]
[]
[]
[]
[]
[]
[]
[]
[]
[]
[]
[]
[]
[]
[]
[]
[]
[]
[]
[]
[]
[]
[]
[]
[]
[]
[]
[]
[]
[null,{"$f":"B1","v":"Bar Patron (T)"},"Goka (U)","Alberta Schilde (T)","SC Duffel (U)","Hombeek (T)","Daltons (U)","Corum (T)","Sint Anneke (U)","Jolika (U)","Yerevan United (T)","Bariton (U)","Antwerp Global (T)","Racing Emblem (U)","Bar Patron (U)","SC Duffel (T)","Alberta Schilde (U)","Daltons (T)","Corum (U)","Sint Anneke (T)","Goka (T)","Jolika (T)","Yerevan United (U)","Bariton (T)","Antwerp Global (U)","Racing Emblem (T)","Hombeek (U)"]
[]
["Goals",{"$f":"SUM( B102:B136 )","v":2},0,1,1,5,0,5,0,1,6,1,1,2,3,4,5,0,0,5,3,2,7,2,0,0,0,null,null,null,null,null,null,null,null,null,{"$f":"_xlfn.LET( _xlpm.d, _xlfn.CHOOSECOLS( _xlfn.TAKE( _xlfn.SORTBY( A102:AB137, AB102:AB137, -1 ), 5 ), 1, -1 ),\n_xlpm.f, _xlfn._xlws.FILTER( _xlpm.d, _xlfn.TAKE( _xlpm.d, , -1 ) > 0, \"No data\" ),\n_xlfn.HSTACK( _xlfn.XLOOKUP( _xlfn.TAKE( _xlpm.f, , 1 ), $DZ$5:$DZ$39, $EA$5:$EA$39 ), _xlfn.TAKE( _xlpm.f, , -1 )) )","v":"Glenn De Vinster"},29]
[{"$f":"SUM( B100:AA100 )","v":56},null,null,null,null,null,null,null,null,null,null,null,null,null,null,null,null,null,null,null,null,null,null,null,null,null,null,null,null,null,null,null,null,null,null,null,"Stijn Hofmans",18]
[{"$f":"A5","v":"Beckx Pieter-Alexander"},null,null,null,null,null,null,null,null,null,null,null,null,null,null,null,null,null,null,null,null,null,null,null,null,null,null,{"$f":"SUM( B102:AA102 ) + COUNTIF( B102:AA102, \"ng\" )","v":0},null,null,null,null,null,null,null,null,"Jorn Verhellen",3]
["Beirinckx Geert",null,null,null,null,null,null,null,null,null,null,null,null,null,null,null,null,null,null,null,null,null,null,null,null,null,null,{"$f":"SUM( B103:AA103 ) + COUNTIF( B103:AA103, \"ng\" )","v":0},null,null,null,null,null,null,null,null,"Wout Beirinckx",1]
["Beirinckx Jurgen",null,null,null,null,null,null,null,null,null,null,null,null,null,null,null,null,null,null,null,null,null,null,null,null,null,null,0,null,null,null,null,null,null,null,null,"Maarten De Groof",1]
["Beirinckx Rani",null,null,null,null,null,null,null,null,null,null,null,null,null,null,null,null,null,null,null,null,null,null,null,null,null,null,{"$f":"SUM( B105:AA105 ) + COUNTIF( B105:AA105, \"ng\" )","v":0}]
["Beirinckx Wout",null,null,1,null,null,null,null,null,null,null,null,null,null,null,null,null,null,null,null,null,null,null,null,null,null,null,1]
["Boes Dieuwer",null,null,null,null,null,null,null,null,null,null,null,null,null,null,null,null,null,null,null,null,null,null,null,null,null,null,0]
["Celis Ive",null,null,null,null,null,null,null,null,null,null,null,null,null,null,null,null,null,null,null,null,null,null,null,null,null,null,0]
["Coolsaet Joy",null,null,null,null,null,null,null,null,null,null,null,null,null,null,null,null,null,null,null,null,null,null,null,null,null,null,0]
["De Clerck Tom",null,null,null,null,null,null,null,null,null,null,null,null,null,null,null,null,null,null,null,null,null,null,null,null,null,null,0]
["De Graeve Robbe",null,null,null,null,null,null,null,null,null,null,null,null,null,null,null,null,null,null,null,null,null,null,null,null,null,null,0]
["De Groof Maarten",null,null,null,1,null,null,null,null,null,null,null,null,null,null,null,null,null,null,null,null,null,null,null,null,null,null,1]
["De Groof Steven",null,null,null,null,null,null,null,null,null,null,null,null,null,null,1,null,null,null,null,null,null,null,null,null,null,null,1]
["De Swert Erlend",null,null,null,null,null,null,null,null,null,null,null,null,null,null,null,null,null,null,null,null,null,null,null,null,null,null,0]
["De Vinster Glenn",null,null,null,null,1,null,4,null,1,4,1,1,null,2,null,3,null,null,4,1,null,5,2,null,null,null,29]
["Delen Robbe",null,null,null,null,null,null,null,null,null,null,null,null,null,null,null,null,null,null,null,null,null,null,null,null,null,null,0]
["Elst Pieter",null,null,null,null,null,null,null,null,null,null,null,null,null,null,null,null,null,null,null,null,null,null,null,null,null,null,0]
["Gielis Bernd",null,null,null,null,null,null,null,null,null,null,null,null,null,null,null,null,null,null,null,null,null,null,null,null,null,null,0]
["Gielis Wim",null,null,null,null,null,null,null,null,null,null,null,null,null,null,null,null,null,null,null,null,null,null,null,null,null,null,0]
["Hofmans Stijn",1,null,null,null,2,null,1,null,null,2,null,null,2,1,1,1,null,null,1,2,2,2,null,null,null,null,18]
["Jordens Koen",null,null,null,null,null,null,null,null,null,null,null,null,null,null,null,null,null,null,null,null,null,null,null,null,null,null,0]
["Langenaeker Maarten",null,null,null,null,null,null,null,null,null,null,null,null,null,null,null,null,null,null,null,null,null,null,null,null,null,null,0]
["Lenaerts Jordy",null,null,null,null,null,null,null,null,null,null,null,null,null,null,null,null,null,null,null,null,null,null,null,null,null,null,0]
["Nyckees Wannes",null,null,null,null,null,null,null,null,null,null,null,null,null,null,null,null,null,null,null,null,null,null,null,null,null,null,0]
["Stevens Siebe",null,null,null,null,null,null,null,null,null,null,null,null,null,null,null,null,null,null,null,null,null,null,null,null,null,null,0]
["Tielemans Tom",null,null,null,null,null,null,null,null,null,null,null,null,null,null,null,null,null,null,null,null,null,null,null,null,null,null,0]
["Van de Vondel Rob",null,null,null,null,null,null,null,null,null,null,null,null,null,null,null,null,null,null,null,null,null,null,null,null,null,null,0]
["Van Den Brande Brent",null,null,null,null,null,null,null,null,null,null,null,null,null,null,null,null,null,null,null,null,null,null,null,null,null,null,0]
["Van Dessel Dieter",null,null,null,null,null,null,null,null,null,null,null,null,null,null,null,null,null,null,null,null,null,null,null,null,null,null,0]
["Van Gehuchten Vincent",null,null,null,null,null,null,null,null,null,null,null,null,null,null,null,null,null,null,null,null,null,null,null,null,null,null,0]
["Verdickt Stijn",null,null,null,null,null,null,null,null,null,null,null,null,null,null,null,null,null,null,null,null,null,null,null,null,null,null,0]
["Verhellen Jorn",null,null,null,null,2,null,null,null,null,null,null,null,null,null,1,null,null,null,null,null,null,null,null,null,null,null,3]
["Verlooy Kaïn",null,null,null,null,null,null,null,null,null,null,null,null,null,null,null,1,null,null,null,null,null,null,null,null,null,null,1]
["Vermeylen Jason",1,null,null,null,null,null,null,null,null,null,null,null,null,null,null,null,null,null,null,null,null,null,null,null,null,null,1]
["Verrijdt Ryan",null,null,null,null,null,null,null,null,null,null,null,null,null,null,1,null,null,null,null,null,null,null,null,null,null,null,{"$f":"SUM( B135:AA135 ) + COUNTIF( B135:AA135, \"ng\" )","v":1}]
["Own-goals/ff-goals",null,null,null,null,null,null,null,null,null,null,null,null,null,null,null,null,null,null,null,null,null,null,null,null,null,null,0]
[]
[]
[]
[]
[]
[]
[]
[]
[]
[]
[]
[]
[]
["Assists",{"$f":"SUM( B152:B186 )","v":2},0,0,1,4,0,2,0,0,4,1,1,2,2,4,3,0,0,3,3,2,7,1,0,0,0,null,null,null,null,null,null,null,null,null,{"$f":"_xlfn.LET( _xlpm.d, _xlfn.CHOOSECOLS( _xlfn.TAKE( _xlfn.SORTBY( A152:AB187, AB152:AB187, -1 ), 5 ), 1, -1 ),\n_xlpm.f, _xlfn._xlws.FILTER( _xlpm.d, _xlfn.TAKE( _xlpm.d, , -1 ) > 0, \"No data\" ),\n_xlfn.HSTACK( _xlfn.XLOOKUP( _xlfn.TAKE( _xlpm.f, , 1 ), $DZ$5:$DZ$39, $EA$5:$EA$39 ), _xlfn.TAKE( _xlpm.f, , -1 )) )","v":"Stijn Hofmans"},11]
[{"$f":"SUM( B150:AA150 )","v":42},null,null,null,null,null,null,null,null,null,null,null,null,null,null,null,null,null,null,null,null,null,null,null,null,null,null,null,null,null,null,null,null,null,null,null,"Glenn De Vinster",10]
[{"$f":"A5","v":"Beckx Pieter-Alexander"},null,null,null,null,null,null,null,null,null,null,null,null,null,null,null,null,null,null,null,null,null,null,null,null,null,null,{"$f":"SUM( B152:AA152 ) + COUNTIF( B152:AA152, \"ng\" )","v":0},null,null,null,null,null,null,null,null,"Steven De Groof",5]
["Beirinckx Geert",null,null,null,null,null,null,null,null,null,null,null,null,null,null,null,null,null,null,null,null,null,null,null,null,null,null,{"$f":"SUM( B153:AA153 ) + COUNTIF( B153:AA153, \"ng\" )","v":0},null,null,null,null,null,null,null,null,"Stijn Verdickt",3]
["Beirinckx Jurgen",null,null,null,null,null,null,null,null,null,null,null,null,null,null,null,null,null,null,null,null,null,null,null,null,null,null,{"$f":"SUM( B154:AA154 ) + COUNTIF( B154:AA154, \"ng\" )","v":0},null,null,null,null,null,null,null,null,"Wout Beirinckx",2]
["Beirinckx Rani",null,null,null,null,null,null,null,null,null,null,null,null,null,null,null,null,null,null,null,null,null,null,null,null,null,null,{"$f":"SUM( B155:AA155 ) + COUNTIF( B155:AA155, \"ng\" )","v":0}]
["Beirinckx Wout",null,null,null,null,null,null,null,null,null,null,null,null,null,null,2,null,null,null,null,null,null,null,null,null,null,null,2]
["Boes Dieuwer",null,null,null,null,null,null,null,null,null,null,null,null,null,null,null,null,null,null,null,null,null,null,null,null,null,null,0]
["Celis Ive",null,null,null,null,null,null,null,null,null,null,null,null,1,null,null,null,null,null,null,null,null,null,null,null,null,null,1]
["Coolsaet Joy",null,null,null,null,null,null,null,null,null,null,null,null,null,null,null,null,null,null,null,null,null,null,null,null,null,null,0]
["De Clerck Tom",null,null,null,null,null,null,null,null,null,null,null,null,null,null,null,null,null,null,null,null,null,null,null,null,null,null,0]
["De Graeve Robbe",null,null,null,null,null,null,null,null,null,null,null,null,null,null,null,null,null,null,null,null,null,null,null,null,null,null,0]
["De Groof Maarten",null,null,null,null,null,null,null,null,null,null,null,null,null,null,null,null,null,null,1,null,null,null,null,null,null,null,1]
["De Groof Steven",null,null,null,null,null,null,2,null,null,1,null,null,null,1,null,1,null,null,null,null,null,null,null,null,null,null,{"$f":"SUM( B163:AA163 ) + COUNTIF( B163:AA163, \"ng\" )","v":5}]
["De Swert Erlend",null,null,null,null,null,null,null,null,null,null,null,null,null,null,null,null,null,null,null,null,null,null,null,null,null,null,0]
["De Vinster Glenn",null,null,null,null,2,null,null,null,null,1,null,null,1,1,null,null,null,null,null,1,2,2,null,null,null,null,10]
["Delen Robbe",null,null,null,null,null,null,null,null,null,null,null,null,null,null,null,null,null,null,null,null,null,null,null,null,null,null,0]
["Elst Pieter",null,null,null,null,null,null,null,null,null,null,null,null,null,null,null,null,null,null,null,null,null,null,null,null,null,null,0]
["Gielis Bernd",null,null,null,null,null,null,null,null,null,null,null,null,null,null,null,1,null,null,null,null,null,null,null,null,null,null,1]
["Gielis Wim",null,null,null,null,null,null,null,null,null,null,null,null,null,null,null,null,null,null,null,null,null,null,null,null,null,null,0]
["Hofmans Stijn",1,null,null,null,1,null,null,null,null,1,null,null,null,null,null,null,null,null,2,null,null,5,1,null,null,null,11]
["Jordens Koen",null,null,null,null,null,null,null,null,null,null,null,null,null,null,1,null,null,null,null,1,null,null,null,null,null,null,2]
["Langenaeker Maarten",null,null,null,null,null,null,null,null,null,null,null,null,null,null,null,null,null,null,null,1,null,null,null,null,null,null,1]
["Lenaerts Jordy",null,null,null,null,null,null,null,null,null,null,null,null,null,null,null,null,null,null,null,null,null,null,null,null,null,null,0]
["Nyckees Wannes",null,null,null,null,null,null,null,null,null,null,null,null,null,null,null,null,null,null,null,null,null,null,null,null,null,null,0]
["Stevens Siebe",null,null,null,null,null,null,null,null,null,null,null,null,null,null,null,null,null,null,null,null,null,null,null,null,null,null,0]
["Tielemans Tom",null,null,null,null,null,null,null,null,null,null,null,null,null,null,null,null,null,null,null,null,null,null,null,null,null,null,0]
["Van de Vondel Rob",null,null,null,null,null,null,null,null,null,null,null,null,null,null,null,1,null,null,null,null,null,null,null,null,null,null,1]
["Van Den Brande Brent",null,null,null,null,null,null,null,null,null,null,null,null,null,null,null,null,null,null,null,null,null,null,null,null,null,null,0]
["Van Dessel Dieter",null,null,null,null,null,null,null,null,null,1,null,null,null,null,null,null,null,null,null,null,null,null,null,null,null,null,1]
["Van Gehuchten Vincent",null,null,null,null,null,null,null,null,null,null,null,null,null,null,null,null,null,null,null,null,null,null,null,null,null,null,0]
["Verdickt Stijn",1,null,null,1,null,null,null,null,null,null,1,null,null,null,null,null,null,null,null,null,null,null,null,null,null,null,3]
["Verhellen Jorn",null,null,null,null,null,null,null,null,null,null,null,1,null,null,1,null,null,null,null,null,null,null,null,null,null,null,2]
["Verlooy Kaïn",null,null,null,null,1,null,null,null,null,null,null,null,null,null,null,null,null,null,null,null,null,null,null,null,null,null,1]
["Vermeylen Jason",null,null,null,null,null,null,null,null,null,null,null,null,null,null,null,null,null,null,null,null,null,null,null,null,null,null,0]
["Verrijdt Ryan",null,null,null,null,null,null,null,null,null,null,null,null,null,null,null,null,null,null,null,null,null,null,null,null,null,null,0]
["Own-goals/ff-goals",null,null,null,null,null,null,null,null,null,null,null,null,null,null,null,null,null,null,null,null,null,null,null,null,null,null,0]
[]
[]
[]
[]
[]
[]
[]
[]
[]
[]
[]
[]
[]
["In actie",{"$f":"SUM( B202:B237 )","v":14},12,14,13,13,11,11,10,14,13,11,12,11,13,15,11,0,12,13,11,12,12,13,14,0,0,null,null,null,null,null,null,null,null,null,{"$f":"_xlfn.LET( _xlpm.d, _xlfn.CHOOSECOLS( _xlfn.TAKE( _xlfn.SORTBY( A202:AB237, AB202:AB237, -1 ), 5 ), 1, -1 ),\n_xlpm.f, _xlfn._xlws.FILTER( _xlpm.d, _xlfn.TAKE( _xlpm.d, , -1 ) > 0, \"No data\" ),\n_xlfn.HSTACK( _xlfn.XLOOKUP( _xlfn.TAKE( _xlpm.f, , 1 ), $DZ$5:$DZ$39, $EA$5:$EA$39 ), _xlfn.TAKE( _xlpm.f, , -1 )) )","v":"Steven De Groof"},20]
[{"$f":"AVERAGEIF( B200:AA200, \">0\", B200:AA200 )","v":12.391304347826088},null,null,null,null,null,null,null,null,null,null,null,null,null,null,null,null,null,null,null,null,null,null,null,null,null,null,null,null,null,null,null,null,null,null,null,"Glenn De Vinster",20]
[{"$f":"A5","v":"Beckx Pieter-Alexander"},null,null,null,1,null,null,null,null,null,null,null,null,null,null,null,null,null,null,null,null,null,null,null,null,null,null,{"$f":"COUNTA( B202:AA202 )","v":1},null,null,null,null,null,null,null,null,"Wout Beirinckx",19]
["Beirinckx Geert",null,null,null,null,null,null,null,null,null,null,null,null,null,null,null,null,null,null,null,null,null,null,null,null,null,null,{"$f":"COUNTA( B203:AA203 )","v":0},null,null,null,null,null,null,null,null,"Maarten De Groof",19]
["Beirinckx Jurgen",1,null,null,1,null,null,null,null,null,null,null,1,null,1,null,null,null,null,null,null,null,null,null,null,null,null,4,null,null,null,null,null,null,null,null,"Koen Jordens",19]
["Beirinckx Rani",null,null,null,null,null,null,null,null,null,null,null,null,null,null,null,null,null,null,null,null,null,null,null,null,null,null,{"$f":"COUNTA( B205:AA205 )","v":0}]
["Beirinckx Wout",null,1,1,1,1,1,1,"k",1,1,null,null,"k",1,1,1,null,1,1,null,1,1,1,1,null,null,19]
["Boes Dieuwer",1,1,1,1,null,1,null,null,null,null,null,null,null,null,1,null,null,null,null,null,null,null,null,1,null,null,7]
["Celis Ive",null,null,1,null,1,1,1,null,null,null,1,1,1,1,1,null,null,null,null,null,null,null,null,null,null,null,9]
["Coolsaet Joy",null,null,null,1,null,1,null,null,1,null,1,1,1,null,1,null,null,1,null,1,1,null,1,1,null,null,12]
["De Clerck Tom",null,null,null,null,null,null,null,null,null,null,null,null,null,null,null,null,null,null,null,null,null,null,null,null,null,null,0]
["De Graeve Robbe",1,1,null,null,null,null,null,null,null,1,null,null,null,null,null,null,null,null,null,null,null,null,null,null,null,null,3]
["De Groof Maarten",1,1,1,1,1,null,null,1,1,1,1,null,null,1,1,1,null,1,1,1,1,1,1,1,null,null,19]
["De Groof Steven",1,null,null,1,1,1,1,1,1,1,1,null,1,1,1,1,null,1,1,1,1,1,1,1,null,null,20]
["De Swert Erlend",null,1,null,null,null,1,null,1,null,null,null,1,null,null,null,null,null,null,null,null,null,null,1,null,null,null,5]
["De Vinster Glenn",1,1,1,null,1,1,1,1,1,1,1,1,1,1,null,1,null,1,1,1,1,1,1,null,null,null,20]
["Delen Robbe",null,null,1,null,null,null,null,null,null,null,null,null,null,null,null,null,null,null,null,null,null,null,null,null,null,null,{"$f":"COUNTA( B216:AA216 )","v":1}]
["Elst Pieter",1,1,1,null,1,null,1,1,null,1,null,1,1,1,1,null,null,1,1,1,1,1,null,1,null,null,17]
["Gielis Bernd",null,null,1,null,null,1,1,1,1,1,null,null,1,1,null,1,null,1,1,null,null,1,1,1,null,null,14]
["Gielis Wim",1,1,1,1,null,1,1,null,1,null,1,1,null,null,null,1,null,null,1,1,1,1,1,1,null,null,16]
["Hofmans Stijn",1,1,1,null,1,null,1,null,null,1,1,null,1,1,1,1,null,null,1,1,1,1,1,null,null,null,16]
["Jordens Koen",1,1,1,null,1,1,1,null,1,1,1,null,1,"k","k","k",null,null,1,1,1,1,1,1,null,null,19]
["Langenaeker Maarten","k","k","k","k","k","k","k","k","k","k","k","k",null,null,null,null,null,"k","k","k","k","k","k","k",null,null,19]
["Lenaerts Jordy",null,null,null,null,null,null,null,1,null,null,null,null,null,null,null,null,null,null,null,null,null,null,null,null,null,null,1]
["Nyckees Wannes",1,null,null,1,null,null,null,null,null,null,null,null,null,null,null,null,null,null,null,null,null,null,null,null,null,null,2]
["Stevens Siebe",null,null,null,1,null,null,null,null,1,null,null,null,null,null,null,null,null,null,null,null,null,null,null,null,null,null,2]
["Tielemans Tom",null,null,null,null,null,null,null,null,null,null,null,null,null,null,null,null,null,null,null,null,null,null,null,null,null,null,0]
["Van de Vondel Rob",null,null,null,null,null,null,null,null,1,1,1,1,1,1,1,1,null,1,1,null,null,null,null,1,null,null,11]
["Van Den Brande Brent",null,null,null,null,1,null,null,1,1,null,null,null,null,null,1,null,null,null,null,null,null,null,null,null,null,null,4]
["Van Dessel Dieter",1,1,1,null,1,1,1,1,1,1,null,1,1,1,1,null,null,1,1,1,1,null,null,1,null,null,18]
["Van Gehuchten Vincent",null,null,null,null,null,null,null,null,null,null,null,null,null,null,null,null,null,null,null,null,null,null,null,null,null,null,0]
["Verdickt Stijn",1,null,1,1,1,null,null,1,null,1,1,1,null,1,1,1,null,1,1,1,null,1,1,null,null,null,16]
["Verhellen Jorn",null,null,null,1,1,null,null,null,null,null,1,1,null,null,1,null,null,null,null,null,null,null,null,null,null,null,5]
["Verlooy Kaïn",null,null,1,1,1,null,1,null,1,1,null,1,1,1,1,1,null,1,1,1,1,1,1,1,null,null,18]
["Vermeylen Jason",1,1,null,null,null,null,null,null,1,null,null,null,null,null,null,null,null,1,null,null,null,null,null,1,null,null,5]
["Verrijdt Ryan",null,null,null,null,null,null,null,null,null,null,null,null,null,null,1,1,null,null,null,null,1,1,1,1,null,null,6]
["Own-goals/ff-goals",null,null,null,null,null,null,null,null,null,null,null,null,null,null,null,null,null,null,null,null,null,null,null,null,null,null,0]
[]
[]
[]
[]
[]
[]
[]
[]
[]
[]
[]
[]
[]
["Kaarten",{"$f":"COUNTIF( B252:B286, \"geel\" )","v":1},0,1,1,0,0,0,1,1,3,0,1,2,2,1,1,0,1,2,1,3,1,0,0,0,0,null,null,null,null,null,null,null,null,null,{"$f":"_xlfn.LET( _xlpm.d, _xlfn.CHOOSECOLS( _xlfn.TAKE( _xlfn.SORTBY( A252:AB287, AB252:AB287, -1 ), 5 ), 1, -1 ),\n_xlpm.f, _xlfn._xlws.FILTER( _xlpm.d, _xlfn.TAKE( _xlpm.d, , -1 ) > 0, \"No data\" ),\n_xlfn.HSTACK( _xlfn.XLOOKUP( _xlfn.TAKE( _xlpm.f, , 1 ), $DZ$5:$DZ$39, $EA$5:$EA$39 ), _xlfn.TAKE( _xlpm.f, , -1 )) )","v":"Glenn De Vinster"},5]
[{"$f":"SUM( B250:AA251 )","v":23},{"$f":"COUNTIF( B252:B286, \"rood\" )","v":0},0,0,0,0,0,0,0,0,0,0,0,0,0,0,0,0,0,0,0,0,0,0,0,0,0,null,null,null,null,null,null,null,null,null,"Dieter Van Dessel",3]
[{"$f":"A5","v":"Beckx Pieter-Alexander"},null,null,null,null,null,null,null,null,null,null,null,null,null,null,null,null,null,null,null,null,null,null,null,null,null,null,{"$f":"COUNTIF( B252:AA252, \"<>\" )","v":0},null,null,null,null,null,null,null,null,"Stijn Verdickt",2]
["Beirinckx Geert",null,null,null,null,null,null,null,null,null,null,null,null,null,null,null,null,null,null,null,null,null,null,null,null,null,null,{"$f":"COUNTIF( B253:AA253, \"<>\" )","v":0},null,null,null,null,null,null,null,null,"Kaïn Verlooy",2]
["Beirinckx Jurgen",null,null,null,null,null,null,null,null,null,null,null,null,null,null,null,null,null,null,null,null,null,null,null,null,null,null,{"$f":"COUNTIF( B254:AA254, \"<>\" )","v":0},null,null,null,null,null,null,null,null,"Wout Beirinckx",1]
["Beirinckx Rani",null,null,null,null,null,null,null,null,null,null,null,null,null,null,null,null,null,null,null,null,null,null,null,null,null,null,{"$f":"COUNTIF( B255:AA255, \"<>\" )","v":0}]
["Beirinckx Wout",null,null,null,null,null,null,null,null,null,null,null,null,null,"geel",null,null,null,null,null,null,null,null,null,null,null,null,1]
["Boes Dieuwer",null,null,null,null,null,null,null,null,null,null,null,null,null,null,null,null,null,null,null,null,null,null,null,null,null,null,0]
["Celis Ive",null,null,"geel",null,null,null,null,null,null,null,null,null,null,null,null,null,null,null,null,null,null,null,null,null,null,null,1]
["Coolsaet Joy",null,null,null,null,null,null,null,null,null,null,null,null,null,null,null,null,null,null,null,null,"geel",null,null,null,null,null,1]
["De Clerck Tom",null,null,null,null,null,null,null,null,null,null,null,null,null,null,null,null,null,null,null,null,null,null,null,null,null,null,0]
["De Graeve Robbe","geel",null,null,null,null,null,null,null,null,null,null,null,null,null,null,null,null,null,null,null,null,null,null,null,null,null,1]
["De Groof Maarten",null,null,null,null,null,null,null,null,null,null,null,null,null,null,null,null,null,null,null,null,null,null,null,null,null,null,0]
["De Groof Steven",null,null,null,null,null,null,null,null,null,"geel",null,null,null,null,null,null,null,null,null,null,null,null,null,null,null,null,1]
["De Swert Erlend",null,null,null,null,null,null,null,null,null,null,null,null,null,null,null,null,null,null,null,null,null,null,null,null,null,null,{"$f":"COUNTIF( B264:AA264, \"<>\" )","v":0}]
["De Vinster Glenn",null,null,null,null,null,null,null,"geel",null,null,null,"geel",null,"geel",null,null,null,null,null,null,"geel","geel",null,null,null,null,5]
["Delen Robbe",null,null,null,null,null,null,null,null,null,null,null,null,null,null,null,null,null,null,null,null,null,null,null,null,null,null,0]
["Elst Pieter",null,null,null,null,null,null,null,null,null,null,null,null,"geel",null,null,null,null,null,null,null,null,null,null,null,null,null,1]
["Gielis Bernd",null,null,null,null,null,null,null,null,null,null,null,null,null,null,null,null,null,null,null,null,null,null,null,null,null,null,0]
["Gielis Wim",null,null,null,null,null,null,null,null,null,null,null,null,null,null,null,null,null,null,null,null,null,null,null,null,null,null,0]
["Hofmans Stijn",null,null,null,null,null,null,null,null,null,"geel",null,null,null,null,null,null,null,null,null,null,null,null,null,null,null,null,1]
["Jordens Koen",null,null,null,null,null,null,null,null,null,null,null,null,null,null,null,null,null,null,"geel",null,null,null,null,null,null,null,1]
["Langenaeker Maarten",null,null,null,null,null,null,null,null,null,null,null,null,null,null,null,null,null,null,null,null,null,null,null,null,null,null,0]
["Lenaerts Jordy",null,null,null,null,null,null,null,null,null,null,null,null,null,null,null,null,null,null,null,null,null,null,null,null,null,null,0]
["Nyckees Wannes",null,null,null,null,null,null,null,null,null,null,null,null,null,null,null,null,null,null,null,null,null,null,null,null,null,null,0]
["Stevens Siebe",null,null,null,"geel",null,null,null,null,null,null,null,null,null,null,null,null,null,null,null,null,null,null,null,null,null,null,1]
["Tielemans Tom",null,null,null,null,null,null,null,null,null,null,null,null,null,null,null,null,null,null,null,null,null,null,null,null,null,null,0]
["Van de Vondel Rob",null,null,null,null,null,null,null,null,null,null,null,null,null,null,null,null,null,"geel",null,null,null,null,null,null,null,null,1]
["Van Den Brande Brent",null,null,null,null,null,null,null,null,"geel",null,null,null,null,null,null,null,null,null,null,null,null,null,null,null,null,null,1]
["Van Dessel Dieter",null,null,null,null,null,null,null,null,null,null,null,null,"geel",null,"geel",null,null,null,null,null,"geel",null,null,null,null,null,3]
["Van Gehuchten Vincent",null,null,null,null,null,null,null,null,null,null,null,null,null,null,null,null,null,null,null,null,null,null,null,null,null,null,0]
["Verdickt Stijn",null,null,null,null,null,null,null,null,null,"geel",null,null,null,null,null,"geel",null,null,null,null,null,null,null,null,null,null,2]
["Verhellen Jorn",null,null,null,null,null,null,null,null,null,null,null,null,null,null,null,null,null,null,null,null,null,null,null,null,null,null,0]
["Verlooy Kaïn",null,null,null,null,null,null,null,null,null,null,null,null,null,null,null,null,null,null,"geel","geel",null,null,null,null,null,null,2]
["Vermeylen Jason",null,null,null,null,null,null,null,null,null,null,null,null,null,null,null,null,null,null,null,null,null,null,null,null,null,null,0]
["Verrijdt Ryan",null,null,null,null,null,null,null,null,null,null,null,null,null,null,null,null,null,null,null,null,null,null,null,null,null,null,0]
["Own-goals/ff-goals",null,null,null,null,null,null,null,null,null,null,null,null,null,null,null,null,null,null,null,null,null,null,null,null,null,null,0]
[]
[]
[]
[]
[]
[]
[]
[]
[]
[]
[]
[]
[]
["MVDM",{"$f":"SUM( B302:B336 )","v":90},75,100,75,85,70,75,65,80,75,75,80,105,70,95,70,0,70,75,65,85,70,0,0,0,0,null,null,null,null,null,null,null,null,null,{"$f":"_xlfn.LET( _xlpm.d, _xlfn.CHOOSECOLS( _xlfn.TAKE( _xlfn.SORTBY( A302:AB337, AB302:AB337, -1 ), 5 ), 1, -1 ),\n_xlpm.f, _xlfn._xlws.FILTER( _xlpm.d, _xlfn.TAKE( _xlpm.d, , -1 ) > 0, \"No data\" ),\n_xlfn.HSTACK( _xlfn.XLOOKUP( _xlfn.TAKE( _xlpm.f, , 1 ), $DZ$5:$DZ$39, $EA$5:$EA$39 ), _xlfn.TAKE( _xlpm.f, , -1 )) )","v":"Glenn De Vinster"},187]
[{"$f":"SUM( B300:AA300 )","v":1650},null,null,null,null,null,null,null,null,null,null,null,null,null,null,null,null,null,null,null,null,null,null,null,null,null,null,null,null,null,null,null,null,null,null,null,"Stijn Hofmans",135]
[{"$f":"A5","v":"Beckx Pieter-Alexander"},null,null,null,0,null,null,null,null,null,null,null,null,null,null,null,null,null,null,null,null,null,null,null,null,null,null,{"$f":"SUM( B302:AA302 )","v":0},null,null,null,null,null,null,null,null,"Kaïn Verlooy",125]
["Beirinckx Geert",null,null,null,null,null,null,null,null,null,null,null,null,null,null,null,null,null,null,null,null,null,null,null,null,null,null,{"$f":"SUM( B303:AA303 )","v":0},null,null,null,null,null,null,null,null,"Maarten Langenaeker",116]
["Beirinckx Jurgen",2,null,null,0,null,null,null,null,null,null,null,3,null,1,null,null,null,1,null,null,null,null,null,null,null,null,7,null,null,null,null,null,null,null,null,"Maarten De Groof",106]
["Beirinckx Rani",1,null,null,null,null,null,null,null,null,null,null,1,null,null,null,null,null,null,null,null,null,null,null,null,null,null,{"$f":"SUM( B305:AA305 )","v":2}]
["Beirinckx Wout",null,7,7,1,0,6,2,6,0,null,null,null,7,0,3,3,null,4,1,null,5,7,null,null,null,null,59]
["Boes Dieuwer",0,4,1,3,null,6,null,null,null,null,null,null,null,null,2,null,null,null,null,null,null,null,null,null,null,null,16]
["Celis Ive",null,null,3,null,11,9,3,null,null,null,5,7,14,6,3,null,null,null,null,null,null,null,null,null,null,null,61]
["Coolsaet Joy",null,null,1,7,null,7,null,null,6,null,8,8,3,null,0,null,null,4,null,9,2,null,null,null,null,null,55]
["De Clerck Tom",null,null,null,null,null,null,null,null,null,null,null,null,null,null,null,null,null,null,null,null,null,null,null,null,null,null,0]
["De Graeve Robbe",4,2,null,null,null,null,null,null,null,1,null,null,null,null,null,null,null,null,null,null,null,null,null,null,null,null,7]
["De Groof Maarten",7,11,16,5,2,null,null,8,7,6,7,null,1,1,3,6,null,4,8,2,9,3,null,null,null,null,106]
["De Groof Steven",2,null,null,0,0,9,7,4,3,8,6,null,7,9,8,1,null,5,2,3,9,5,null,null,null,null,88]
["De Swert Erlend",null,5,null,null,null,4,null,2,null,null,null,7,null,null,null,null,null,null,null,null,null,null,null,null,null,null,18]
["De Vinster Glenn",7,12,7,null,16,5,20,5,9,13,8,4,13,12,null,12,null,11,12,6,3,12,null,null,null,null,187]
["Delen Robbe",null,null,20,null,null,null,null,null,null,null,null,null,null,null,null,null,null,null,null,null,null,null,null,null,null,null,20]
["Elst Pieter",7,11,11,null,2,null,4,7,null,6,null,6,3,4,4,null,null,3,null,7,11,2,null,null,null,null,88]
["Gielis Bernd",null,null,2,null,null,10,10,6,10,10,null,null,10,7,null,10,null,6,6,null,null,6,null,null,null,null,93]
["Gielis Wim",0,3,1,0,null,0,1,null,1,null,6,0,1,null,null,1,null,null,0,0,0,null,null,null,null,null,14]
["Hofmans Stijn",12,6,3,null,14,null,2,null,null,10,2,null,15,6,17,4,null,null,9,11,12,12,null,null,null,null,135]
["Jordens Koen",5,8,2,null,0,4,7,null,2,4,13,null,3,8,10,13,null,null,2,8,9,null,null,null,null,null,98]
["Langenaeker Maarten",11,2,13,15,2,7,6,3,7,9,4,0,null,null,null,null,null,8,10,2,6,11,null,null,null,null,116]
["Lenaerts Jordy",null,null,null,null,null,null,null,4,null,null,null,null,null,null,null,null,null,null,null,null,null,null,null,null,null,null,4]
["Nyckees Wannes",20,null,null,12,null,null,null,null,null,null,null,null,null,null,null,null,null,null,null,null,null,null,null,null,null,null,32]
["Stevens Siebe",null,null,null,9,null,null,null,null,9,null,null,null,null,null,null,null,null,null,null,null,null,null,null,null,null,null,18]
["Tielemans Tom",null,null,null,null,null,null,null,null,null,null,null,null,null,null,null,null,null,null,null,null,null,null,null,null,null,null,0]
["Van de Vondel Rob",null,null,null,null,null,null,null,null,3,null,3,7,9,2,0,6,null,9,16,null,null,null,null,null,null,null,55]
["Van Den Brande Brent",null,null,null,null,8,null,null,11,12,null,null,null,null,null,4,null,null,null,null,null,null,null,null,null,null,null,35]
["Van Dessel Dieter",4,3,2,null,6,3,8,7,3,4,null,10,11,6,5,null,null,4,1,5,6,null,null,null,null,null,88]
["Van Gehuchten Vincent",null,null,null,null,null,null,null,null,null,null,null,null,null,null,null,null,null,null,null,null,null,null,null,null,null,null,0]
["Verdickt Stijn",2,null,1,6,0,null,null,2,null,2,6,3,null,1,0,4,null,5,0,7,null,null,null,null,null,null,39]
["Verhellen Jorn",null,null,null,14,16,null,null,null,null,null,7,8,null,null,17,null,null,null,null,null,null,null,null,null,null,null,{"$f":"SUM( B332:AA332 )","v":62}]
["Verlooy Kaïn",null,null,10,3,8,null,5,null,7,2,null,16,8,7,13,6,null,5,8,5,11,11,null,null,null,null,125]
["Vermeylen Jason",6,1,null,null,null,null,null,null,1,null,null,null,null,null,null,null,null,1,null,null,null,null,null,null,null,null,9]
["Verrijdt Ryan",null,null,null,null,null,null,null,null,null,null,null,null,null,null,6,4,null,null,null,null,2,1,null,null,null,null,13]
["Own-goals/ff-goals",null,null,null,null,null,null,null,null,null,null,null,null,null,null,null,null,null,null,null,null,null,null,null,null,null,null,0]
[]
[]
[]
[]
[]
[]
[]
[]
[]
[]
[]
[]
[]
["MVDM - herwogen",{"$f":"SUM( B352:B387 )","v":100.00000000000003},100,100,100.00000000000001,100,100.00000000000001,100.00000000000001,100,100,100,99.999999999999986,100,100.00000000000001,100.00000000000001,100,99.999999999999986,0,99.999999999999986,99.999999999999986,100.00000000000001,100.00000000000001,99.999999999999986,0,0,0,0,null,null,null,null,null,null,null,null,null,{"$f":"_xlfn.LET( _xlpm.d, _xlfn.CHOOSECOLS( _xlfn.TAKE( _xlfn.SORTBY( A352:AB387, AB352:AB387, -1 ), 5 ), 1, -1 ),\n_xlpm.f, _xlfn._xlws.FILTER( _xlpm.d, _xlfn.TAKE( _xlpm.d, , -1 ) > 0, \"No data\" ),\n_xlfn.HSTACK( _xlfn.XLOOKUP( _xlfn.TAKE( _xlpm.f, , 1 ), $DZ$5:$DZ$39, $EA$5:$EA$39 ), _xlfn.TAKE( _xlpm.f, , -1 )) )","v":"Glenn De Vinster"},243.6371292106586]
[{"$f":"SUM( B350:AA350 )","v":2100},null,null,null,null,null,null,null,null,null,null,null,null,null,null,null,null,null,null,null,null,null,null,null,null,null,null,null,null,null,null,null,null,null,null,null,"Stijn Hofmans",166.12033477358554]
[{"$f":"A5","v":"Beckx Pieter-Alexander"},null,null,null,0,null,null,null,null,null,null,null,null,null,null,null,null,null,null,null,null,null,null,null,null,null,null,{"$f":"SUM( B352:AA352 )","v":0},null,null,null,null,null,null,null,null,"Kaïn Verlooy",155.52707844271313]
["Beirinckx Geert",null,null,null,null,null,null,null,null,null,null,null,null,null,null,null,null,null,null,null,null,null,null,null,null,null,null,{"$f":"SUM( B353:AA353 )","v":0},null,null,null,null,null,null,null,null,"Maarten Langenaeker",149.55248509660274]
["Beirinckx Jurgen",2.2222222222222223,null,null,0,null,null,null,null,null,null,null,3.75,null,1.4285714285714286,null,null,null,1.4285714285714286,null,null,null,null,null,null,null,null,{"$f":"SUM( B354:AA354 )","v":8.8293650793650791},null,null,null,null,null,null,null,null,"Maarten De Groof",134.29717865553778]
["Beirinckx Rani",1.1111111111111112,null,null,null,null,null,null,null,null,null,null,1.25,null,null,null,null,null,null,null,null,null,null,null,null,null,null,{"$f":"SUM( B355:AA355 )","v":2.3611111111111112}]
["Beirinckx Wout",null,9.3333333333333339,7,1.3333333333333333,0,8.5714285714285712,2.6666666666666665,9.2307692307692299,0,null,null,null,6.666666666666667,0,3.1578947368421053,4.2857142857142856,null,5.7142857142857144,1.3333333333333333,null,5.882352941176471,10,null,null,null,null,75.175778813549712]
["Boes Dieuwer",0,5.333333333333333,1,4,null,8.5714285714285712,null,null,null,null,null,null,null,null,2.1052631578947367,null,null,null,null,null,null,null,null,null,null,null,21.010025062656641]
["Celis Ive",null,null,3,null,12.941176470588236,12.857142857142858,4,null,null,null,6.666666666666667,8.75,13.333333333333334,8.5714285714285712,3.1578947368421053,null,null,null,null,null,null,null,null,null,null,null,73.277642636001772]
["Coolsaet Joy",null,null,1,9.3333333333333339,null,10,null,null,7.5,null,10.666666666666666,10,2.8571428571428572,null,0,null,null,5.7142857142857144,null,13.846153846153847,2.3529411764705883,null,null,null,null,null,73.270523594053017]
["De Clerck Tom",null,null,null,null,null,null,null,null,null,null,null,null,null,null,null,null,null,null,null,null,null,null,null,null,null,null,0]
["De Graeve Robbe",4.4444444444444446,2.6666666666666665,null,null,null,null,null,null,null,1.3333333333333333,null,null,null,null,null,null,null,null,null,null,null,null,null,null,null,null,8.4444444444444446]
["De Groof Maarten",7.7777777777777777,14.666666666666666,16,6.666666666666667,2.3529411764705883,null,null,12.307692307692308,8.75,8,9.3333333333333339,null,0.95238095238095233,1.4285714285714286,3.1578947368421053,8.5714285714285712,null,5.7142857142857144,10.666666666666666,3.0769230769230771,10.588235294117647,4.2857142857142856,null,null,null,null,134.29717865553778]
["De Groof Steven",2.2222222222222223,null,null,0,0,12.857142857142858,9.3333333333333339,6.1538461538461542,3.75,10.666666666666666,8,null,6.666666666666667,12.857142857142858,8.4210526315789469,1.4285714285714286,null,7.1428571428571432,2.6666666666666665,4.615384615384615,10.588235294117647,7.1428571428571432,null,null,null,null,114.51264567905434]
["De Swert Erlend",null,6.666666666666667,null,null,null,5.7142857142857144,null,3.0769230769230771,null,null,null,8.75,null,null,null,null,null,null,null,null,null,null,null,null,null,null,24.20787545787546]
["De Vinster Glenn",7.7777777777777777,16,7,null,18.823529411764707,7.1428571428571432,26.666666666666668,7.6923076923076925,11.25,17.333333333333332,10.666666666666666,5,12.380952380952381,17.142857142857142,null,17.142857142857142,null,15.714285714285714,16,9.2307692307692299,3.5294117647058822,17.142857142857142,null,null,null,null,243.6371292106586]
["Delen Robbe",null,null,20,null,null,null,null,null,null,null,null,null,null,null,null,null,null,null,null,null,null,null,null,null,null,null,20]
["Elst Pieter",7.7777777777777777,14.666666666666666,11,null,2.3529411764705883,null,5.333333333333333,10.76923076923077,null,8,null,7.5,2.8571428571428572,5.7142857142857144,4.2105263157894735,null,null,4.2857142857142856,null,10.76923076923077,12.941176470588236,2.8571428571428572,null,null,null,null,111.03516899337335]
["Gielis Bernd",null,null,2,null,null,14.285714285714286,13.333333333333334,9.2307692307692299,12.5,13.333333333333334,null,null,9.5238095238095237,10,null,14.285714285714286,null,8.5714285714285712,8,null,null,8.5714285714285712,null,null,null,null,123.63553113553112]
["Gielis Wim",0,4,1,0,null,0,1.3333333333333333,null,1.25,null,8,0,0.95238095238095233,null,null,1.4285714285714286,null,null,0,0,0,null,null,null,null,null,17.964285714285712]
["Hofmans Stijn",13.333333333333334,8,3,null,16.470588235294116,null,2.6666666666666665,null,null,13.333333333333334,2.6666666666666665,null,14.285714285714286,8.5714285714285712,17.894736842105264,5.7142857142857144,null,null,12,16.923076923076923,14.117647058823529,17.142857142857142,null,null,null,null,166.12033477358554]
["Jordens Koen",5.5555555555555554,10.666666666666666,2,null,0,5.7142857142857144,9.3333333333333339,null,2.5,5.333333333333333,17.333333333333332,null,2.8571428571428572,11.428571428571429,10.526315789473685,18.571428571428573,null,null,2.6666666666666665,12.307692307692308,10.588235294117647,null,null,null,null,null,127.3825608516011]
["Langenaeker Maarten",12.222222222222221,2.6666666666666665,13,20,2.3529411764705883,10,8,4.615384615384615,8.75,12,5.333333333333333,0,null,null,null,null,null,11.428571428571429,13.333333333333334,3.0769230769230771,7.0588235294117645,15.714285714285714,null,null,null,null,149.55248509660274]
["Lenaerts Jordy",null,null,null,null,null,null,null,6.1538461538461542,null,null,null,null,null,null,null,null,null,null,null,null,null,null,null,null,null,null,6.1538461538461542]
["Nyckees Wannes",22.222222222222221,null,null,16,null,null,null,null,null,null,null,null,null,null,null,null,null,null,null,null,null,null,null,null,null,null,38.222222222222221]
["Stevens Siebe",null,null,null,12,null,null,null,null,11.25,null,null,null,null,null,null,null,null,null,null,null,null,null,null,null,null,null,23.25]
["Tielemans Tom",null,null,null,null,null,null,null,null,null,null,null,null,null,null,null,null,null,null,null,null,null,null,null,null,null,null,0]
["Van de Vondel Rob",null,null,null,null,null,null,null,null,3.75,null,4,8.75,8.5714285714285712,2.8571428571428572,0,8.5714285714285712,null,12.857142857142858,21.333333333333332,null,null,null,null,null,null,null,70.69047619047619]
["Van Den Brande Brent",null,null,null,null,9.4117647058823533,null,null,16.923076923076923,15,null,null,null,null,null,4.2105263157894735,null,null,null,null,null,null,null,null,null,null,null,45.545367944748747]
["Van Dessel Dieter",4.4444444444444446,4,2,null,7.0588235294117645,4.2857142857142856,10.666666666666666,10.76923076923077,3.75,5.333333333333333,null,12.5,10.476190476190476,8.5714285714285712,5.2631578947368425,null,null,5.7142857142857144,1.3333333333333333,7.6923076923076925,7.0588235294117645,null,null,null,null,null,110.91774024049566]
["Van Gehuchten Vincent",null,null,null,null,null,null,null,null,null,null,null,null,null,null,null,null,null,null,null,null,null,null,null,null,null,null,0]
["Verdickt Stijn",2.2222222222222223,null,1,8,0,null,null,3.0769230769230771,null,2.6666666666666665,8,3.75,null,1.4285714285714286,0,5.7142857142857144,null,7.1428571428571432,0,10.76923076923077,null,null,null,null,null,null,53.770757020757017]
["Verhellen Jorn",null,null,null,18.666666666666668,18.823529411764707,null,null,null,null,null,9.3333333333333339,10,null,null,17.894736842105264,null,null,null,null,null,null,null,null,null,null,null,74.71826625386997]
["Verlooy Kaïn",null,null,10,4,9.4117647058823533,null,6.666666666666667,null,8.75,2.6666666666666665,null,20,7.6190476190476186,10,13.684210526315789,8.5714285714285712,null,7.1428571428571432,10.666666666666666,7.6923076923076925,12.941176470588236,15.714285714285714,null,null,null,null,155.52707844271313]
["Vermeylen Jason",6.666666666666667,1.3333333333333333,null,null,null,null,null,null,1.25,null,null,null,null,null,null,null,null,1.4285714285714286,null,null,null,null,null,null,null,null,10.678571428571429]
["Verrijdt Ryan",null,null,null,null,null,null,null,null,null,null,null,null,null,null,6.3157894736842106,5.7142857142857144,null,null,null,null,2.3529411764705883,1.4285714285714286,null,null,null,null,15.811587793011942]
["Own-goals/ff-goals",null,null,null,null,null,null,null,null,null,null,null,null,null,null,null,null,null,null,null,null,null,null,null,null,null,null,0]

{"sheet":"Topschutters","index":4,"n_rows":8,"n_cols":4,"rows_kept":8,"cut":false,"hidden":false,"merged":[]}
[{"$f":"_xlfn.SORTBY( _xlfn._xlws.FILTER( spelersstatistieken!A5:A37, spelersstatistieken!AB102:AB134 > 0 ), _xlfn._xlws.FILTER( spelersstatistieken!AB102:AB134, spelersstatistieken!AB102:AB134 > 0 ), -1 )","v":"De Vinster Glenn"},{"$f":"INDEX( spelersstatistieken!AB5:AB37,_xlfn.ANCHORARRAY( D1) )","v":29},{"$f":"_xlfn.BYROW(_xlfn.ANCHORARRAY( D1), _xlfn.LAMBDA(_xlpm.r, _xlfn.TEXTJOIN( \", \", TRUE, IF( ISNUMBER( INDEX( spelersstatistieken!$B$102:$AA$134, _xlpm.r, 0 )), spelersstatistieken!$B$1:$AA$1 & \" (\" & INDEX( spelersstatistieken!$B$102:$AA$134, _xlpm.r, 0 ) & \")\", \"\" ))))","v":"Hombeek (T) (1), Corum (T) (4), Jolika (U) (1), Yerevan United (T) (4), Bariton (U) (1), Antwerp Global (T) (1), Bar Patron (U) (2), Alberta Schilde (U) (3), Sint Anneke (T) (4), Goka (T) (1), Yerevan United (U) (5), Bariton (T) (2)"},{"$f":"MATCH(_xlfn.ANCHORARRAY( A1), spelersstatistieken!$A$5:$A$37, 0 )","v":14}]
["Hofmans Stijn",18,"Bar Patron (T) (1), Hombeek (T) (2), Corum (T) (1), Yerevan United (T) (2), Racing Emblem (U) (2), Bar Patron (U) (1), SC Duffel (T) (1), Alberta Schilde (U) (1), Sint Anneke (T) (1), Goka (T) (2), Jolika (T) (2), Yerevan United (U) (2)",19]
["Verhellen Jorn",3,"Hombeek (T) (2), SC Duffel (T) (1)",31]
["Beirinckx Wout",1,"Alberta Schilde (T) (1)",5]
["De Groof Maarten",1,"SC Duffel (U) (1)",11]
["De Groof Steven",1,"SC Duffel (T) (1)",12]
["Verlooy Kaïn",1,"Alberta Schilde (U) (1)",32]
["Vermeylen Jason",1,"Bar Patron (T) (1)",33]

{"sheet":"Stats","index":5,"n_rows":19,"n_cols":4,"rows_kept":19,"cut":false,"hidden":true,"merged":[]}
[null,"Albatros Paradeske"]
[null,"Aanwezigheden","Goals","Assists"]
["Van de Vondel Rob",1]
["Stevens Siebe",1,2]
["Langenaeker Maarten",1]
["De Groof Steven",1]
["De Groof Maarten",1]
["Hofmans Stijn",1,2]
["Van Dessel Dieter",1]
["Celis Ive",1,null,2]
["Verlooy Kaïn"]
["Beirinckx Wout",1,1]
["De Swert Erlend",1]
["Elst Pieter"]
["Verdickt Stijn",1]
["Gielis Bernd",1]
["Coolsaet Joy"]
["Boes Dieuwer",1]
["Beirinckx Jurgen","ng"]