{"text_format":"1","workbook":"xlsx","n_sheets":6,"sheets":["rooster en stand","kalender","export html","spelersstatistieken","Topschutters","Stats"],"not_rendered":{"charts":0,"images":13,"macros":1,"external_links":0,"defined_names":36,"comments":2,"pivot_tables":0},"unopened":[],"bounds":{"document_bytes":16777216,"sheet_cells":100000,"rows_first":2000,"rows_last":500,"rows_between":2000,"halvings":0,"cell_chars":16384,"cell_head_chars":4096},"cells_cut":0,"cells_raw":0,"read":"whole","date_system":"1900"}

{"sheet":"rooster en stand","index":0,"n_rows":43,"n_cols":94,"rows_kept":43,"cut":false,"hidden":false,"merged":[[2,43,3,43],[2,51,3,51],[2,45,3,45],[2,46,3,46],[2,47,3,47],[2,48,3,48],[2,49,3,49],[2,50,3,50],[2,25,3,25],[2,26,3,26],[2,23,3,23],[2,24,3,24],[2,42,3,42],[2,39,3,39],[2,28,3,28],[2,29,3,29],[2,30,3,30],[2,31,3,31],[2,34,3,34],[2,33,3,33],[2,35,3,35],[2,36,3,36],[2,37,3,37],[2,38,3,38],[2,22,3,22],[2,32,3,32],[2,44,3,44],[18,5,18,7],[2,40,3,40],[2,41,3,41],[2,19,3,19],[2,20,3,20],[2,27,3,27],[2,18,3,18],[2,2,2,7],[3,5,3,6],[2,15,3,15],[2,16,3,16],[2,17,3,17],[2,21,3,21]]}
[]
[null,null,"Updated:","2023-11-19T21:23:42",null,"© 2023/2024 - Wim Gielis - wim.gielis@gmail.com - https://www.wimgielis.com"]
[null,null,"LUCYVO",null,null,null,null,null,null,null,null,null,null,null,null,null,{"$f":"P5","v":"Antverpia 98"},{"$f":"P6","v":"Bariton"},{"$f":"P7","v":"Boerenbond"},{"$f":"P8","v":"Goka"},{"$f":"P9","v":"Hoje"},{"$f":"P10","v":"Hombeek"},{"$f":"P11","v":"Jolika"},{"$f":"P12","v":"Lucyvo"},{"$f":"P13","v":"Paradeske"},{"$f":"P14","v":"Pouma United"},{"$f":"P15","v":"Racing Emblem"},{"$f":"P16","v":"De Vrede"},{"$f":"P5","v":"Antverpia 98"},{"$f":"P6","v":"Bariton"},{"$f":"P7","v":"Boerenbond"},{"$f":"P8","v":"Goka"},{"$f":"P9","v":"Hoje"},{"$f":"P10","v":"Hombeek"},{"$f":"P11","v":"Jolika"},{"$f":"P12","v":"Lucyvo"},{"$f":"P13","v":"Paradeske"},{"$f":"P14","v":"Pouma United"},{"$f":"P15","v":"Racing Emblem"},{"$f":"P16","v":"De Vrede"},{"$f":"P5","v":"Antverpia 98"},{"$f":"P6","v":"Bariton"},{"$f":"P7","v":"Boerenbond"},{"$f":"P8","v":"Goka"},{"$f":"P9","v":"Hoje"},{"$f":"P10","v":"Hombeek"},{"$f":"P11","v":"Jolika"},{"$f":"P12","v":"Lucyvo"},{"$f":"P13","v":"Paradeske"},{"$f":"P14","v":"Pouma United"},{"$f":"P15","v":"Racing Emblem"},{"$f":"P16","v":"De Vrede"}]
[null,null,null,"Ploeg","P","M",null,"W","V","G","+","-","S","VP",null,null,null,null,null,null,null,null,null,null,null,null,null,null,null,null,null,null,null,null,null,null,null,null,null,null,null,null,null,null,null,null,null,null,null,null,null,null,null,"Coëfficiënt","Ploeg","Punten","Matchen","W","V","G","D+","D-","DS","Ff","Nr","Coëf sorted",null,null,1,2,3,4,5,6,7,8,9,10,11,12,null,1,2,3,4,5,6,7,8,9,10,11,12]
[null,null,1,{"$f":"VLOOKUP(BN5,HulpberekeningenStand,2,FALSE)","v":"Hoje"},{"$f":"3*H5+J5","v":46},{"$f":"SUM(H5:J5)","v":17},{"$f":"REPT(IF(F5-MODE($F$5:$F$16)<0,\"-\",\"+\"),ABS(F5-MODE($F$5:$F$16)))","v":""},{"$f":"VLOOKUP(BN5,HulpberekeningenStand,5,FALSE)","v":15},{"$f":"VLOOKUP(BN5,HulpberekeningenStand,6,FALSE)","v":1},{"$f":"VLOOKUP(BN5,HulpberekeningenStand,7,FALSE)","v":1},{"$f":"VLOOKUP(BN5,HulpberekeningenStand,8,FALSE)","v":57},{"$f":"VLOOKUP(BN5,HulpberekeningenStand,9,FALSE)","v":22},{"$f":"K5-L5","v":35},{"$f":"3*F5-E5","v":5},null,"Antverpia 98",null,"4-1","0-3","5-2","","","","5-5","5-2","2-3","0-4","4-3",null,9,15,19,23,21,26,12,5,3,11,7,null,"2023-10-29","2024-01-14","2024-02-18","2024-03-17","2024-03-03","2024-04-14","2023-11-19","2023-10-01","2023-09-17","2023-11-12","2023-10-15",null,{"$f":"RANK( BD5, $BD$5:$BD$16, 0 ) - RANK( BE5, $BE$5:$BE$16, 0 ) / 10^2 + RANK( BF5, $BF$5:$BF$16, 0 ) / 10^4 + RANK( BK5, $BK$5:$BK$16, 0 ) / 10^6 + RANK( BI5, $BI$5:$BI$16, 0 ) / 10^8 + BM5 / 10^10","v":4.9205040300999991},{"$f":"P5","v":"Antverpia 98"},{"$f":"3 * BF5 + BH5","v":25},{"$f":"SUM( BF5:BH5 )","v":16},{"$f":"CHOOSE(StandBer,COUNTIF(BQ31:CB31,\"t\")+COUNTIF(BQ31:BQ42,\"u\")+COUNTIF(CD31:CO31,\"t\")+COUNTIF(CD31:CD42,\"u\"),COUNTIF(BQ31:CB31,\"t\")+COUNTIF(BQ31:BQ42,\"u\"),COUNTIF(CD31:CO31,\"t\")+COUNTIF(CD31:CD42,\"u\"),COUNTIF(BQ31:CB31,\"t\")+COUNTIF(CD31:CO31,\"t\"),COUNTIF(BQ31:BQ42,\"u\")+COUNTIF(CD31:CD42,\"u\"))","v":8},{"$f":"CHOOSE(StandBer,COUNTIF(BQ31:CB31,\"u\")+COUNTIF(BQ31:BQ42,\"t\")+COUNTIF(CD31:CO31,\"u\")+COUNTIF(CD31:CD42,\"t\"),COUNTIF(BQ31:CB31,\"u\")+COUNTIF(BQ31:BQ42,\"t\"),COUNTIF(CD31:CO31,\"u\")+COUNTIF(CD31:CD42,\"t\"),COUNTIF(BQ31:CB31,\"u\")+COUNTIF(CD31:CO31,\"u\"),COUNTIF(BQ31:BQ42,\"t\")+COUNTIF(CD31:CD42,\"t\"))+BL5","v":7},{"$f":"CHOOSE(StandBer,COUNTIF(BQ31:CB31,\"g\")+COUNTIF(BQ31:BQ42,\"g\")+COUNTIF(CD31:CO31,\"g\")+COUNTIF(CD31:CD42,\"g\"),COUNTIF(BQ31:CB31,\"g\")+COUNTIF(BQ31:BQ42,\"g\"),COUNTIF(CD31:CO31,\"g\")+COUNTIF(CD31:CD42,\"g\"),COUNTIF(BQ31:CB31,\"g\")+COUNTIF(CD31:CO31,\"g\"),COUNTIF(BQ31:BQ42,\"g\")+COUNTIF(CD31:CD42,\"g\"))","v":1},{"$f":"CHOOSE(StandBer,SUM(BQ5:CB5)+SUM(BQ18:BQ29)+SUM(CD5:CO5)+SUM(CD18:CD29),SUM(BQ5:CB5)+SUM(BQ18:BQ29),SUM(CD5:CO5)+SUM(CD18:CD29),SUM(BQ5:CB5)+SUM(CD5:CO5),SUM(BQ18:BQ29)+SUM(CD18:CD29))-5*BL5","v":46},{"$f":"CHOOSE(StandBer,SUM(BQ5:BQ16)+SUM(BQ18:CB18)+SUM(CD5:CD16)+SUM(CD18:CO18),SUM(BQ5:BQ16)+SUM(BQ18:CB18),SUM(CD5:CD16)+SUM(CD18:CO18),SUM(BQ5:BQ16)+SUM(CD5:CD16),SUM(BQ18:CB18)+SUM(CD18:CO18))","v":40},{"$f":"BI5 - BJ5","v":6},{"$f":"CHOOSE(StandBer,COUNTIF(BQ31:CB31,\"ff\")+COUNTIF(BQ31:BQ42,\"ff\")+COUNTIF(CD31:CO31,\"ff\")+COUNTIF(CD31:CD42,\"ff\"),COUNTIF(BQ31:CB31,\"ff\")+COUNTIF(BQ31:BQ42,\"ff\"),COUNTIF(CD31:CO31,\"ff\")+COUNTIF(CD31:CD42,\"ff\"),COUNTIF(BQ31:CB31,\"ff\")+COUNTIF(CD31:CO31,\"ff\"),COUNTIF(BQ31:BQ42,\"ff\")+COUNTIF(CD31:CD42,\"ff\"))","v":0},1,{"$f":"SMALL( $BB$5:$BB$16, BM5 )","v":0.98010101050000009},null,1,null,{"$f":"IF(OR(ISERROR(FIND(\"-\",R5)),AD5>'export html'!$AR$7),\"\",IF(LEFT(R5,1)<>\"*\",LEFT(R5,FIND(\"-\",R5)-1)-0,MID(R5,2,FIND(\"-\",R5)-2)-0))","v":4},{"$f":"IF(OR(ISERROR(FIND(\"-\",S5)),AE5>'export html'!$AR$7),\"\",IF(LEFT(S5,1)<>\"*\",LEFT(S5,FIND(\"-\",S5)-1)-0,MID(S5,2,FIND(\"-\",S5)-2)-0))","v":""},{"$f":"IF(OR(ISERROR(FIND(\"-\",T5)),AF5>'export html'!$AR$7),\"\",IF(LEFT(T5,1)<>\"*\",LEFT(T5,FIND(\"-\",T5)-1)-0,MID(T5,2,FIND(\"-\",T5)-2)-0))","v":""},{"$f":"IF(OR(ISERROR(FIND(\"-\",U5)),AG5>'export html'!$AR$7),\"\",IF(LEFT(U5,1)<>\"*\",LEFT(U5,FIND(\"-\",U5)-1)-0,MID(U5,2,FIND(\"-\",U5)-2)-0))","v":""},{"$f":"IF(OR(ISERROR(FIND(\"-\",V5)),AH5>'export html'!$AR$7),\"\",IF(LEFT(V5,1)<>\"*\",LEFT(V5,FIND(\"-\",V5)-1)-0,MID(V5,2,FIND(\"-\",V5)-2)-0))","v":""},{"$f":"IF(OR(ISERROR(FIND(\"-\",W5)),AI5>'export html'!$AR$7),\"\",IF(LEFT(W5,1)<>\"*\",LEFT(W5,FIND(\"-\",W5)-1)-0,MID(W5,2,FIND(\"-\",W5)-2)-0))","v":""},{"$f":"IF(OR(ISERROR(FIND(\"-\",X5)),AJ5>'export html'!$AR$7),\"\",IF(LEFT(X5,1)<>\"*\",LEFT(X5,FIND(\"-\",X5)-1)-0,MID(X5,2,FIND(\"-\",X5)-2)-0))","v":""},{"$f":"IF(OR(ISERROR(FIND(\"-\",Y5)),AK5>'export html'!$AR$7),\"\",IF(LEFT(Y5,1)<>\"*\",LEFT(Y5,FIND(\"-\",Y5)-1)-0,MID(Y5,2,FIND(\"-\",Y5)-2)-0))","v":5},{"$f":"IF(OR(ISERROR(FIND(\"-\",Z5)),AL5>'export html'!$AR$7),\"\",IF(LEFT(Z5,1)<>\"*\",LEFT(Z5,FIND(\"-\",Z5)-1)-0,MID(Z5,2,FIND(\"-\",Z5)-2)-0))","v":2},{"$f":"IF(OR(ISERROR(FIND(\"-\",AA5)),AM5>'export html'!$AR$7),\"\",IF(LEFT(AA5,1)<>\"*\",LEFT(AA5,FIND(\"-\",AA5)-1)-0,MID(AA5,2,FIND(\"-\",AA5)-2)-0))","v":0},{"$f":"IF(OR(ISERROR(FIND(\"-\",AB5)),AN5>'export html'!$AR$7),\"\",IF(LEFT(AB5,1)<>\"*\",LEFT(AB5,FIND(\"-\",AB5)-1)-0,MID(AB5,2,FIND(\"-\",AB5)-2)-0))","v":4},1,null,{"$f":"IF(OR(ISERROR(FIND(\"-\",R5)),AD5<='export html'!$AR$7),\"\",IF(LEFT(R5,1)<>\"*\",LEFT(R5,FIND(\"-\",R5)-1)-0,MID(R5,2,FIND(\"-\",R5)-2)-0))","v":""},{"$f":"IF(OR(ISERROR(FIND(\"-\",S5)),AE5<='export html'!$AR$7),\"\",IF(LEFT(S5,1)<>\"*\",LEFT(S5,FIND(\"-\",S5)-1)-0,MID(S5,2,FIND(\"-\",S5)-2)-0))","v":0},{"$f":"IF(OR(ISERROR(FIND(\"-\",T5)),AF5<='export html'!$AR$7),\"\",IF(LEFT(T5,1)<>\"*\",LEFT(T5,FIND(\"-\",T5)-1)-0,MID(T5,2,FIND(\"-\",T5)-2)-0))","v":5},{"$f":"IF(OR(ISERROR(FIND(\"-\",U5)),AG5<='export html'!$AR$7),\"\",IF(LEFT(U5,1)<>\"*\",LEFT(U5,FIND(\"-\",U5)-1)-0,MID(U5,2,FIND(\"-\",U5)-2)-0))","v":""},{"$f":"IF(OR(ISERROR(FIND(\"-\",V5)),AH5<='export html'!$AR$7),\"\",IF(LEFT(V5,1)<>\"*\",LEFT(V5,FIND(\"-\",V5)-1)-0,MID(V5,2,FIND(\"-\",V5)-2)-0))","v":""},{"$f":"IF(OR(ISERROR(FIND(\"-\",W5)),AI5<='export html'!$AR$7),\"\",IF(LEFT(W5,1)<>\"*\",LEFT(W5,FIND(\"-\",W5)-1)-0,MID(W5,2,FIND(\"-\",W5)-2)-0))","v":""},{"$f":"IF(OR(ISERROR(FIND(\"-\",X5)),AJ5<='export html'!$AR$7),\"\",IF(LEFT(X5,1)<>\"*\",LEFT(X5,FIND(\"-\",X5)-1)-0,MID(X5,2,FIND(\"-\",X5)-2)-0))","v":5},{"$f":"IF(OR(ISERROR(FIND(\"-\",Y5)),AK5<='export html'!$AR$7),\"\",IF(LEFT(Y5,1)<>\"*\",LEFT(Y5,FIND(\"-\",Y5)-1)-0,MID(Y5,2,FIND(\"-\",Y5)-2)-0))","v":""},{"$f":"IF(OR(ISERROR(FIND(\"-\",Z5)),AL5<='export html'!$AR$7),\"\",IF(LEFT(Z5,1)<>\"*\",LEFT(Z5,FIND(\"-\",Z5)-1)-0,MID(Z5,2,FIND(\"-\",Z5)-2)-0))","v":""},{"$f":"IF(OR(ISERROR(FIND(\"-\",AA5)),AM5<='export html'!$AR$7),\"\",IF(LEFT(AA5,1)<>\"*\",LEFT(AA5,FIND(\"-\",AA5)-1)-0,MID(AA5,2,FIND(\"-\",AA5)-2)-0))","v":""},{"$f":"IF(OR(ISERROR(FIND(\"-\",AB5)),AN5<='export html'!$AR$7),\"\",IF(LEFT(AB5,1)<>\"*\",LEFT(AB5,FIND(\"-\",AB5)-1)-0,MID(AB5,2,FIND(\"-\",AB5)-2)-0))","v":""},1]
[null,null,{"$f":"IF(RANK(E6,$E$5:$E$16,0)>RANK(E5,$E$5:$E$16,0),RANK(E6,$E$5:$E$16,0),\"\")","v":2},{"$f":"VLOOKUP(BN6,HulpberekeningenStand,2,FALSE)","v":"Pouma United"},36,17,"",{"$f":"VLOOKUP(BN6,HulpberekeningenStand,5,FALSE)","v":11},{"$f":"VLOOKUP(BN6,HulpberekeningenStand,6,FALSE)","v":3},{"$f":"VLOOKUP(BN6,HulpberekeningenStand,7,FALSE)","v":3},{"$f":"VLOOKUP(BN6,HulpberekeningenStand,8,FALSE)","v":55},{"$f":"VLOOKUP(BN6,HulpberekeningenStand,9,FALSE)","v":37},18,15,null,"Bariton","",null,null,"2-0","3-0","7-0","","8-1","*5-0","3-2","0-3","",22,null,12,1,3,15,24,17,7,19,10,21,"2024-03-10",null,"2024-04-07","2023-09-03","2023-09-17","2024-01-14","2024-03-24","2024-01-28","2023-10-15","2024-02-18","2023-11-05","2024-03-03",null,7.920608080200001,"Bariton",{"$f":"3 * BF6 + BH6","v":20},{"$f":"SUM( BF6:BH6 )","v":16},{"$f":"CHOOSE(StandBer,COUNTIF(BQ32:CB32,\"t\")+COUNTIF(BR31:BR42,\"u\")+COUNTIF(CD32:CO32,\"t\")+COUNTIF(CE31:CE42,\"u\"),COUNTIF(BQ32:CB32,\"t\")+COUNTIF(BR31:BR42,\"u\"),COUNTIF(CD32:CO32,\"t\")+COUNTIF(CE31:CE42,\"u\"),COUNTIF(BQ32:CB32,\"t\")+COUNTIF(CD32:CO32,\"t\"),COUNTIF(BR31:BR42,\"u\")+COUNTIF(CE31:CE42,\"u\"))","v":6},{"$f":"CHOOSE(StandBer,COUNTIF(BQ32:CB32,\"u\")+COUNTIF(BR31:BR42,\"t\")+COUNTIF(CD32:CO32,\"u\")+COUNTIF(CE31:CE42,\"t\"),COUNTIF(BQ32:CB32,\"u\")+COUNTIF(BR31:BR42,\"t\"),COUNTIF(CD32:CO32,\"u\")+COUNTIF(CE31:CE42,\"t\"),COUNTIF(BQ32:CB32,\"u\")+COUNTIF(CD32:CO32,\"u\"),COUNTIF(BR31:BR42,\"t\")+COUNTIF(CE31:CE42,\"t\"))+BL6","v":8},{"$f":"CHOOSE(StandBer,COUNTIF(BQ32:CB32,\"g\")+COUNTIF(BR31:BR42,\"g\")+COUNTIF(CD32:CO32,\"g\")+COUNTIF(CE31:CE42,\"g\"),COUNTIF(BQ32:CB32,\"g\")+COUNTIF(BR31:BR42,\"g\"),COUNTIF(CD32:CO32,\"g\")+COUNTIF(CE31:CE42,\"g\"),COUNTIF(BQ32:CB32,\"g\")+COUNTIF(CD32:CO32,\"g\"),COUNTIF(BR31:BR42,\"g\")+COUNTIF(CE31:CE42,\"g\"))","v":2},{"$f":"CHOOSE(StandBer,SUM(BQ6:CB6)+SUM(BR18:BR29)+SUM(CD6:CO6)+SUM(CE18:CE29),SUM(BQ6:CB6)+SUM(BR18:BR29),SUM(CD6:CO6)+SUM(CE18:CE29),SUM(BQ6:CB6)+SUM(CD6:CO6),SUM(BR18:BR29)+SUM(CE18:CE29))-5*BL6","v":40},{"$f":"CHOOSE(StandBer,SUM(BR5:BR16)+SUM(BQ19:CB19)+SUM(CE5:CE16)+SUM(CD19:CO19),SUM(BR5:BR16)+SUM(BQ19:CB19),SUM(CE5:CE16)+SUM(CD19:CO19),SUM(BR5:BR16)+SUM(CE5:CE16),SUM(BQ19:CB19)+SUM(CD19:CO19))","v":40},{"$f":"BI6 - BJ6","v":0},{"$f":"CHOOSE(StandBer,COUNTIF(BQ32:CB32,\"ff\")+COUNTIF(BR31:BR42,\"ff\")+COUNTIF(CD32:CO32,\"ff\")+COUNTIF(CE31:CE42,\"ff\"),COUNTIF(BQ32:CB32,\"ff\")+COUNTIF(BR31:BR42,\"ff\"),COUNTIF(CD32:CO32,\"ff\")+COUNTIF(CE31:CE42,\"ff\"),COUNTIF(BQ32:CB32,\"ff\")+COUNTIF(CD32:CO32,\"ff\"),COUNTIF(BR31:BR42,\"ff\")+COUNTIF(CE31:CE42,\"ff\"))","v":0},2,{"$f":"SMALL( $BB$5:$BB$16, BM6 )","v":1.9802020210000002},null,2,{"$f":"IF(OR(ISERROR(FIND(\"-\",Q6)),AC6>'export html'!$AR$7),\"\",IF(LEFT(Q6,1)<>\"*\",LEFT(Q6,FIND(\"-\",Q6)-1)-0,MID(Q6,2,FIND(\"-\",Q6)-2)-0))","v":""},null,{"$f":"IF(OR(ISERROR(FIND(\"-\",S6)),AE6>'export html'!$AR$7),\"\",IF(LEFT(S6,1)<>\"*\",LEFT(S6,FIND(\"-\",S6)-1)-0,MID(S6,2,FIND(\"-\",S6)-2)-0))","v":""},{"$f":"IF(OR(ISERROR(FIND(\"-\",T6)),AF6>'export html'!$AR$7),\"\",IF(LEFT(T6,1)<>\"*\",LEFT(T6,FIND(\"-\",T6)-1)-0,MID(T6,2,FIND(\"-\",T6)-2)-0))","v":2},{"$f":"IF(OR(ISERROR(FIND(\"-\",U6)),AG6>'export html'!$AR$7),\"\",IF(LEFT(U6,1)<>\"*\",LEFT(U6,FIND(\"-\",U6)-1)-0,MID(U6,2,FIND(\"-\",U6)-2)-0))","v":3},{"$f":"IF(OR(ISERROR(FIND(\"-\",V6)),AH6>'export html'!$AR$7),\"\",IF(LEFT(V6,1)<>\"*\",LEFT(V6,FIND(\"-\",V6)-1)-0,MID(V6,2,FIND(\"-\",V6)-2)-0))","v":""},{"$f":"IF(OR(ISERROR(FIND(\"-\",W6)),AI6>'export html'!$AR$7),\"\",IF(LEFT(W6,1)<>\"*\",LEFT(W6,FIND(\"-\",W6)-1)-0,MID(W6,2,FIND(\"-\",W6)-2)-0))","v":""},{"$f":"IF(OR(ISERROR(FIND(\"-\",X6)),AJ6>'export html'!$AR$7),\"\",IF(LEFT(X6,1)<>\"*\",LEFT(X6,FIND(\"-\",X6)-1)-0,MID(X6,2,FIND(\"-\",X6)-2)-0))","v":""},{"$f":"IF(OR(ISERROR(FIND(\"-\",Y6)),AK6>'export html'!$AR$7),\"\",IF(LEFT(Y6,1)<>\"*\",LEFT(Y6,FIND(\"-\",Y6)-1)-0,MID(Y6,2,FIND(\"-\",Y6)-2)-0))","v":5},{"$f":"IF(OR(ISERROR(FIND(\"-\",Z6)),AL6>'export html'!$AR$7),\"\",IF(LEFT(Z6,1)<>\"*\",LEFT(Z6,FIND(\"-\",Z6)-1)-0,MID(Z6,2,FIND(\"-\",Z6)-2)-0))","v":""},{"$f":"IF(OR(ISERROR(FIND(\"-\",AA6)),AM6>'export html'!$AR$7),\"\",IF(LEFT(AA6,1)<>\"*\",LEFT(AA6,FIND(\"-\",AA6)-1)-0,MID(AA6,2,FIND(\"-\",AA6)-2)-0))","v":0},{"$f":"IF(OR(ISERROR(FIND(\"-\",AB6)),AN6>'export html'!$AR$7),\"\",IF(LEFT(AB6,1)<>\"*\",LEFT(AB6,FIND(\"-\",AB6)-1)-0,MID(AB6,2,FIND(\"-\",AB6)-2)-0))","v":""},2,{"$f":"IF(OR(ISERROR(FIND(\"-\",Q6)),AC6<='export html'!$AR$7),\"\",IF(LEFT(Q6,1)<>\"*\",LEFT(Q6,FIND(\"-\",Q6)-1)-0,MID(Q6,2,FIND(\"-\",Q6)-2)-0))","v":""},null,{"$f":"IF(OR(ISERROR(FIND(\"-\",S6)),AE6<='export html'!$AR$7),\"\",IF(LEFT(S6,1)<>\"*\",LEFT(S6,FIND(\"-\",S6)-1)-0,MID(S6,2,FIND(\"-\",S6)-2)-0))","v":""},{"$f":"IF(OR(ISERROR(FIND(\"-\",T6)),AF6<='export html'!$AR$7),\"\",IF(LEFT(T6,1)<>\"*\",LEFT(T6,FIND(\"-\",T6)-1)-0,MID(T6,2,FIND(\"-\",T6)-2)-0))","v":""},{"$f":"IF(OR(ISERROR(FIND(\"-\",U6)),AG6<='export html'!$AR$7),\"\",IF(LEFT(U6,1)<>\"*\",LEFT(U6,FIND(\"-\",U6)-1)-0,MID(U6,2,FIND(\"-\",U6)-2)-0))","v":""},{"$f":"IF(OR(ISERROR(FIND(\"-\",V6)),AH6<='export html'!$AR$7),\"\",IF(LEFT(V6,1)<>\"*\",LEFT(V6,FIND(\"-\",V6)-1)-0,MID(V6,2,FIND(\"-\",V6)-2)-0))","v":7},{"$f":"IF(OR(ISERROR(FIND(\"-\",W6)),AI6<='export html'!$AR$7),\"\",IF(LEFT(W6,1)<>\"*\",LEFT(W6,FIND(\"-\",W6)-1)-0,MID(W6,2,FIND(\"-\",W6)-2)-0))","v":""},{"$f":"IF(OR(ISERROR(FIND(\"-\",X6)),AJ6<='export html'!$AR$7),\"\",IF(LEFT(X6,1)<>\"*\",LEFT(X6,FIND(\"-\",X6)-1)-0,MID(X6,2,FIND(\"-\",X6)-2)-0))","v":8},{"$f":"IF(OR(ISERROR(FIND(\"-\",Y6)),AK6<='export html'!$AR$7),\"\",IF(LEFT(Y6,1)<>\"*\",LEFT(Y6,FIND(\"-\",Y6)-1)-0,MID(Y6,2,FIND(\"-\",Y6)-2)-0))","v":""},{"$f":"IF(OR(ISERROR(FIND(\"-\",Z6)),AL6<='export html'!$AR$7),\"\",IF(LEFT(Z6,1)<>\"*\",LEFT(Z6,FIND(\"-\",Z6)-1)-0,MID(Z6,2,FIND(\"-\",Z6)-2)-0))","v":3},{"$f":"IF(OR(ISERROR(FIND(\"-\",AA6)),AM6<='export html'!$AR$7),\"\",IF(LEFT(AA6,1)<>\"*\",LEFT(AA6,FIND(\"-\",AA6)-1)-0,MID(AA6,2,FIND(\"-\",AA6)-2)-0))","v":""},{"$f":"IF(OR(ISERROR(FIND(\"-\",AB6)),AN6<='export html'!$AR$7),\"\",IF(LEFT(AB6,1)<>\"*\",LEFT(AB6,FIND(\"-\",AB6)-1)-0,MID(AB6,2,FIND(\"-\",AB6)-2)-0))","v":""},2]
[null,null,3,{"$f":"VLOOKUP(BN7,HulpberekeningenStand,2,FALSE)","v":"Boerenbond"},30,17,"",{"$f":"VLOOKUP(BN7,HulpberekeningenStand,5,FALSE)","v":9},{"$f":"VLOOKUP(BN7,HulpberekeningenStand,6,FALSE)","v":5},{"$f":"VLOOKUP(BN7,HulpberekeningenStand,7,FALSE)","v":3},{"$f":"VLOOKUP(BN7,HulpberekeningenStand,8,FALSE)","v":46},{"$f":"VLOOKUP(BN7,HulpberekeningenStand,9,FALSE)","v":31},15,21,null,"Boerenbond","4-1","7-0",null,"4-0","3-4","2-2","1-0","3-0","","0-3","2-1","3-2",2,25,null,17,19,5,14,7,23,9,13,11,"2023-12-10","2023-11-19",null,"2024-01-28","2024-02-18","2023-10-01","2023-12-23","2023-10-15","2024-03-17","2023-10-29","2023-11-26","2023-11-12",null,2.9803030303,"Boerenbond",30,17,{"$f":"CHOOSE(StandBer,COUNTIF(BQ33:CB33,\"t\")+COUNTIF(BS31:BS42,\"u\")+COUNTIF(CD33:CO33,\"t\")+COUNTIF(CF31:CF42,\"u\"),COUNTIF(BQ33:CB33,\"t\")+COUNTIF(BS31:BS42,\"u\"),COUNTIF(CD33:CO33,\"t\")+COUNTIF(CF31:CF42,\"u\"),COUNTIF(BQ33:CB33,\"t\")+COUNTIF(CD33:CO33,\"t\"),COUNTIF(BS31:BS42,\"u\")+COUNTIF(CF31:CF42,\"u\"))","v":9},{"$f":"CHOOSE(StandBer,COUNTIF(BQ33:CB33,\"u\")+COUNTIF(BS31:BS42,\"t\")+COUNTIF(CD33:CO33,\"u\")+COUNTIF(CF31:CF42,\"t\"),COUNTIF(BQ33:CB33,\"u\")+COUNTIF(BS31:BS42,\"t\"),COUNTIF(CD33:CO33,\"u\")+COUNTIF(CF31:CF42,\"t\"),COUNTIF(BQ33:CB33,\"u\")+COUNTIF(CD33:CO33,\"u\"),COUNTIF(BS31:BS42,\"t\")+COUNTIF(CF31:CF42,\"t\"))+BL7","v":5},{"$f":"CHOOSE(StandBer,COUNTIF(BQ33:CB33,\"g\")+COUNTIF(BS31:BS42,\"g\")+COUNTIF(CD33:CO33,\"g\")+COUNTIF(CF31:CF42,\"g\"),COUNTIF(BQ33:CB33,\"g\")+COUNTIF(BS31:BS42,\"g\"),COUNTIF(CD33:CO33,\"g\")+COUNTIF(CF31:CF42,\"g\"),COUNTIF(BQ33:CB33,\"g\")+COUNTIF(CD33:CO33,\"g\"),COUNTIF(BS31:BS42,\"g\")+COUNTIF(CF31:CF42,\"g\"))","v":3},{"$f":"CHOOSE(StandBer,SUM(BQ7:CB7)+SUM(BS18:BS29)+SUM(CD7:CO7)+SUM(CF18:CF29),SUM(BQ7:CB7)+SUM(BS18:BS29),SUM(CD7:CO7)+SUM(CF18:CF29),SUM(BQ7:CB7)+SUM(CD7:CO7),SUM(BS18:BS29)+SUM(CF18:CF29))-5*BL7","v":46},{"$f":"CHOOSE(StandBer,SUM(BS5:BS16)+SUM(BQ20:CB20)+SUM(CF5:CF16)+SUM(CD20:CO20),SUM(BS5:BS16)+SUM(BQ20:CB20),SUM(CF5:CF16)+SUM(CD20:CO20),SUM(BS5:BS16)+SUM(CF5:CF16),SUM(BQ20:CB20)+SUM(CD20:CO20))","v":31},15,{"$f":"CHOOSE(StandBer,COUNTIF(BQ33:CB33,\"ff\")+COUNTIF(BS31:BS42,\"ff\")+COUNTIF(CD33:CO33,\"ff\")+COUNTIF(CF31:CF42,\"ff\"),COUNTIF(BQ33:CB33,\"ff\")+COUNTIF(BS31:BS42,\"ff\"),COUNTIF(CD33:CO33,\"ff\")+COUNTIF(CF31:CF42,\"ff\"),COUNTIF(BQ33:CB33,\"ff\")+COUNTIF(CD33:CO33,\"ff\"),COUNTIF(BS31:BS42,\"ff\")+COUNTIF(CF31:CF42,\"ff\"))","v":0},3,2.9803030303,null,3,{"$f":"IF(OR(ISERROR(FIND(\"-\",Q7)),AC7>'export html'!$AR$7),\"\",IF(LEFT(Q7,1)<>\"*\",LEFT(Q7,FIND(\"-\",Q7)-1)-0,MID(Q7,2,FIND(\"-\",Q7)-2)-0))","v":4},{"$f":"IF(OR(ISERROR(FIND(\"-\",R7)),AD7>'export html'!$AR$7),\"\",IF(LEFT(R7,1)<>\"*\",LEFT(R7,FIND(\"-\",R7)-1)-0,MID(R7,2,FIND(\"-\",R7)-2)-0))","v":""},null,{"$f":"IF(OR(ISERROR(FIND(\"-\",T7)),AF7>'export html'!$AR$7),\"\",IF(LEFT(T7,1)<>\"*\",LEFT(T7,FIND(\"-\",T7)-1)-0,MID(T7,2,FIND(\"-\",T7)-2)-0))","v":""},{"$f":"IF(OR(ISERROR(FIND(\"-\",U7)),AG7>'export html'!$AR$7),\"\",IF(LEFT(U7,1)<>\"*\",LEFT(U7,FIND(\"-\",U7)-1)-0,MID(U7,2,FIND(\"-\",U7)-2)-0))","v":""},{"$f":"IF(OR(ISERROR(FIND(\"-\",V7)),AH7>'export html'!$AR$7),\"\",IF(LEFT(V7,1)<>\"*\",LEFT(V7,FIND(\"-\",V7)-1)-0,MID(V7,2,FIND(\"-\",V7)-2)-0))","v":2},{"$f":"IF(OR(ISERROR(FIND(\"-\",W7)),AI7>'export html'!$AR$7),\"\",IF(LEFT(W7,1)<>\"*\",LEFT(W7,FIND(\"-\",W7)-1)-0,MID(W7,2,FIND(\"-\",W7)-2)-0))","v":""},{"$f":"IF(OR(ISERROR(FIND(\"-\",X7)),AJ7>'export html'!$AR$7),\"\",IF(LEFT(X7,1)<>\"*\",LEFT(X7,FIND(\"-\",X7)-1)-0,MID(X7,2,FIND(\"-\",X7)-2)-0))","v":3},{"$f":"IF(OR(ISERROR(FIND(\"-\",Y7)),AK7>'export html'!$AR$7),\"\",IF(LEFT(Y7,1)<>\"*\",LEFT(Y7,FIND(\"-\",Y7)-1)-0,MID(Y7,2,FIND(\"-\",Y7)-2)-0))","v":""},{"$f":"IF(OR(ISERROR(FIND(\"-\",Z7)),AL7>'export html'!$AR$7),\"\",IF(LEFT(Z7,1)<>\"*\",LEFT(Z7,FIND(\"-\",Z7)-1)-0,MID(Z7,2,FIND(\"-\",Z7)-2)-0))","v":0},{"$f":"IF(OR(ISERROR(FIND(\"-\",AA7)),AM7>'export html'!$AR$7),\"\",IF(LEFT(AA7,1)<>\"*\",LEFT(AA7,FIND(\"-\",AA7)-1)-0,MID(AA7,2,FIND(\"-\",AA7)-2)-0))","v":""},{"$f":"IF(OR(ISERROR(FIND(\"-\",AB7)),AN7>'export html'!$AR$7),\"\",IF(LEFT(AB7,1)<>\"*\",LEFT(AB7,FIND(\"-\",AB7)-1)-0,MID(AB7,2,FIND(\"-\",AB7)-2)-0))","v":3},3,{"$f":"IF(OR(ISERROR(FIND(\"-\",Q7)),AC7<='export html'!$AR$7),\"\",IF(LEFT(Q7,1)<>\"*\",LEFT(Q7,FIND(\"-\",Q7)-1)-0,MID(Q7,2,FIND(\"-\",Q7)-2)-0))","v":""},{"$f":"IF(OR(ISERROR(FIND(\"-\",R7)),AD7<='export html'!$AR$7),\"\",IF(LEFT(R7,1)<>\"*\",LEFT(R7,FIND(\"-\",R7)-1)-0,MID(R7,2,FIND(\"-\",R7)-2)-0))","v":7},null,{"$f":"IF(OR(ISERROR(FIND(\"-\",T7)),AF7<='export html'!$AR$7),\"\",IF(LEFT(T7,1)<>\"*\",LEFT(T7,FIND(\"-\",T7)-1)-0,MID(T7,2,FIND(\"-\",T7)-2)-0))","v":4},{"$f":"IF(OR(ISERROR(FIND(\"-\",U7)),AG7<='export html'!$AR$7),\"\",IF(LEFT(U7,1)<>\"*\",LEFT(U7,FIND(\"-\",U7)-1)-0,MID(U7,2,FIND(\"-\",U7)-2)-0))","v":3},{"$f":"IF(OR(ISERROR(FIND(\"-\",V7)),AH7<='export html'!$AR$7),\"\",IF(LEFT(V7,1)<>\"*\",LEFT(V7,FIND(\"-\",V7)-1)-0,MID(V7,2,FIND(\"-\",V7)-2)-0))","v":""},{"$f":"IF(OR(ISERROR(FIND(\"-\",W7)),AI7<='export html'!$AR$7),\"\",IF(LEFT(W7,1)<>\"*\",LEFT(W7,FIND(\"-\",W7)-1)-0,MID(W7,2,FIND(\"-\",W7)-2)-0))","v":1},{"$f":"IF(OR(ISERROR(FIND(\"-\",X7)),AJ7<='export html'!$AR$7),\"\",IF(LEFT(X7,1)<>\"*\",LEFT(X7,FIND(\"-\",X7)-1)-0,MID(X7,2,FIND(\"-\",X7)-2)-0))","v":""},{"$f":"IF(OR(ISERROR(FIND(\"-\",Y7)),AK7<='export html'!$AR$7),\"\",IF(LEFT(Y7,1)<>\"*\",LEFT(Y7,FIND(\"-\",Y7)-1)-0,MID(Y7,2,FIND(\"-\",Y7)-2)-0))","v":""},{"$f":"IF(OR(ISERROR(FIND(\"-\",Z7)),AL7<='export html'!$AR$7),\"\",IF(LEFT(Z7,1)<>\"*\",LEFT(Z7,FIND(\"-\",Z7)-1)-0,MID(Z7,2,FIND(\"-\",Z7)-2)-0))","v":""},{"$f":"IF(OR(ISERROR(FIND(\"-\",AA7)),AM7<='export html'!$AR$7),\"\",IF(LEFT(AA7,1)<>\"*\",LEFT(AA7,FIND(\"-\",AA7)-1)-0,MID(AA7,2,FIND(\"-\",AA7)-2)-0))","v":2},{"$f":"IF(OR(ISERROR(FIND(\"-\",AB7)),AN7<='export html'!$AR$7),\"\",IF(LEFT(AB7,1)<>\"*\",LEFT(AB7,FIND(\"-\",AB7)-1)-0,MID(AB7,2,FIND(\"-\",AB7)-2)-0))","v":""},3]
[null,null,4,{"$f":"VLOOKUP(BN8,HulpberekeningenStand,2,FALSE)","v":"Hombeek"},{"$f":"3*H8+J8","v":28},{"$f":"SUM(H8:J8)","v":17},"",{"$f":"VLOOKUP(BN8,HulpberekeningenStand,5,FALSE)","v":9},{"$f":"VLOOKUP(BN8,HulpberekeningenStand,6,FALSE)","v":7},{"$f":"VLOOKUP(BN8,HulpberekeningenStand,7,FALSE)","v":1},{"$f":"VLOOKUP(BN8,HulpberekeningenStand,8,FALSE)","v":44},{"$f":"VLOOKUP(BN8,HulpberekeningenStand,9,FALSE)","v":42},{"$f":"K8-L8","v":2},{"$f":"3*F8-E8","v":23},null,"Goka","0-1","2-2","2-2",null,"","4-0","3-1","4-2","","2-5","6-1","3-2",6,14,4,null,21,7,16,9,25,11,2,13,"2023-10-08","2023-12-03","2023-09-24",null,"2024-03-03","2023-10-15","2024-02-11","2023-10-29","2024-04-07","2023-11-12","2023-09-10","2023-11-26",null,6.9806060904000011,"Goka",21,17,{"$f":"CHOOSE(StandBer,COUNTIF(BQ34:CB34,\"t\")+COUNTIF(BT31:BT42,\"u\")+COUNTIF(CD34:CO34,\"t\")+COUNTIF(CG31:CG42,\"u\"),COUNTIF(BQ34:CB34,\"t\")+COUNTIF(BT31:BT42,\"u\"),COUNTIF(CD34:CO34,\"t\")+COUNTIF(CG31:CG42,\"u\"),COUNTIF(BQ34:CB34,\"t\")+COUNTIF(CD34:CO34,\"t\"),COUNTIF(BT31:BT42,\"u\")+COUNTIF(CG31:CG42,\"u\"))","v":6},{"$f":"CHOOSE(StandBer,COUNTIF(BQ34:CB34,\"u\")+COUNTIF(BT31:BT42,\"t\")+COUNTIF(CD34:CO34,\"u\")+COUNTIF(CG31:CG42,\"t\"),COUNTIF(BQ34:CB34,\"u\")+COUNTIF(BT31:BT42,\"t\"),COUNTIF(CD34:CO34,\"u\")+COUNTIF(CG31:CG42,\"t\"),COUNTIF(BQ34:CB34,\"u\")+COUNTIF(CD34:CO34,\"u\"),COUNTIF(BT31:BT42,\"t\")+COUNTIF(CG31:CG42,\"t\"))+BL8","v":8},{"$f":"CHOOSE(StandBer,COUNTIF(BQ34:CB34,\"g\")+COUNTIF(BT31:BT42,\"g\")+COUNTIF(CD34:CO34,\"g\")+COUNTIF(CG31:CG42,\"g\"),COUNTIF(BQ34:CB34,\"g\")+COUNTIF(BT31:BT42,\"g\"),COUNTIF(CD34:CO34,\"g\")+COUNTIF(CG31:CG42,\"g\"),COUNTIF(BQ34:CB34,\"g\")+COUNTIF(CD34:CO34,\"g\"),COUNTIF(BT31:BT42,\"g\")+COUNTIF(CG31:CG42,\"g\"))","v":3},{"$f":"CHOOSE(StandBer,SUM(BQ8:CB8)+SUM(BT18:BT29)+SUM(CD8:CO8)+SUM(CG18:CG29),SUM(BQ8:CB8)+SUM(BT18:BT29),SUM(CD8:CO8)+SUM(CG18:CG29),SUM(BQ8:CB8)+SUM(CD8:CO8),SUM(BT18:BT29)+SUM(CG18:CG29))-5*BL8","v":37},{"$f":"CHOOSE(StandBer,SUM(BT5:BT16)+SUM(BQ21:CB21)+SUM(CG5:CG16)+SUM(CD21:CO21),SUM(BT5:BT16)+SUM(BQ21:CB21),SUM(CG5:CG16)+SUM(CD21:CO21),SUM(BT5:BT16)+SUM(CG5:CG16),SUM(BQ21:CB21)+SUM(CD21:CO21))","v":36},1,{"$f":"CHOOSE(StandBer,COUNTIF(BQ34:CB34,\"ff\")+COUNTIF(BT31:BT42,\"ff\")+COUNTIF(CD34:CO34,\"ff\")+COUNTIF(CG31:CG42,\"ff\"),COUNTIF(BQ34:CB34,\"ff\")+COUNTIF(BT31:BT42,\"ff\"),COUNTIF(CD34:CO34,\"ff\")+COUNTIF(CG31:CG42,\"ff\"),COUNTIF(BQ34:CB34,\"ff\")+COUNTIF(CD34:CO34,\"ff\"),COUNTIF(BT31:BT42,\"ff\")+COUNTIF(CG31:CG42,\"ff\"))","v":0},4,3.9803050606000001,null,4,{"$f":"IF(OR(ISERROR(FIND(\"-\",Q8)),AC8>'export html'!$AR$7),\"\",IF(LEFT(Q8,1)<>\"*\",LEFT(Q8,FIND(\"-\",Q8)-1)-0,MID(Q8,2,FIND(\"-\",Q8)-2)-0))","v":0},{"$f":"IF(OR(ISERROR(FIND(\"-\",R8)),AD8>'export html'!$AR$7),\"\",IF(LEFT(R8,1)<>\"*\",LEFT(R8,FIND(\"-\",R8)-1)-0,MID(R8,2,FIND(\"-\",R8)-2)-0))","v":""},{"$f":"IF(OR(ISERROR(FIND(\"-\",S8)),AE8>'export html'!$AR$7),\"\",IF(LEFT(S8,1)<>\"*\",LEFT(S8,FIND(\"-\",S8)-1)-0,MID(S8,2,FIND(\"-\",S8)-2)-0))","v":2},null,{"$f":"IF(OR(ISERROR(FIND(\"-\",U8)),AG8>'export html'!$AR$7),\"\",IF(LEFT(U8,1)<>\"*\",LEFT(U8,FIND(\"-\",U8)-1)-0,MID(U8,2,FIND(\"-\",U8)-2)-0))","v":""},{"$f":"IF(OR(ISERROR(FIND(\"-\",V8)),AH8>'export html'!$AR$7),\"\",IF(LEFT(V8,1)<>\"*\",LEFT(V8,FIND(\"-\",V8)-1)-0,MID(V8,2,FIND(\"-\",V8)-2)-0))","v":4},{"$f":"IF(OR(ISERROR(FIND(\"-\",W8)),AI8>'export html'!$AR$7),\"\",IF(LEFT(W8,1)<>\"*\",LEFT(W8,FIND(\"-\",W8)-1)-0,MID(W8,2,FIND(\"-\",W8)-2)-0))","v":""},{"$f":"IF(OR(ISERROR(FIND(\"-\",X8)),AJ8>'export html'!$AR$7),\"\",IF(LEFT(X8,1)<>\"*\",LEFT(X8,FIND(\"-\",X8)-1)-0,MID(X8,2,FIND(\"-\",X8)-2)-0))","v":4},{"$f":"IF(OR(ISERROR(FIND(\"-\",Y8)),AK8>'export html'!$AR$7),\"\",IF(LEFT(Y8,1)<>\"*\",LEFT(Y8,FIND(\"-\",Y8)-1)-0,MID(Y8,2,FIND(\"-\",Y8)-2)-0))","v":""},{"$f":"IF(OR(ISERROR(FIND(\"-\",Z8)),AL8>'export html'!$AR$7),\"\",IF(LEFT(Z8,1)<>\"*\",LEFT(Z8,FIND(\"-\",Z8)-1)-0,MID(Z8,2,FIND(\"-\",Z8)-2)-0))","v":2},{"$f":"IF(OR(ISERROR(FIND(\"-\",AA8)),AM8>'export html'!$AR$7),\"\",IF(LEFT(AA8,1)<>\"*\",LEFT(AA8,FIND(\"-\",AA8)-1)-0,MID(AA8,2,FIND(\"-\",AA8)-2)-0))","v":6},{"$f":"IF(OR(ISERROR(FIND(\"-\",AB8)),AN8>'export html'!$AR$7),\"\",IF(LEFT(AB8,1)<>\"*\",LEFT(AB8,FIND(\"-\",AB8)-1)-0,MID(AB8,2,FIND(\"-\",AB8)-2)-0))","v":""},4,{"$f":"IF(OR(ISERROR(FIND(\"-\",Q8)),AC8<='export html'!$AR$7),\"\",IF(LEFT(Q8,1)<>\"*\",LEFT(Q8,FIND(\"-\",Q8)-1)-0,MID(Q8,2,FIND(\"-\",Q8)-2)-0))","v":""},{"$f":"IF(OR(ISERROR(FIND(\"-\",R8)),AD8<='export html'!$AR$7),\"\",IF(LEFT(R8,1)<>\"*\",LEFT(R8,FIND(\"-\",R8)-1)-0,MID(R8,2,FIND(\"-\",R8)-2)-0))","v":2},{"$f":"IF(OR(ISERROR(FIND(\"-\",S8)),AE8<='export html'!$AR$7),\"\",IF(LEFT(S8,1)<>\"*\",LEFT(S8,FIND(\"-\",S8)-1)-0,MID(S8,2,FIND(\"-\",S8)-2)-0))","v":""},null,{"$f":"IF(OR(ISERROR(FIND(\"-\",U8)),AG8<='export html'!$AR$7),\"\",IF(LEFT(U8,1)<>\"*\",LEFT(U8,FIND(\"-\",U8)-1)-0,MID(U8,2,FIND(\"-\",U8)-2)-0))","v":""},{"$f":"IF(OR(ISERROR(FIND(\"-\",V8)),AH8<='export html'!$AR$7),\"\",IF(LEFT(V8,1)<>\"*\",LEFT(V8,FIND(\"-\",V8)-1)-0,MID(V8,2,FIND(\"-\",V8)-2)-0))","v":""},{"$f":"IF(OR(ISERROR(FIND(\"-\",W8)),AI8<='export html'!$AR$7),\"\",IF(LEFT(W8,1)<>\"*\",LEFT(W8,FIND(\"-\",W8)-1)-0,MID(W8,2,FIND(\"-\",W8)-2)-0))","v":3},{"$f":"IF(OR(ISERROR(FIND(\"-\",X8)),AJ8<='export html'!$AR$7),\"\",IF(LEFT(X8,1)<>\"*\",LEFT(X8,FIND(\"-\",X8)-1)-0,MID(X8,2,FIND(\"-\",X8)-2)-0))","v":""},{"$f":"IF(OR(ISERROR(FIND(\"-\",Y8)),AK8<='export html'!$AR$7),\"\",IF(LEFT(Y8,1)<>\"*\",LEFT(Y8,FIND(\"-\",Y8)-1)-0,MID(Y8,2,FIND(\"-\",Y8)-2)-0))","v":""},{"$f":"IF(OR(ISERROR(FIND(\"-\",Z8)),AL8<='export html'!$AR$7),\"\",IF(LEFT(Z8,1)<>\"*\",LEFT(Z8,FIND(\"-\",Z8)-1)-0,MID(Z8,2,FIND(\"-\",Z8)-2)-0))","v":""},{"$f":"IF(OR(ISERROR(FIND(\"-\",AA8)),AM8<='export html'!$AR$7),\"\",IF(LEFT(AA8,1)<>\"*\",LEFT(AA8,FIND(\"-\",AA8)-1)-0,MID(AA8,2,FIND(\"-\",AA8)-2)-0))","v":""},{"$f":"IF(OR(ISERROR(FIND(\"-\",AB8)),AN8<='export html'!$AR$7),\"\",IF(LEFT(AB8,1)<>\"*\",LEFT(AB8,FIND(\"-\",AB8)-1)-0,MID(AB8,2,FIND(\"-\",AB8)-2)-0))","v":3},4]
[null,null,5,"Antverpia 98",25,16,"-",8,7,1,46,40,6,23,null,"Hoje","3-0","4-1","4-1","1-0",null,"","6-0","3-2","3-1","7-3","3-1","4-4",10,16,6,8,null,22,18,11,14,13,4,2,"2023-11-05","2024-02-11","2023-10-08","2023-10-22",null,"2024-03-10","2024-02-04","2023-11-12","2023-12-03","2023-11-26","2023-09-24","2023-09-10",null,0.98010101050000009,"Hoje",46,17,{"$f":"CHOOSE(StandBer,COUNTIF(BQ35:CB35,\"t\")+COUNTIF(BU31:BU42,\"u\")+COUNTIF(CD35:CO35,\"t\")+COUNTIF(CH31:CH42,\"u\"),COUNTIF(BQ35:CB35,\"t\")+COUNTIF(BU31:BU42,\"u\"),COUNTIF(CD35:CO35,\"t\")+COUNTIF(CH31:CH42,\"u\"),COUNTIF(BQ35:CB35,\"t\")+COUNTIF(CD35:CO35,\"t\"),COUNTIF(BU31:BU42,\"u\")+COUNTIF(CH31:CH42,\"u\"))","v":15},{"$f":"CHOOSE(StandBer,COUNTIF(BQ35:CB35,\"u\")+COUNTIF(BU31:BU42,\"t\")+COUNTIF(CD35:CO35,\"u\")+COUNTIF(CH31:CH42,\"t\"),COUNTIF(BQ35:CB35,\"u\")+COUNTIF(BU31:BU42,\"t\"),COUNTIF(CD35:CO35,\"u\")+COUNTIF(CH31:CH42,\"t\"),COUNTIF(BQ35:CB35,\"u\")+COUNTIF(CD35:CO35,\"u\"),COUNTIF(BU31:BU42,\"t\")+COUNTIF(CH31:CH42,\"t\"))+BL9","v":1},{"$f":"CHOOSE(StandBer,COUNTIF(BQ35:CB35,\"g\")+COUNTIF(BU31:BU42,\"g\")+COUNTIF(CD35:CO35,\"g\")+COUNTIF(CH31:CH42,\"g\"),COUNTIF(BQ35:CB35,\"g\")+COUNTIF(BU31:BU42,\"g\"),COUNTIF(CD35:CO35,\"g\")+COUNTIF(CH31:CH42,\"g\"),COUNTIF(BQ35:CB35,\"g\")+COUNTIF(CD35:CO35,\"g\"),COUNTIF(BU31:BU42,\"g\")+COUNTIF(CH31:CH42,\"g\"))","v":1},{"$f":"CHOOSE(StandBer,SUM(BQ9:CB9)+SUM(BU18:BU29)+SUM(CD9:CO9)+SUM(CH18:CH29),SUM(BQ9:CB9)+SUM(BU18:BU29),SUM(CD9:CO9)+SUM(CH18:CH29),SUM(BQ9:CB9)+SUM(CD9:CO9),SUM(BU18:BU29)+SUM(CH18:CH29))-5*BL9","v":57},{"$f":"CHOOSE(StandBer,SUM(BU5:BU16)+SUM(BQ22:CB22)+SUM(CH5:CH16)+SUM(CD22:CO22),SUM(BU5:BU16)+SUM(BQ22:CB22),SUM(CH5:CH16)+SUM(CD22:CO22),SUM(BU5:BU16)+SUM(CH5:CH16),SUM(BQ22:CB22)+SUM(CD22:CO22))","v":22},35,{"$f":"CHOOSE(StandBer,COUNTIF(BQ35:CB35,\"ff\")+COUNTIF(BU31:BU42,\"ff\")+COUNTIF(CD35:CO35,\"ff\")+COUNTIF(CH31:CH42,\"ff\"),COUNTIF(BQ35:CB35,\"ff\")+COUNTIF(BU31:BU42,\"ff\"),COUNTIF(CD35:CO35,\"ff\")+COUNTIF(CH31:CH42,\"ff\"),COUNTIF(BQ35:CB35,\"ff\")+COUNTIF(CD35:CO35,\"ff\"),COUNTIF(BU31:BU42,\"ff\")+COUNTIF(CH31:CH42,\"ff\"))","v":0},5,4.9205040300999991,null,5,{"$f":"IF(OR(ISERROR(FIND(\"-\",Q9)),AC9>'export html'!$AR$7),\"\",IF(LEFT(Q9,1)<>\"*\",LEFT(Q9,FIND(\"-\",Q9)-1)-0,MID(Q9,2,FIND(\"-\",Q9)-2)-0))","v":3},{"$f":"IF(OR(ISERROR(FIND(\"-\",R9)),AD9>'export html'!$AR$7),\"\",IF(LEFT(R9,1)<>\"*\",LEFT(R9,FIND(\"-\",R9)-1)-0,MID(R9,2,FIND(\"-\",R9)-2)-0))","v":""},{"$f":"IF(OR(ISERROR(FIND(\"-\",S9)),AE9>'export html'!$AR$7),\"\",IF(LEFT(S9,1)<>\"*\",LEFT(S9,FIND(\"-\",S9)-1)-0,MID(S9,2,FIND(\"-\",S9)-2)-0))","v":4},{"$f":"IF(OR(ISERROR(FIND(\"-\",T9)),AF9>'export html'!$AR$7),\"\",IF(LEFT(T9,1)<>\"*\",LEFT(T9,FIND(\"-\",T9)-1)-0,MID(T9,2,FIND(\"-\",T9)-2)-0))","v":1},null,{"$f":"IF(OR(ISERROR(FIND(\"-\",V9)),AH9>'export html'!$AR$7),\"\",IF(LEFT(V9,1)<>\"*\",LEFT(V9,FIND(\"-\",V9)-1)-0,MID(V9,2,FIND(\"-\",V9)-2)-0))","v":""},{"$f":"IF(OR(ISERROR(FIND(\"-\",W9)),AI9>'export html'!$AR$7),\"\",IF(LEFT(W9,1)<>\"*\",LEFT(W9,FIND(\"-\",W9)-1)-0,MID(W9,2,FIND(\"-\",W9)-2)-0))","v":""},{"$f":"IF(OR(ISERROR(FIND(\"-\",X9)),AJ9>'export html'!$AR$7),\"\",IF(LEFT(X9,1)<>\"*\",LEFT(X9,FIND(\"-\",X9)-1)-0,MID(X9,2,FIND(\"-\",X9)-2)-0))","v":3},{"$f":"IF(OR(ISERROR(FIND(\"-\",Y9)),AK9>'export html'!$AR$7),\"\",IF(LEFT(Y9,1)<>\"*\",LEFT(Y9,FIND(\"-\",Y9)-1)-0,MID(Y9,2,FIND(\"-\",Y9)-2)-0))","v":""},{"$f":"IF(OR(ISERROR(FIND(\"-\",Z9)),AL9>'export html'!$AR$7),\"\",IF(LEFT(Z9,1)<>\"*\",LEFT(Z9,FIND(\"-\",Z9)-1)-0,MID(Z9,2,FIND(\"-\",Z9)-2)-0))","v":""},{"$f":"IF(OR(ISERROR(FIND(\"-\",AA9)),AM9>'export html'!$AR$7),\"\",IF(LEFT(AA9,1)<>\"*\",LEFT(AA9,FIND(\"-\",AA9)-1)-0,MID(AA9,2,FIND(\"-\",AA9)-2)-0))","v":3},{"$f":"IF(OR(ISERROR(FIND(\"-\",AB9)),AN9>'export html'!$AR$7),\"\",IF(LEFT(AB9,1)<>\"*\",LEFT(AB9,FIND(\"-\",AB9)-1)-0,MID(AB9,2,FIND(\"-\",AB9)-2)-0))","v":4},5,{"$f":"IF(OR(ISERROR(FIND(\"-\",Q9)),AC9<='export html'!$AR$7),\"\",IF(LEFT(Q9,1)<>\"*\",LEFT(Q9,FIND(\"-\",Q9)-1)-0,MID(Q9,2,FIND(\"-\",Q9)-2)-0))","v":""},{"$f":"IF(OR(ISERROR(FIND(\"-\",R9)),AD9<='export html'!$AR$7),\"\",IF(LEFT(R9,1)<>\"*\",LEFT(R9,FIND(\"-\",R9)-1)-0,MID(R9,2,FIND(\"-\",R9)-2)-0))","v":4},{"$f":"IF(OR(ISERROR(FIND(\"-\",S9)),AE9<='export html'!$AR$7),\"\",IF(LEFT(S9,1)<>\"*\",LEFT(S9,FIND(\"-\",S9)-1)-0,MID(S9,2,FIND(\"-\",S9)-2)-0))","v":""},{"$f":"IF(OR(ISERROR(FIND(\"-\",T9)),AF9<='export html'!$AR$7),\"\",IF(LEFT(T9,1)<>\"*\",LEFT(T9,FIND(\"-\",T9)-1)-0,MID(T9,2,FIND(\"-\",T9)-2)-0))","v":""},null,{"$f":"IF(OR(ISERROR(FIND(\"-\",V9)),AH9<='export html'!$AR$7),\"\",IF(LEFT(V9,1)<>\"*\",LEFT(V9,FIND(\"-\",V9)-1)-0,MID(V9,2,FIND(\"-\",V9)-2)-0))","v":""},{"$f":"IF(OR(ISERROR(FIND(\"-\",W9)),AI9<='export html'!$AR$7),\"\",IF(LEFT(W9,1)<>\"*\",LEFT(W9,FIND(\"-\",W9)-1)-0,MID(W9,2,FIND(\"-\",W9)-2)-0))","v":6},{"$f":"IF(OR(ISERROR(FIND(\"-\",X9)),AJ9<='export html'!$AR$7),\"\",IF(LEFT(X9,1)<>\"*\",LEFT(X9,FIND(\"-\",X9)-1)-0,MID(X9,2,FIND(\"-\",X9)-2)-0))","v":""},{"$f":"IF(OR(ISERROR(FIND(\"-\",Y9)),AK9<='export html'!$AR$7),\"\",IF(LEFT(Y9,1)<>\"*\",LEFT(Y9,FIND(\"-\",Y9)-1)-0,MID(Y9,2,FIND(\"-\",Y9)-2)-0))","v":3},{"$f":"IF(OR(ISERROR(FIND(\"-\",Z9)),AL9<='export html'!$AR$7),\"\",IF(LEFT(Z9,1)<>\"*\",LEFT(Z9,FIND(\"-\",Z9)-1)-0,MID(Z9,2,FIND(\"-\",Z9)-2)-0))","v":7},{"$f":"IF(OR(ISERROR(FIND(\"-\",AA9)),AM9<='export html'!$AR$7),\"\",IF(LEFT(AA9,1)<>\"*\",LEFT(AA9,FIND(\"-\",AA9)-1)-0,MID(AA9,2,FIND(\"-\",AA9)-2)-0))","v":""},{"$f":"IF(OR(ISERROR(FIND(\"-\",AB9)),AN9<='export html'!$AR$7),\"\",IF(LEFT(AB9,1)<>\"*\",LEFT(AB9,FIND(\"-\",AB9)-1)-0,MID(AB9,2,FIND(\"-\",AB9)-2)-0))","v":""},5]
[null,null,6,"De Vrede",22,17,"",6,7,4,43,42,1,29,null,"Hombeek","4-1","3-1","5-1","4-1","0-7",null,"4-1","","8-2","","1-2","5-1",8,2,18,20,9,null,4,23,13,25,16,14,"2023-10-22","2023-09-10","2024-02-04","2024-02-25","2023-10-29",null,"2023-09-24","2024-03-17","2023-11-26","2024-04-07","2024-02-11","2023-12-03",null,3.9803050606000001,"Hombeek",28,17,{"$f":"CHOOSE(StandBer,COUNTIF(BQ36:CB36,\"t\")+COUNTIF(BV31:BV42,\"u\")+COUNTIF(CD36:CO36,\"t\")+COUNTIF(CI31:CI42,\"u\"),COUNTIF(BQ36:CB36,\"t\")+COUNTIF(BV31:BV42,\"u\"),COUNTIF(CD36:CO36,\"t\")+COUNTIF(CI31:CI42,\"u\"),COUNTIF(BQ36:CB36,\"t\")+COUNTIF(CD36:CO36,\"t\"),COUNTIF(BV31:BV42,\"u\")+COUNTIF(CI31:CI42,\"u\"))","v":9},{"$f":"CHOOSE(StandBer,COUNTIF(BQ36:CB36,\"u\")+COUNTIF(BV31:BV42,\"t\")+COUNTIF(CD36:CO36,\"u\")+COUNTIF(CI31:CI42,\"t\"),COUNTIF(BQ36:CB36,\"u\")+COUNTIF(BV31:BV42,\"t\"),COUNTIF(CD36:CO36,\"u\")+COUNTIF(CI31:CI42,\"t\"),COUNTIF(BQ36:CB36,\"u\")+COUNTIF(CD36:CO36,\"u\"),COUNTIF(BV31:BV42,\"t\")+COUNTIF(CI31:CI42,\"t\"))+BL10","v":7},{"$f":"CHOOSE(StandBer,COUNTIF(BQ36:CB36,\"g\")+COUNTIF(BV31:BV42,\"g\")+COUNTIF(CD36:CO36,\"g\")+COUNTIF(CI31:CI42,\"g\"),COUNTIF(BQ36:CB36,\"g\")+COUNTIF(BV31:BV42,\"g\"),COUNTIF(CD36:CO36,\"g\")+COUNTIF(CI31:CI42,\"g\"),COUNTIF(BQ36:CB36,\"g\")+COUNTIF(CD36:CO36,\"g\"),COUNTIF(BV31:BV42,\"g\")+COUNTIF(CI31:CI42,\"g\"))","v":1},{"$f":"CHOOSE(StandBer,SUM(BQ10:CB10)+SUM(BV18:BV29)+SUM(CD10:CO10)+SUM(CI18:CI29),SUM(BQ10:CB10)+SUM(BV18:BV29),SUM(CD10:CO10)+SUM(CI18:CI29),SUM(BQ10:CB10)+SUM(CD10:CO10),SUM(BV18:BV29)+SUM(CI18:CI29))-5*BL10","v":44},{"$f":"CHOOSE(StandBer,SUM(BV5:BV16)+SUM(BQ23:CB23)+SUM(CI5:CI16)+SUM(CD23:CO23),SUM(BV5:BV16)+SUM(BQ23:CB23),SUM(CI5:CI16)+SUM(CD23:CO23),SUM(BV5:BV16)+SUM(CI5:CI16),SUM(BQ23:CB23)+SUM(CD23:CO23))","v":42},2,{"$f":"CHOOSE(StandBer,COUNTIF(BQ36:CB36,\"ff\")+COUNTIF(BV31:BV42,\"ff\")+COUNTIF(CD36:CO36,\"ff\")+COUNTIF(CI31:CI42,\"ff\"),COUNTIF(BQ36:CB36,\"ff\")+COUNTIF(BV31:BV42,\"ff\"),COUNTIF(CD36:CO36,\"ff\")+COUNTIF(CI31:CI42,\"ff\"),COUNTIF(BQ36:CB36,\"ff\")+COUNTIF(CD36:CO36,\"ff\"),COUNTIF(BV31:BV42,\"ff\")+COUNTIF(CI31:CI42,\"ff\"))","v":0},6,5.9806060712000004,null,6,{"$f":"IF(OR(ISERROR(FIND(\"-\",Q10)),AC10>'export html'!$AR$7),\"\",IF(LEFT(Q10,1)<>\"*\",LEFT(Q10,FIND(\"-\",Q10)-1)-0,MID(Q10,2,FIND(\"-\",Q10)-2)-0))","v":4},{"$f":"IF(OR(ISERROR(FIND(\"-\",R10)),AD10>'export html'!$AR$7),\"\",IF(LEFT(R10,1)<>\"*\",LEFT(R10,FIND(\"-\",R10)-1)-0,MID(R10,2,FIND(\"-\",R10)-2)-0))","v":3},{"$f":"IF(OR(ISERROR(FIND(\"-\",S10)),AE10>'export html'!$AR$7),\"\",IF(LEFT(S10,1)<>\"*\",LEFT(S10,FIND(\"-\",S10)-1)-0,MID(S10,2,FIND(\"-\",S10)-2)-0))","v":""},{"$f":"IF(OR(ISERROR(FIND(\"-\",T10)),AF10>'export html'!$AR$7),\"\",IF(LEFT(T10,1)<>\"*\",LEFT(T10,FIND(\"-\",T10)-1)-0,MID(T10,2,FIND(\"-\",T10)-2)-0))","v":""},{"$f":"IF(OR(ISERROR(FIND(\"-\",U10)),AG10>'export html'!$AR$7),\"\",IF(LEFT(U10,1)<>\"*\",LEFT(U10,FIND(\"-\",U10)-1)-0,MID(U10,2,FIND(\"-\",U10)-2)-0))","v":0},null,{"$f":"IF(OR(ISERROR(FIND(\"-\",W10)),AI10>'export html'!$AR$7),\"\",IF(LEFT(W10,1)<>\"*\",LEFT(W10,FIND(\"-\",W10)-1)-0,MID(W10,2,FIND(\"-\",W10)-2)-0))","v":4},{"$f":"IF(OR(ISERROR(FIND(\"-\",X10)),AJ10>'export html'!$AR$7),\"\",IF(LEFT(X10,1)<>\"*\",LEFT(X10,FIND(\"-\",X10)-1)-0,MID(X10,2,FIND(\"-\",X10)-2)-0))","v":""},{"$f":"IF(OR(ISERROR(FIND(\"-\",Y10)),AK10>'export html'!$AR$7),\"\",IF(LEFT(Y10,1)<>\"*\",LEFT(Y10,FIND(\"-\",Y10)-1)-0,MID(Y10,2,FIND(\"-\",Y10)-2)-0))","v":""},{"$f":"IF(OR(ISERROR(FIND(\"-\",Z10)),AL10>'export html'!$AR$7),\"\",IF(LEFT(Z10,1)<>\"*\",LEFT(Z10,FIND(\"-\",Z10)-1)-0,MID(Z10,2,FIND(\"-\",Z10)-2)-0))","v":""},{"$f":"IF(OR(ISERROR(FIND(\"-\",AA10)),AM10>'export html'!$AR$7),\"\",IF(LEFT(AA10,1)<>\"*\",LEFT(AA10,FIND(\"-\",AA10)-1)-0,MID(AA10,2,FIND(\"-\",AA10)-2)-0))","v":""},{"$f":"IF(OR(ISERROR(FIND(\"-\",AB10)),AN10>'export html'!$AR$7),\"\",IF(LEFT(AB10,1)<>\"*\",LEFT(AB10,FIND(\"-\",AB10)-1)-0,MID(AB10,2,FIND(\"-\",AB10)-2)-0))","v":""},6,{"$f":"IF(OR(ISERROR(FIND(\"-\",Q10)),AC10<='export html'!$AR$7),\"\",IF(LEFT(Q10,1)<>\"*\",LEFT(Q10,FIND(\"-\",Q10)-1)-0,MID(Q10,2,FIND(\"-\",Q10)-2)-0))","v":""},{"$f":"IF(OR(ISERROR(FIND(\"-\",R10)),AD10<='export html'!$AR$7),\"\",IF(LEFT(R10,1)<>\"*\",LEFT(R10,FIND(\"-\",R10)-1)-0,MID(R10,2,FIND(\"-\",R10)-2)-0))","v":""},{"$f":"IF(OR(ISERROR(FIND(\"-\",S10)),AE10<='export html'!$AR$7),\"\",IF(LEFT(S10,1)<>\"*\",LEFT(S10,FIND(\"-\",S10)-1)-0,MID(S10,2,FIND(\"-\",S10)-2)-0))","v":5},{"$f":"IF(OR(ISERROR(FIND(\"-\",T10)),AF10<='export html'!$AR$7),\"\",IF(LEFT(T10,1)<>\"*\",LEFT(T10,FIND(\"-\",T10)-1)-0,MID(T10,2,FIND(\"-\",T10)-2)-0))","v":4},{"$f":"IF(OR(ISERROR(FIND(\"-\",U10)),AG10<='export html'!$AR$7),\"\",IF(LEFT(U10,1)<>\"*\",LEFT(U10,FIND(\"-\",U10)-1)-0,MID(U10,2,FIND(\"-\",U10)-2)-0))","v":""},null,{"$f":"IF(OR(ISERROR(FIND(\"-\",W10)),AI10<='export html'!$AR$7),\"\",IF(LEFT(W10,1)<>\"*\",LEFT(W10,FIND(\"-\",W10)-1)-0,MID(W10,2,FIND(\"-\",W10)-2)-0))","v":""},{"$f":"IF(OR(ISERROR(FIND(\"-\",X10)),AJ10<='export html'!$AR$7),\"\",IF(LEFT(X10,1)<>\"*\",LEFT(X10,FIND(\"-\",X10)-1)-0,MID(X10,2,FIND(\"-\",X10)-2)-0))","v":""},{"$f":"IF(OR(ISERROR(FIND(\"-\",Y10)),AK10<='export html'!$AR$7),\"\",IF(LEFT(Y10,1)<>\"*\",LEFT(Y10,FIND(\"-\",Y10)-1)-0,MID(Y10,2,FIND(\"-\",Y10)-2)-0))","v":8},{"$f":"IF(OR(ISERROR(FIND(\"-\",Z10)),AL10<='export html'!$AR$7),\"\",IF(LEFT(Z10,1)<>\"*\",LEFT(Z10,FIND(\"-\",Z10)-1)-0,MID(Z10,2,FIND(\"-\",Z10)-2)-0))","v":""},{"$f":"IF(OR(ISERROR(FIND(\"-\",AA10)),AM10<='export html'!$AR$7),\"\",IF(LEFT(AA10,1)<>\"*\",LEFT(AA10,FIND(\"-\",AA10)-1)-0,MID(AA10,2,FIND(\"-\",AA10)-2)-0))","v":1},{"$f":"IF(OR(ISERROR(FIND(\"-\",AB10)),AN10<='export html'!$AR$7),\"\",IF(LEFT(AB10,1)<>\"*\",LEFT(AB10,FIND(\"-\",AB10)-1)-0,MID(AB10,2,FIND(\"-\",AB10)-2)-0))","v":5},6]
[null,null,7,{"$f":"VLOOKUP(BN11,HulpberekeningenStand,2,FALSE)","v":"Goka"},21,17,"",{"$f":"VLOOKUP(BN11,HulpberekeningenStand,5,FALSE)","v":6},{"$f":"VLOOKUP(BN11,HulpberekeningenStand,6,FALSE)","v":8},{"$f":"VLOOKUP(BN11,HulpberekeningenStand,7,FALSE)","v":3},{"$f":"VLOOKUP(BN11,HulpberekeningenStand,8,FALSE)","v":37},{"$f":"VLOOKUP(BN11,HulpberekeningenStand,9,FALSE)","v":36},1,30,null,"Jolika","0-5*","4-4","1-1","0-5*","0-1","0-1",null,"1-2","3-1","","","",13,11,1,3,5,17,null,19,9,21,25,23,"2023-11-26","2023-11-12","2023-09-03","2023-09-17","2023-10-01","2024-01-28",null,"2024-02-18","2023-10-29","2024-03-03","2024-04-07","2024-03-17",null,11.9212121207,"Jolika",6,16,{"$f":"CHOOSE(StandBer,COUNTIF(BQ37:CB37,\"t\")+COUNTIF(BW31:BW42,\"u\")+COUNTIF(CD37:CO37,\"t\")+COUNTIF(CJ31:CJ42,\"u\"),COUNTIF(BQ37:CB37,\"t\")+COUNTIF(BW31:BW42,\"u\"),COUNTIF(CD37:CO37,\"t\")+COUNTIF(CJ31:CJ42,\"u\"),COUNTIF(BQ37:CB37,\"t\")+COUNTIF(CD37:CO37,\"t\"),COUNTIF(BW31:BW42,\"u\")+COUNTIF(CJ31:CJ42,\"u\"))","v":1},{"$f":"CHOOSE(StandBer,COUNTIF(BQ37:CB37,\"u\")+COUNTIF(BW31:BW42,\"t\")+COUNTIF(CD37:CO37,\"u\")+COUNTIF(CJ31:CJ42,\"t\"),COUNTIF(BQ37:CB37,\"u\")+COUNTIF(BW31:BW42,\"t\"),COUNTIF(CD37:CO37,\"u\")+COUNTIF(CJ31:CJ42,\"t\"),COUNTIF(BQ37:CB37,\"u\")+COUNTIF(CD37:CO37,\"u\"),COUNTIF(BW31:BW42,\"t\")+COUNTIF(CJ31:CJ42,\"t\"))+BL11","v":12},{"$f":"CHOOSE(StandBer,COUNTIF(BQ37:CB37,\"g\")+COUNTIF(BW31:BW42,\"g\")+COUNTIF(CD37:CO37,\"g\")+COUNTIF(CJ31:CJ42,\"g\"),COUNTIF(BQ37:CB37,\"g\")+COUNTIF(BW31:BW42,\"g\"),COUNTIF(CD37:CO37,\"g\")+COUNTIF(CJ31:CJ42,\"g\"),COUNTIF(BQ37:CB37,\"g\")+COUNTIF(CD37:CO37,\"g\"),COUNTIF(BW31:BW42,\"g\")+COUNTIF(CJ31:CJ42,\"g\"))","v":3},{"$f":"CHOOSE(StandBer,SUM(BQ11:CB11)+SUM(BW18:BW29)+SUM(CD11:CO11)+SUM(CJ18:CJ29),SUM(BQ11:CB11)+SUM(BW18:BW29),SUM(CD11:CO11)+SUM(CJ18:CJ29),SUM(BQ11:CB11)+SUM(CD11:CO11),SUM(BW18:BW29)+SUM(CJ18:CJ29))-5*BL11","v":13},{"$f":"CHOOSE(StandBer,SUM(BW5:BW16)+SUM(BQ24:CB24)+SUM(CJ5:CJ16)+SUM(CD24:CO24),SUM(BW5:BW16)+SUM(BQ24:CB24),SUM(CJ5:CJ16)+SUM(CD24:CO24),SUM(BW5:BW16)+SUM(CJ5:CJ16),SUM(BQ24:CB24)+SUM(CD24:CO24))","v":43},-30,{"$f":"CHOOSE(StandBer,COUNTIF(BQ37:CB37,\"ff\")+COUNTIF(BW31:BW42,\"ff\")+COUNTIF(CD37:CO37,\"ff\")+COUNTIF(CJ31:CJ42,\"ff\"),COUNTIF(BQ37:CB37,\"ff\")+COUNTIF(BW31:BW42,\"ff\"),COUNTIF(CD37:CO37,\"ff\")+COUNTIF(CJ31:CJ42,\"ff\"),COUNTIF(BQ37:CB37,\"ff\")+COUNTIF(CD37:CO37,\"ff\"),COUNTIF(BW31:BW42,\"ff\")+COUNTIF(CJ31:CJ42,\"ff\"))","v":0},7,6.9806060904000011,null,7,{"$f":"IF(OR(ISERROR(FIND(\"-\",Q11)),AC11>'export html'!$AR$7),\"\",IF(LEFT(Q11,1)<>\"*\",LEFT(Q11,FIND(\"-\",Q11)-1)-0,MID(Q11,2,FIND(\"-\",Q11)-2)-0))","v":""},{"$f":"IF(OR(ISERROR(FIND(\"-\",R11)),AD11>'export html'!$AR$7),\"\",IF(LEFT(R11,1)<>\"*\",LEFT(R11,FIND(\"-\",R11)-1)-0,MID(R11,2,FIND(\"-\",R11)-2)-0))","v":4},{"$f":"IF(OR(ISERROR(FIND(\"-\",S11)),AE11>'export html'!$AR$7),\"\",IF(LEFT(S11,1)<>\"*\",LEFT(S11,FIND(\"-\",S11)-1)-0,MID(S11,2,FIND(\"-\",S11)-2)-0))","v":1},{"$f":"IF(OR(ISERROR(FIND(\"-\",T11)),AF11>'export html'!$AR$7),\"\",IF(LEFT(T11,1)<>\"*\",LEFT(T11,FIND(\"-\",T11)-1)-0,MID(T11,2,FIND(\"-\",T11)-2)-0))","v":0},{"$f":"IF(OR(ISERROR(FIND(\"-\",U11)),AG11>'export html'!$AR$7),\"\",IF(LEFT(U11,1)<>\"*\",LEFT(U11,FIND(\"-\",U11)-1)-0,MID(U11,2,FIND(\"-\",U11)-2)-0))","v":0},{"$f":"IF(OR(ISERROR(FIND(\"-\",V11)),AH11>'export html'!$AR$7),\"\",IF(LEFT(V11,1)<>\"*\",LEFT(V11,FIND(\"-\",V11)-1)-0,MID(V11,2,FIND(\"-\",V11)-2)-0))","v":""},null,{"$f":"IF(OR(ISERROR(FIND(\"-\",X11)),AJ11>'export html'!$AR$7),\"\",IF(LEFT(X11,1)<>\"*\",LEFT(X11,FIND(\"-\",X11)-1)-0,MID(X11,2,FIND(\"-\",X11)-2)-0))","v":""},{"$f":"IF(OR(ISERROR(FIND(\"-\",Y11)),AK11>'export html'!$AR$7),\"\",IF(LEFT(Y11,1)<>\"*\",LEFT(Y11,FIND(\"-\",Y11)-1)-0,MID(Y11,2,FIND(\"-\",Y11)-2)-0))","v":3},{"$f":"IF(OR(ISERROR(FIND(\"-\",Z11)),AL11>'export html'!$AR$7),\"\",IF(LEFT(Z11,1)<>\"*\",LEFT(Z11,FIND(\"-\",Z11)-1)-0,MID(Z11,2,FIND(\"-\",Z11)-2)-0))","v":""},{"$f":"IF(OR(ISERROR(FIND(\"-\",AA11)),AM11>'export html'!$AR$7),\"\",IF(LEFT(AA11,1)<>\"*\",LEFT(AA11,FIND(\"-\",AA11)-1)-0,MID(AA11,2,FIND(\"-\",AA11)-2)-0))","v":""},{"$f":"IF(OR(ISERROR(FIND(\"-\",AB11)),AN11>'export html'!$AR$7),\"\",IF(LEFT(AB11,1)<>\"*\",LEFT(AB11,FIND(\"-\",AB11)-1)-0,MID(AB11,2,FIND(\"-\",AB11)-2)-0))","v":""},7,{"$f":"IF(OR(ISERROR(FIND(\"-\",Q11)),AC11<='export html'!$AR$7),\"\",IF(LEFT(Q11,1)<>\"*\",LEFT(Q11,FIND(\"-\",Q11)-1)-0,MID(Q11,2,FIND(\"-\",Q11)-2)-0))","v":0},{"$f":"IF(OR(ISERROR(FIND(\"-\",R11)),AD11<='export html'!$AR$7),\"\",IF(LEFT(R11,1)<>\"*\",LEFT(R11,FIND(\"-\",R11)-1)-0,MID(R11,2,FIND(\"-\",R11)-2)-0))","v":""},{"$f":"IF(OR(ISERROR(FIND(\"-\",S11)),AE11<='export html'!$AR$7),\"\",IF(LEFT(S11,1)<>\"*\",LEFT(S11,FIND(\"-\",S11)-1)-0,MID(S11,2,FIND(\"-\",S11)-2)-0))","v":""},{"$f":"IF(OR(ISERROR(FIND(\"-\",T11)),AF11<='export html'!$AR$7),\"\",IF(LEFT(T11,1)<>\"*\",LEFT(T11,FIND(\"-\",T11)-1)-0,MID(T11,2,FIND(\"-\",T11)-2)-0))","v":""},{"$f":"IF(OR(ISERROR(FIND(\"-\",U11)),AG11<='export html'!$AR$7),\"\",IF(LEFT(U11,1)<>\"*\",LEFT(U11,FIND(\"-\",U11)-1)-0,MID(U11,2,FIND(\"-\",U11)-2)-0))","v":""},{"$f":"IF(OR(ISERROR(FIND(\"-\",V11)),AH11<='export html'!$AR$7),\"\",IF(LEFT(V11,1)<>\"*\",LEFT(V11,FIND(\"-\",V11)-1)-0,MID(V11,2,FIND(\"-\",V11)-2)-0))","v":0},null,{"$f":"IF(OR(ISERROR(FIND(\"-\",X11)),AJ11<='export html'!$AR$7),\"\",IF(LEFT(X11,1)<>\"*\",LEFT(X11,FIND(\"-\",X11)-1)-0,MID(X11,2,FIND(\"-\",X11)-2)-0))","v":1},{"$f":"IF(OR(ISERROR(FIND(\"-\",Y11)),AK11<='export html'!$AR$7),\"\",IF(LEFT(Y11,1)<>\"*\",LEFT(Y11,FIND(\"-\",Y11)-1)-0,MID(Y11,2,FIND(\"-\",Y11)-2)-0))","v":""},{"$f":"IF(OR(ISERROR(FIND(\"-\",Z11)),AL11<='export html'!$AR$7),\"\",IF(LEFT(Z11,1)<>\"*\",LEFT(Z11,FIND(\"-\",Z11)-1)-0,MID(Z11,2,FIND(\"-\",Z11)-2)-0))","v":""},{"$f":"IF(OR(ISERROR(FIND(\"-\",AA11)),AM11<='export html'!$AR$7),\"\",IF(LEFT(AA11,1)<>\"*\",LEFT(AA11,FIND(\"-\",AA11)-1)-0,MID(AA11,2,FIND(\"-\",AA11)-2)-0))","v":""},{"$f":"IF(OR(ISERROR(FIND(\"-\",AB11)),AN11<='export html'!$AR$7),\"\",IF(LEFT(AB11,1)<>\"*\",LEFT(AB11,FIND(\"-\",AB11)-1)-0,MID(AB11,2,FIND(\"-\",AB11)-2)-0))","v":""},7]
[null,null,8,"Bariton",{"$f":"3*H12+J12","v":20},{"$f":"SUM(H12:J12)","v":16},"-",6,8,2,40,40,{"$f":"K12-L12","v":0},{"$f":"3*F12-E12","v":28},null,"Lucyvo",null,"2-1","2-7",null,null,"2-1","4-0",null,"3-6","4-4","3-5","6-5",25,4,20,22,24,10,6,null,2,14,18,16,"2024-04-07","2023-09-24","2024-02-25","2024-03-10","2024-03-24","2023-11-05","2023-10-08",null,"2023-09-10","2023-12-03","2024-02-04","2024-02-11",null,{"$f":"RANK( BD12, $BD$5:$BD$16, 0 ) - RANK( BE12, $BE$5:$BE$16, 0 ) / 10^2 + RANK( BF12, $BF$5:$BF$16, 0 ) / 10^4 + RANK( BK12, $BK$5:$BK$16, 0 ) / 10^6 + RANK( BI12, $BI$5:$BI$16, 0 ) / 10^8 + BM12 / 10^10","v":8.9909110508000012},"Lucyvo",18,18,{"$f":"CHOOSE(StandBer,COUNTIF(BQ38:CB38,\"t\")+COUNTIF(BX31:BX42,\"u\")+COUNTIF(CD38:CO38,\"t\")+COUNTIF(CK31:CK42,\"u\"),COUNTIF(BQ38:CB38,\"t\")+COUNTIF(BX31:BX42,\"u\"),COUNTIF(CD38:CO38,\"t\")+COUNTIF(CK31:CK42,\"u\"),COUNTIF(BQ38:CB38,\"t\")+COUNTIF(CD38:CO38,\"t\"),COUNTIF(BX31:BX42,\"u\")+COUNTIF(CK31:CK42,\"u\"))","v":5},{"$f":"CHOOSE(StandBer,COUNTIF(BQ38:CB38,\"u\")+COUNTIF(BX31:BX42,\"t\")+COUNTIF(CD38:CO38,\"u\")+COUNTIF(CK31:CK42,\"t\"),COUNTIF(BQ38:CB38,\"u\")+COUNTIF(BX31:BX42,\"t\"),COUNTIF(CD38:CO38,\"u\")+COUNTIF(CK31:CK42,\"t\"),COUNTIF(BQ38:CB38,\"u\")+COUNTIF(CD38:CO38,\"u\"),COUNTIF(BX31:BX42,\"t\")+COUNTIF(CK31:CK42,\"t\"))+BL12","v":10},{"$f":"CHOOSE(StandBer,COUNTIF(BQ38:CB38,\"g\")+COUNTIF(BX31:BX42,\"g\")+COUNTIF(CD38:CO38,\"g\")+COUNTIF(CK31:CK42,\"g\"),COUNTIF(BQ38:CB38,\"g\")+COUNTIF(BX31:BX42,\"g\"),COUNTIF(CD38:CO38,\"g\")+COUNTIF(CK31:CK42,\"g\"),COUNTIF(BQ38:CB38,\"g\")+COUNTIF(CD38:CO38,\"g\"),COUNTIF(BX31:BX42,\"g\")+COUNTIF(CK31:CK42,\"g\"))","v":3},{"$f":"CHOOSE(StandBer,SUM(BQ12:CB12)+SUM(BX18:BX29)+SUM(CD12:CO12)+SUM(CK18:CK29),SUM(BQ12:CB12)+SUM(BX18:BX29),SUM(CD12:CO12)+SUM(CK18:CK29),SUM(BQ12:CB12)+SUM(CD12:CO12),SUM(BX18:BX29)+SUM(CK18:CK29))-5*BL12","v":45},{"$f":"CHOOSE(StandBer,SUM(BX5:BX16)+SUM(BQ25:CB25)+SUM(CK5:CK16)+SUM(CD25:CO25),SUM(BX5:BX16)+SUM(BQ25:CB25),SUM(CK5:CK16)+SUM(CD25:CO25),SUM(BX5:BX16)+SUM(CK5:CK16),SUM(BQ25:CB25)+SUM(CD25:CO25))","v":67},-22,{"$f":"CHOOSE(StandBer,COUNTIF(BQ38:CB38,\"ff\")+COUNTIF(BX31:BX42,\"ff\")+COUNTIF(CD38:CO38,\"ff\")+COUNTIF(CK31:CK42,\"ff\"),COUNTIF(BQ38:CB38,\"ff\")+COUNTIF(BX31:BX42,\"ff\"),COUNTIF(CD38:CO38,\"ff\")+COUNTIF(CK31:CK42,\"ff\"),COUNTIF(BQ38:CB38,\"ff\")+COUNTIF(CD38:CO38,\"ff\"),COUNTIF(BX31:BX42,\"ff\")+COUNTIF(CK31:CK42,\"ff\"))","v":0},8,7.920608080200001,null,8,{"$f":"IF(OR(ISERROR(FIND(\"-\",Q12)),AC12>'export html'!$AR$7),\"\",IF(LEFT(Q12,1)<>\"*\",LEFT(Q12,FIND(\"-\",Q12)-1)-0,MID(Q12,2,FIND(\"-\",Q12)-2)-0))","v":""},{"$f":"IF(OR(ISERROR(FIND(\"-\",R12)),AD12>'export html'!$AR$7),\"\",IF(LEFT(R12,1)<>\"*\",LEFT(R12,FIND(\"-\",R12)-1)-0,MID(R12,2,FIND(\"-\",R12)-2)-0))","v":2},{"$f":"IF(OR(ISERROR(FIND(\"-\",S12)),AE12>'export html'!$AR$7),\"\",IF(LEFT(S12,1)<>\"*\",LEFT(S12,FIND(\"-\",S12)-1)-0,MID(S12,2,FIND(\"-\",S12)-2)-0))","v":""},{"$f":"IF(OR(ISERROR(FIND(\"-\",T12)),AF12>'export html'!$AR$7),\"\",IF(LEFT(T12,1)<>\"*\",LEFT(T12,FIND(\"-\",T12)-1)-0,MID(T12,2,FIND(\"-\",T12)-2)-0))","v":""},{"$f":"IF(OR(ISERROR(FIND(\"-\",U12)),AG12>'export html'!$AR$7),\"\",IF(LEFT(U12,1)<>\"*\",LEFT(U12,FIND(\"-\",U12)-1)-0,MID(U12,2,FIND(\"-\",U12)-2)-0))","v":""},{"$f":"IF(OR(ISERROR(FIND(\"-\",V12)),AH12>'export html'!$AR$7),\"\",IF(LEFT(V12,1)<>\"*\",LEFT(V12,FIND(\"-\",V12)-1)-0,MID(V12,2,FIND(\"-\",V12)-2)-0))","v":2},{"$f":"IF(OR(ISERROR(FIND(\"-\",W12)),AI12>'export html'!$AR$7),\"\",IF(LEFT(W12,1)<>\"*\",LEFT(W12,FIND(\"-\",W12)-1)-0,MID(W12,2,FIND(\"-\",W12)-2)-0))","v":4},null,{"$f":"IF(OR(ISERROR(FIND(\"-\",Y12)),AK12>'export html'!$AR$7),\"\",IF(LEFT(Y12,1)<>\"*\",LEFT(Y12,FIND(\"-\",Y12)-1)-0,MID(Y12,2,FIND(\"-\",Y12)-2)-0))","v":3},{"$f":"IF(OR(ISERROR(FIND(\"-\",Z12)),AL12>'export html'!$AR$7),\"\",IF(LEFT(Z12,1)<>\"*\",LEFT(Z12,FIND(\"-\",Z12)-1)-0,MID(Z12,2,FIND(\"-\",Z12)-2)-0))","v":""},{"$f":"IF(OR(ISERROR(FIND(\"-\",AA12)),AM12>'export html'!$AR$7),\"\",IF(LEFT(AA12,1)<>\"*\",LEFT(AA12,FIND(\"-\",AA12)-1)-0,MID(AA12,2,FIND(\"-\",AA12)-2)-0))","v":""},{"$f":"IF(OR(ISERROR(FIND(\"-\",AB12)),AN12>'export html'!$AR$7),\"\",IF(LEFT(AB12,1)<>\"*\",LEFT(AB12,FIND(\"-\",AB12)-1)-0,MID(AB12,2,FIND(\"-\",AB12)-2)-0))","v":""},8,{"$f":"IF(OR(ISERROR(FIND(\"-\",Q12)),AC12<='export html'!$AR$7),\"\",IF(LEFT(Q12,1)<>\"*\",LEFT(Q12,FIND(\"-\",Q12)-1)-0,MID(Q12,2,FIND(\"-\",Q12)-2)-0))","v":""},{"$f":"IF(OR(ISERROR(FIND(\"-\",R12)),AD12<='export html'!$AR$7),\"\",IF(LEFT(R12,1)<>\"*\",LEFT(R12,FIND(\"-\",R12)-1)-0,MID(R12,2,FIND(\"-\",R12)-2)-0))","v":""},{"$f":"IF(OR(ISERROR(FIND(\"-\",S12)),AE12<='export html'!$AR$7),\"\",IF(LEFT(S12,1)<>\"*\",LEFT(S12,FIND(\"-\",S12)-1)-0,MID(S12,2,FIND(\"-\",S12)-2)-0))","v":2},{"$f":"IF(OR(ISERROR(FIND(\"-\",T12)),AF12<='export html'!$AR$7),\"\",IF(LEFT(T12,1)<>\"*\",LEFT(T12,FIND(\"-\",T12)-1)-0,MID(T12,2,FIND(\"-\",T12)-2)-0))","v":""},{"$f":"IF(OR(ISERROR(FIND(\"-\",U12)),AG12<='export html'!$AR$7),\"\",IF(LEFT(U12,1)<>\"*\",LEFT(U12,FIND(\"-\",U12)-1)-0,MID(U12,2,FIND(\"-\",U12)-2)-0))","v":""},{"$f":"IF(OR(ISERROR(FIND(\"-\",V12)),AH12<='export html'!$AR$7),\"\",IF(LEFT(V12,1)<>\"*\",LEFT(V12,FIND(\"-\",V12)-1)-0,MID(V12,2,FIND(\"-\",V12)-2)-0))","v":""},{"$f":"IF(OR(ISERROR(FIND(\"-\",W12)),AI12<='export html'!$AR$7),\"\",IF(LEFT(W12,1)<>\"*\",LEFT(W12,FIND(\"-\",W12)-1)-0,MID(W12,2,FIND(\"-\",W12)-2)-0))","v":""},null,{"$f":"IF(OR(ISERROR(FIND(\"-\",Y12)),AK12<='export html'!$AR$7),\"\",IF(LEFT(Y12,1)<>\"*\",LEFT(Y12,FIND(\"-\",Y12)-1)-0,MID(Y12,2,FIND(\"-\",Y12)-2)-0))","v":""},{"$f":"IF(OR(ISERROR(FIND(\"-\",Z12)),AL12<='export html'!$AR$7),\"\",IF(LEFT(Z12,1)<>\"*\",LEFT(Z12,FIND(\"-\",Z12)-1)-0,MID(Z12,2,FIND(\"-\",Z12)-2)-0))","v":4},{"$f":"IF(OR(ISERROR(FIND(\"-\",AA12)),AM12<='export html'!$AR$7),\"\",IF(LEFT(AA12,1)<>\"*\",LEFT(AA12,FIND(\"-\",AA12)-1)-0,MID(AA12,2,FIND(\"-\",AA12)-2)-0))","v":3},{"$f":"IF(OR(ISERROR(FIND(\"-\",AB12)),AN12<='export html'!$AR$7),\"\",IF(LEFT(AB12,1)<>\"*\",LEFT(AB12,FIND(\"-\",AB12)-1)-0,MID(AB12,2,FIND(\"-\",AB12)-2)-0))","v":6},8]
[null,null,9,"Lucyvo",18,18,"+",5,10,3,45,67,-22,36,null,"Paradeske","0-5",null,"4-2","3-2","1-3","","","4-1",null,"0-6","4-2","2-2",18,20,10,12,1,26,22,15,null,17,8,6,"2024-02-04","2024-02-25","2023-11-05","2023-11-19","2023-09-03","2024-04-14","2024-03-10","2024-01-14",null,"2024-01-28","2023-10-22","2023-10-08",null,{"$f":"RANK( BD13, $BD$5:$BD$16, 0 ) - RANK( BE13, $BE$5:$BE$16, 0 ) / 10^2 + RANK( BF13, $BF$5:$BF$16, 0 ) / 10^4 + RANK( BK13, $BK$5:$BK$16, 0 ) / 10^6 + RANK( BI13, $BI$5:$BI$16, 0 ) / 10^8 + BM13 / 10^10","v":9.9209101008999987},"Paradeske",17,16,{"$f":"CHOOSE(StandBer,COUNTIF(BQ39:CB39,\"t\")+COUNTIF(BY31:BY42,\"u\")+COUNTIF(CD39:CO39,\"t\")+COUNTIF(CL31:CL42,\"u\"),COUNTIF(BQ39:CB39,\"t\")+COUNTIF(BY31:BY42,\"u\"),COUNTIF(CD39:CO39,\"t\")+COUNTIF(CL31:CL42,\"u\"),COUNTIF(BQ39:CB39,\"t\")+COUNTIF(CD39:CO39,\"t\"),COUNTIF(BY31:BY42,\"u\")+COUNTIF(CL31:CL42,\"u\"))","v":5},{"$f":"CHOOSE(StandBer,COUNTIF(BQ39:CB39,\"u\")+COUNTIF(BY31:BY42,\"t\")+COUNTIF(CD39:CO39,\"u\")+COUNTIF(CL31:CL42,\"t\"),COUNTIF(BQ39:CB39,\"u\")+COUNTIF(BY31:BY42,\"t\"),COUNTIF(CD39:CO39,\"u\")+COUNTIF(CL31:CL42,\"t\"),COUNTIF(BQ39:CB39,\"u\")+COUNTIF(CD39:CO39,\"u\"),COUNTIF(BY31:BY42,\"t\")+COUNTIF(CL31:CL42,\"t\"))+BL13","v":9},{"$f":"CHOOSE(StandBer,COUNTIF(BQ39:CB39,\"g\")+COUNTIF(BY31:BY42,\"g\")+COUNTIF(CD39:CO39,\"g\")+COUNTIF(CL31:CL42,\"g\"),COUNTIF(BQ39:CB39,\"g\")+COUNTIF(BY31:BY42,\"g\"),COUNTIF(CD39:CO39,\"g\")+COUNTIF(CL31:CL42,\"g\"),COUNTIF(BQ39:CB39,\"g\")+COUNTIF(CD39:CO39,\"g\"),COUNTIF(BY31:BY42,\"g\")+COUNTIF(CL31:CL42,\"g\"))","v":2},{"$f":"CHOOSE(StandBer,SUM(BQ13:CB13)+SUM(BY18:BY29)+SUM(CD13:CO13)+SUM(CL18:CL29),SUM(BQ13:CB13)+SUM(BY18:BY29),SUM(CD13:CO13)+SUM(CL18:CL29),SUM(BQ13:CB13)+SUM(CD13:CO13),SUM(BY18:BY29)+SUM(CL18:CL29))-5*BL13","v":33},{"$f":"CHOOSE(StandBer,SUM(BY5:BY16)+SUM(BQ26:CB26)+SUM(CL5:CL16)+SUM(CD26:CO26),SUM(BY5:BY16)+SUM(BQ26:CB26),SUM(CL5:CL16)+SUM(CD26:CO26),SUM(BY5:BY16)+SUM(CL5:CL16),SUM(BQ26:CB26)+SUM(CD26:CO26))","v":54},-21,{"$f":"CHOOSE(StandBer,COUNTIF(BQ39:CB39,\"ff\")+COUNTIF(BY31:BY42,\"ff\")+COUNTIF(CD39:CO39,\"ff\")+COUNTIF(CL31:CL42,\"ff\"),COUNTIF(BQ39:CB39,\"ff\")+COUNTIF(BY31:BY42,\"ff\"),COUNTIF(CD39:CO39,\"ff\")+COUNTIF(CL31:CL42,\"ff\"),COUNTIF(BQ39:CB39,\"ff\")+COUNTIF(CD39:CO39,\"ff\"),COUNTIF(BY31:BY42,\"ff\")+COUNTIF(CL31:CL42,\"ff\"))","v":0},9,8.9909110508000012,null,9,{"$f":"IF(OR(ISERROR(FIND(\"-\",Q13)),AC13>'export html'!$AR$7),\"\",IF(LEFT(Q13,1)<>\"*\",LEFT(Q13,FIND(\"-\",Q13)-1)-0,MID(Q13,2,FIND(\"-\",Q13)-2)-0))","v":""},{"$f":"IF(OR(ISERROR(FIND(\"-\",R13)),AD13>'export html'!$AR$7),\"\",IF(LEFT(R13,1)<>\"*\",LEFT(R13,FIND(\"-\",R13)-1)-0,MID(R13,2,FIND(\"-\",R13)-2)-0))","v":""},{"$f":"IF(OR(ISERROR(FIND(\"-\",S13)),AE13>'export html'!$AR$7),\"\",IF(LEFT(S13,1)<>\"*\",LEFT(S13,FIND(\"-\",S13)-1)-0,MID(S13,2,FIND(\"-\",S13)-2)-0))","v":4},{"$f":"IF(OR(ISERROR(FIND(\"-\",T13)),AF13>'export html'!$AR$7),\"\",IF(LEFT(T13,1)<>\"*\",LEFT(T13,FIND(\"-\",T13)-1)-0,MID(T13,2,FIND(\"-\",T13)-2)-0))","v":""},{"$f":"IF(OR(ISERROR(FIND(\"-\",U13)),AG13>'export html'!$AR$7),\"\",IF(LEFT(U13,1)<>\"*\",LEFT(U13,FIND(\"-\",U13)-1)-0,MID(U13,2,FIND(\"-\",U13)-2)-0))","v":1},{"$f":"IF(OR(ISERROR(FIND(\"-\",V13)),AH13>'export html'!$AR$7),\"\",IF(LEFT(V13,1)<>\"*\",LEFT(V13,FIND(\"-\",V13)-1)-0,MID(V13,2,FIND(\"-\",V13)-2)-0))","v":""},{"$f":"IF(OR(ISERROR(FIND(\"-\",W13)),AI13>'export html'!$AR$7),\"\",IF(LEFT(W13,1)<>\"*\",LEFT(W13,FIND(\"-\",W13)-1)-0,MID(W13,2,FIND(\"-\",W13)-2)-0))","v":""},{"$f":"IF(OR(ISERROR(FIND(\"-\",X13)),AJ13>'export html'!$AR$7),\"\",IF(LEFT(X13,1)<>\"*\",LEFT(X13,FIND(\"-\",X13)-1)-0,MID(X13,2,FIND(\"-\",X13)-2)-0))","v":""},null,{"$f":"IF(OR(ISERROR(FIND(\"-\",Z13)),AL13>'export html'!$AR$7),\"\",IF(LEFT(Z13,1)<>\"*\",LEFT(Z13,FIND(\"-\",Z13)-1)-0,MID(Z13,2,FIND(\"-\",Z13)-2)-0))","v":""},{"$f":"IF(OR(ISERROR(FIND(\"-\",AA13)),AM13>'export html'!$AR$7),\"\",IF(LEFT(AA13,1)<>\"*\",LEFT(AA13,FIND(\"-\",AA13)-1)-0,MID(AA13,2,FIND(\"-\",AA13)-2)-0))","v":4},{"$f":"IF(OR(ISERROR(FIND(\"-\",AB13)),AN13>'export html'!$AR$7),\"\",IF(LEFT(AB13,1)<>\"*\",LEFT(AB13,FIND(\"-\",AB13)-1)-0,MID(AB13,2,FIND(\"-\",AB13)-2)-0))","v":2},9,{"$f":"IF(OR(ISERROR(FIND(\"-\",Q13)),AC13<='export html'!$AR$7),\"\",IF(LEFT(Q13,1)<>\"*\",LEFT(Q13,FIND(\"-\",Q13)-1)-0,MID(Q13,2,FIND(\"-\",Q13)-2)-0))","v":0},{"$f":"IF(OR(ISERROR(FIND(\"-\",R13)),AD13<='export html'!$AR$7),\"\",IF(LEFT(R13,1)<>\"*\",LEFT(R13,FIND(\"-\",R13)-1)-0,MID(R13,2,FIND(\"-\",R13)-2)-0))","v":""},{"$f":"IF(OR(ISERROR(FIND(\"-\",S13)),AE13<='export html'!$AR$7),\"\",IF(LEFT(S13,1)<>\"*\",LEFT(S13,FIND(\"-\",S13)-1)-0,MID(S13,2,FIND(\"-\",S13)-2)-0))","v":""},{"$f":"IF(OR(ISERROR(FIND(\"-\",T13)),AF13<='export html'!$AR$7),\"\",IF(LEFT(T13,1)<>\"*\",LEFT(T13,FIND(\"-\",T13)-1)-0,MID(T13,2,FIND(\"-\",T13)-2)-0))","v":3},{"$f":"IF(OR(ISERROR(FIND(\"-\",U13)),AG13<='export html'!$AR$7),\"\",IF(LEFT(U13,1)<>\"*\",LEFT(U13,FIND(\"-\",U13)-1)-0,MID(U13,2,FIND(\"-\",U13)-2)-0))","v":""},{"$f":"IF(OR(ISERROR(FIND(\"-\",V13)),AH13<='export html'!$AR$7),\"\",IF(LEFT(V13,1)<>\"*\",LEFT(V13,FIND(\"-\",V13)-1)-0,MID(V13,2,FIND(\"-\",V13)-2)-0))","v":""},{"$f":"IF(OR(ISERROR(FIND(\"-\",W13)),AI13<='export html'!$AR$7),\"\",IF(LEFT(W13,1)<>\"*\",LEFT(W13,FIND(\"-\",W13)-1)-0,MID(W13,2,FIND(\"-\",W13)-2)-0))","v":""},{"$f":"IF(OR(ISERROR(FIND(\"-\",X13)),AJ13<='export html'!$AR$7),\"\",IF(LEFT(X13,1)<>\"*\",LEFT(X13,FIND(\"-\",X13)-1)-0,MID(X13,2,FIND(\"-\",X13)-2)-0))","v":4},null,{"$f":"IF(OR(ISERROR(FIND(\"-\",Z13)),AL13<='export html'!$AR$7),\"\",IF(LEFT(Z13,1)<>\"*\",LEFT(Z13,FIND(\"-\",Z13)-1)-0,MID(Z13,2,FIND(\"-\",Z13)-2)-0))","v":0},{"$f":"IF(OR(ISERROR(FIND(\"-\",AA13)),AM13<='export html'!$AR$7),\"\",IF(LEFT(AA13,1)<>\"*\",LEFT(AA13,FIND(\"-\",AA13)-1)-0,MID(AA13,2,FIND(\"-\",AA13)-2)-0))","v":""},{"$f":"IF(OR(ISERROR(FIND(\"-\",AB13)),AN13<='export html'!$AR$7),\"\",IF(LEFT(AB13,1)<>\"*\",LEFT(AB13,FIND(\"-\",AB13)-1)-0,MID(AB13,2,FIND(\"-\",AB13)-2)-0))","v":""},9]
[null,null,10,"Paradeske",17,16,"-",5,9,2,33,54,-21,31,null,"Pouma United","1-8","6-1","","","","3-1","2-0","3-2","3-2",null,"2-2","*5-0",16,6,22,24,26,12,8,1,4,null,20,18,"2024-02-11","2023-10-08","2024-03-10","2024-03-24","2024-04-14","2023-11-19","2023-10-22","2023-09-03","2023-09-24",null,"2024-02-25","2024-02-04",null,1.9802020210000002,"Pouma United",36,17,{"$f":"CHOOSE(StandBer,COUNTIF(BQ40:CB40,\"t\")+COUNTIF(BZ31:BZ42,\"u\")+COUNTIF(CD40:CO40,\"t\")+COUNTIF(CM31:CM42,\"u\"),COUNTIF(BQ40:CB40,\"t\")+COUNTIF(BZ31:BZ42,\"u\"),COUNTIF(CD40:CO40,\"t\")+COUNTIF(CM31:CM42,\"u\"),COUNTIF(BQ40:CB40,\"t\")+COUNTIF(CD40:CO40,\"t\"),COUNTIF(BZ31:BZ42,\"u\")+COUNTIF(CM31:CM42,\"u\"))","v":11},{"$f":"CHOOSE(StandBer,COUNTIF(BQ40:CB40,\"u\")+COUNTIF(BZ31:BZ42,\"t\")+COUNTIF(CD40:CO40,\"u\")+COUNTIF(CM31:CM42,\"t\"),COUNTIF(BQ40:CB40,\"u\")+COUNTIF(BZ31:BZ42,\"t\"),COUNTIF(CD40:CO40,\"u\")+COUNTIF(CM31:CM42,\"t\"),COUNTIF(BQ40:CB40,\"u\")+COUNTIF(CD40:CO40,\"u\"),COUNTIF(BZ31:BZ42,\"t\")+COUNTIF(CM31:CM42,\"t\"))+BL14","v":3},{"$f":"CHOOSE(StandBer,COUNTIF(BQ40:CB40,\"g\")+COUNTIF(BZ31:BZ42,\"g\")+COUNTIF(CD40:CO40,\"g\")+COUNTIF(CM31:CM42,\"g\"),COUNTIF(BQ40:CB40,\"g\")+COUNTIF(BZ31:BZ42,\"g\"),COUNTIF(CD40:CO40,\"g\")+COUNTIF(CM31:CM42,\"g\"),COUNTIF(BQ40:CB40,\"g\")+COUNTIF(CD40:CO40,\"g\"),COUNTIF(BZ31:BZ42,\"g\")+COUNTIF(CM31:CM42,\"g\"))","v":3},{"$f":"CHOOSE(StandBer,SUM(BQ14:CB14)+SUM(BZ18:BZ29)+SUM(CD14:CO14)+SUM(CM18:CM29),SUM(BQ14:CB14)+SUM(BZ18:BZ29),SUM(CD14:CO14)+SUM(CM18:CM29),SUM(BQ14:CB14)+SUM(CD14:CO14),SUM(BZ18:BZ29)+SUM(CM18:CM29))-5*BL14","v":55},{"$f":"CHOOSE(StandBer,SUM(BZ5:BZ16)+SUM(BQ27:CB27)+SUM(CM5:CM16)+SUM(CD27:CO27),SUM(BZ5:BZ16)+SUM(BQ27:CB27),SUM(CM5:CM16)+SUM(CD27:CO27),SUM(BZ5:BZ16)+SUM(CM5:CM16),SUM(BQ27:CB27)+SUM(CD27:CO27))","v":37},18,{"$f":"CHOOSE(StandBer,COUNTIF(BQ40:CB40,\"ff\")+COUNTIF(BZ31:BZ42,\"ff\")+COUNTIF(CD40:CO40,\"ff\")+COUNTIF(CM31:CM42,\"ff\"),COUNTIF(BQ40:CB40,\"ff\")+COUNTIF(BZ31:BZ42,\"ff\"),COUNTIF(CD40:CO40,\"ff\")+COUNTIF(CM31:CM42,\"ff\"),COUNTIF(BQ40:CB40,\"ff\")+COUNTIF(CD40:CO40,\"ff\"),COUNTIF(BZ31:BZ42,\"ff\")+COUNTIF(CM31:CM42,\"ff\"))","v":0},10,9.9209101008999987,null,10,{"$f":"IF(OR(ISERROR(FIND(\"-\",Q14)),AC14>'export html'!$AR$7),\"\",IF(LEFT(Q14,1)<>\"*\",LEFT(Q14,FIND(\"-\",Q14)-1)-0,MID(Q14,2,FIND(\"-\",Q14)-2)-0))","v":""},{"$f":"IF(OR(ISERROR(FIND(\"-\",R14)),AD14>'export html'!$AR$7),\"\",IF(LEFT(R14,1)<>\"*\",LEFT(R14,FIND(\"-\",R14)-1)-0,MID(R14,2,FIND(\"-\",R14)-2)-0))","v":6},{"$f":"IF(OR(ISERROR(FIND(\"-\",S14)),AE14>'export html'!$AR$7),\"\",IF(LEFT(S14,1)<>\"*\",LEFT(S14,FIND(\"-\",S14)-1)-0,MID(S14,2,FIND(\"-\",S14)-2)-0))","v":""},{"$f":"IF(OR(ISERROR(FIND(\"-\",T14)),AF14>'export html'!$AR$7),\"\",IF(LEFT(T14,1)<>\"*\",LEFT(T14,FIND(\"-\",T14)-1)-0,MID(T14,2,FIND(\"-\",T14)-2)-0))","v":""},{"$f":"IF(OR(ISERROR(FIND(\"-\",U14)),AG14>'export html'!$AR$7),\"\",IF(LEFT(U14,1)<>\"*\",LEFT(U14,FIND(\"-\",U14)-1)-0,MID(U14,2,FIND(\"-\",U14)-2)-0))","v":""},{"$f":"IF(OR(ISERROR(FIND(\"-\",V14)),AH14>'export html'!$AR$7),\"\",IF(LEFT(V14,1)<>\"*\",LEFT(V14,FIND(\"-\",V14)-1)-0,MID(V14,2,FIND(\"-\",V14)-2)-0))","v":""},{"$f":"IF(OR(ISERROR(FIND(\"-\",W14)),AI14>'export html'!$AR$7),\"\",IF(LEFT(W14,1)<>\"*\",LEFT(W14,FIND(\"-\",W14)-1)-0,MID(W14,2,FIND(\"-\",W14)-2)-0))","v":2},{"$f":"IF(OR(ISERROR(FIND(\"-\",X14)),AJ14>'export html'!$AR$7),\"\",IF(LEFT(X14,1)<>\"*\",LEFT(X14,FIND(\"-\",X14)-1)-0,MID(X14,2,FIND(\"-\",X14)-2)-0))","v":3},{"$f":"IF(OR(ISERROR(FIND(\"-\",Y14)),AK14>'export html'!$AR$7),\"\",IF(LEFT(Y14,1)<>\"*\",LEFT(Y14,FIND(\"-\",Y14)-1)-0,MID(Y14,2,FIND(\"-\",Y14)-2)-0))","v":3},null,{"$f":"IF(OR(ISERROR(FIND(\"-\",AA14)),AM14>'export html'!$AR$7),\"\",IF(LEFT(AA14,1)<>\"*\",LEFT(AA14,FIND(\"-\",AA14)-1)-0,MID(AA14,2,FIND(\"-\",AA14)-2)-0))","v":""},{"$f":"IF(OR(ISERROR(FIND(\"-\",AB14)),AN14>'export html'!$AR$7),\"\",IF(LEFT(AB14,1)<>\"*\",LEFT(AB14,FIND(\"-\",AB14)-1)-0,MID(AB14,2,FIND(\"-\",AB14)-2)-0))","v":""},10,{"$f":"IF(OR(ISERROR(FIND(\"-\",Q14)),AC14<='export html'!$AR$7),\"\",IF(LEFT(Q14,1)<>\"*\",LEFT(Q14,FIND(\"-\",Q14)-1)-0,MID(Q14,2,FIND(\"-\",Q14)-2)-0))","v":1},{"$f":"IF(OR(ISERROR(FIND(\"-\",R14)),AD14<='export html'!$AR$7),\"\",IF(LEFT(R14,1)<>\"*\",LEFT(R14,FIND(\"-\",R14)-1)-0,MID(R14,2,FIND(\"-\",R14)-2)-0))","v":""},{"$f":"IF(OR(ISERROR(FIND(\"-\",S14)),AE14<='export html'!$AR$7),\"\",IF(LEFT(S14,1)<>\"*\",LEFT(S14,FIND(\"-\",S14)-1)-0,MID(S14,2,FIND(\"-\",S14)-2)-0))","v":""},{"$f":"IF(OR(ISERROR(FIND(\"-\",T14)),AF14<='export html'!$AR$7),\"\",IF(LEFT(T14,1)<>\"*\",LEFT(T14,FIND(\"-\",T14)-1)-0,MID(T14,2,FIND(\"-\",T14)-2)-0))","v":""},{"$f":"IF(OR(ISERROR(FIND(\"-\",U14)),AG14<='export html'!$AR$7),\"\",IF(LEFT(U14,1)<>\"*\",LEFT(U14,FIND(\"-\",U14)-1)-0,MID(U14,2,FIND(\"-\",U14)-2)-0))","v":""},{"$f":"IF(OR(ISERROR(FIND(\"-\",V14)),AH14<='export html'!$AR$7),\"\",IF(LEFT(V14,1)<>\"*\",LEFT(V14,FIND(\"-\",V14)-1)-0,MID(V14,2,FIND(\"-\",V14)-2)-0))","v":3},{"$f":"IF(OR(ISERROR(FIND(\"-\",W14)),AI14<='export html'!$AR$7),\"\",IF(LEFT(W14,1)<>\"*\",LEFT(W14,FIND(\"-\",W14)-1)-0,MID(W14,2,FIND(\"-\",W14)-2)-0))","v":""},{"$f":"IF(OR(ISERROR(FIND(\"-\",X14)),AJ14<='export html'!$AR$7),\"\",IF(LEFT(X14,1)<>\"*\",LEFT(X14,FIND(\"-\",X14)-1)-0,MID(X14,2,FIND(\"-\",X14)-2)-0))","v":""},{"$f":"IF(OR(ISERROR(FIND(\"-\",Y14)),AK14<='export html'!$AR$7),\"\",IF(LEFT(Y14,1)<>\"*\",LEFT(Y14,FIND(\"-\",Y14)-1)-0,MID(Y14,2,FIND(\"-\",Y14)-2)-0))","v":""},null,{"$f":"IF(OR(ISERROR(FIND(\"-\",AA14)),AM14<='export html'!$AR$7),\"\",IF(LEFT(AA14,1)<>\"*\",LEFT(AA14,FIND(\"-\",AA14)-1)-0,MID(AA14,2,FIND(\"-\",AA14)-2)-0))","v":2},{"$f":"IF(OR(ISERROR(FIND(\"-\",AB14)),AN14<='export html'!$AR$7),\"\",IF(LEFT(AB14,1)<>\"*\",LEFT(AB14,FIND(\"-\",AB14)-1)-0,MID(AB14,2,FIND(\"-\",AB14)-2)-0))","v":5},10]
[null,null,11,"Racing Emblem",{"$f":"3*H15+J15","v":16},{"$f":"SUM(H15:J15)","v":16},"-",4,8,4,29,34,{"$f":"K15-L15","v":-5},{"$f":"3*F15-E15","v":32},null,"Racing Emblem","","","","1-1","0-1","1-3","1-1","3-3","","2-3",null,"0-1",24,23,26,15,17,3,12,5,21,7,null,9,"2024-03-24","2024-03-17","2024-04-14","2024-01-14","2024-01-28","2023-09-17","2023-11-19","2023-10-01","2024-03-03","2023-10-15",null,"2023-10-29",null,10.9211091111,"Racing Emblem",16,16,{"$f":"CHOOSE(StandBer,COUNTIF(BQ41:CB41,\"t\")+COUNTIF(CA31:CA42,\"u\")+COUNTIF(CD41:CO41,\"t\")+COUNTIF(CN31:CN42,\"u\"),COUNTIF(BQ41:CB41,\"t\")+COUNTIF(CA31:CA42,\"u\"),COUNTIF(CD41:CO41,\"t\")+COUNTIF(CN31:CN42,\"u\"),COUNTIF(BQ41:CB41,\"t\")+COUNTIF(CD41:CO41,\"t\"),COUNTIF(CA31:CA42,\"u\")+COUNTIF(CN31:CN42,\"u\"))","v":4},{"$f":"CHOOSE(StandBer,COUNTIF(BQ41:CB41,\"u\")+COUNTIF(CA31:CA42,\"t\")+COUNTIF(CD41:CO41,\"u\")+COUNTIF(CN31:CN42,\"t\"),COUNTIF(BQ41:CB41,\"u\")+COUNTIF(CA31:CA42,\"t\"),COUNTIF(CD41:CO41,\"u\")+COUNTIF(CN31:CN42,\"t\"),COUNTIF(BQ41:CB41,\"u\")+COUNTIF(CD41:CO41,\"u\"),COUNTIF(CA31:CA42,\"t\")+COUNTIF(CN31:CN42,\"t\"))+BL15","v":8},{"$f":"CHOOSE(StandBer,COUNTIF(BQ41:CB41,\"g\")+COUNTIF(CA31:CA42,\"g\")+COUNTIF(CD41:CO41,\"g\")+COUNTIF(CN31:CN42,\"g\"),COUNTIF(BQ41:CB41,\"g\")+COUNTIF(CA31:CA42,\"g\"),COUNTIF(CD41:CO41,\"g\")+COUNTIF(CN31:CN42,\"g\"),COUNTIF(BQ41:CB41,\"g\")+COUNTIF(CD41:CO41,\"g\"),COUNTIF(CA31:CA42,\"g\")+COUNTIF(CN31:CN42,\"g\"))","v":4},{"$f":"CHOOSE(StandBer,SUM(BQ15:CB15)+SUM(CA18:CA29)+SUM(CD15:CO15)+SUM(CN18:CN29),SUM(BQ15:CB15)+SUM(CA18:CA29),SUM(CD15:CO15)+SUM(CN18:CN29),SUM(BQ15:CB15)+SUM(CD15:CO15),SUM(CA18:CA29)+SUM(CN18:CN29))-5*BL15","v":29},{"$f":"CHOOSE(StandBer,SUM(CA5:CA16)+SUM(BQ28:CB28)+SUM(CN5:CN16)+SUM(CD28:CO28),SUM(CA5:CA16)+SUM(BQ28:CB28),SUM(CN5:CN16)+SUM(CD28:CO28),SUM(CA5:CA16)+SUM(CN5:CN16),SUM(BQ28:CB28)+SUM(CD28:CO28))","v":34},-5,{"$f":"CHOOSE(StandBer,COUNTIF(BQ41:CB41,\"ff\")+COUNTIF(CA31:CA42,\"ff\")+COUNTIF(CD41:CO41,\"ff\")+COUNTIF(CN31:CN42,\"ff\"),COUNTIF(BQ41:CB41,\"ff\")+COUNTIF(CA31:CA42,\"ff\"),COUNTIF(CD41:CO41,\"ff\")+COUNTIF(CN31:CN42,\"ff\"),COUNTIF(BQ41:CB41,\"ff\")+COUNTIF(CD41:CO41,\"ff\"),COUNTIF(CA31:CA42,\"ff\")+COUNTIF(CN31:CN42,\"ff\"))","v":0},11,10.9211091111,null,11,{"$f":"IF(OR(ISERROR(FIND(\"-\",Q15)),AC15>'export html'!$AR$7),\"\",IF(LEFT(Q15,1)<>\"*\",LEFT(Q15,FIND(\"-\",Q15)-1)-0,MID(Q15,2,FIND(\"-\",Q15)-2)-0))","v":""},{"$f":"IF(OR(ISERROR(FIND(\"-\",R15)),AD15>'export html'!$AR$7),\"\",IF(LEFT(R15,1)<>\"*\",LEFT(R15,FIND(\"-\",R15)-1)-0,MID(R15,2,FIND(\"-\",R15)-2)-0))","v":""},{"$f":"IF(OR(ISERROR(FIND(\"-\",S15)),AE15>'export html'!$AR$7),\"\",IF(LEFT(S15,1)<>\"*\",LEFT(S15,FIND(\"-\",S15)-1)-0,MID(S15,2,FIND(\"-\",S15)-2)-0))","v":""},{"$f":"IF(OR(ISERROR(FIND(\"-\",T15)),AF15>'export html'!$AR$7),\"\",IF(LEFT(T15,1)<>\"*\",LEFT(T15,FIND(\"-\",T15)-1)-0,MID(T15,2,FIND(\"-\",T15)-2)-0))","v":""},{"$f":"IF(OR(ISERROR(FIND(\"-\",U15)),AG15>'export html'!$AR$7),\"\",IF(LEFT(U15,1)<>\"*\",LEFT(U15,FIND(\"-\",U15)-1)-0,MID(U15,2,FIND(\"-\",U15)-2)-0))","v":""},{"$f":"IF(OR(ISERROR(FIND(\"-\",V15)),AH15>'export html'!$AR$7),\"\",IF(LEFT(V15,1)<>\"*\",LEFT(V15,FIND(\"-\",V15)-1)-0,MID(V15,2,FIND(\"-\",V15)-2)-0))","v":1},{"$f":"IF(OR(ISERROR(FIND(\"-\",W15)),AI15>'export html'!$AR$7),\"\",IF(LEFT(W15,1)<>\"*\",LEFT(W15,FIND(\"-\",W15)-1)-0,MID(W15,2,FIND(\"-\",W15)-2)-0))","v":""},{"$f":"IF(OR(ISERROR(FIND(\"-\",X15)),AJ15>'export html'!$AR$7),\"\",IF(LEFT(X15,1)<>\"*\",LEFT(X15,FIND(\"-\",X15)-1)-0,MID(X15,2,FIND(\"-\",X15)-2)-0))","v":3},{"$f":"IF(OR(ISERROR(FIND(\"-\",Y15)),AK15>'export html'!$AR$7),\"\",IF(LEFT(Y15,1)<>\"*\",LEFT(Y15,FIND(\"-\",Y15)-1)-0,MID(Y15,2,FIND(\"-\",Y15)-2)-0))","v":""},{"$f":"IF(OR(ISERROR(FIND(\"-\",Z15)),AL15>'export html'!$AR$7),\"\",IF(LEFT(Z15,1)<>\"*\",LEFT(Z15,FIND(\"-\",Z15)-1)-0,MID(Z15,2,FIND(\"-\",Z15)-2)-0))","v":2},null,{"$f":"IF(OR(ISERROR(FIND(\"-\",AB15)),AN15>'export html'!$AR$7),\"\",IF(LEFT(AB15,1)<>\"*\",LEFT(AB15,FIND(\"-\",AB15)-1)-0,MID(AB15,2,FIND(\"-\",AB15)-2)-0))","v":0},11,{"$f":"IF(OR(ISERROR(FIND(\"-\",Q15)),AC15<='export html'!$AR$7),\"\",IF(LEFT(Q15,1)<>\"*\",LEFT(Q15,FIND(\"-\",Q15)-1)-0,MID(Q15,2,FIND(\"-\",Q15)-2)-0))","v":""},{"$f":"IF(OR(ISERROR(FIND(\"-\",R15)),AD15<='export html'!$AR$7),\"\",IF(LEFT(R15,1)<>\"*\",LEFT(R15,FIND(\"-\",R15)-1)-0,MID(R15,2,FIND(\"-\",R15)-2)-0))","v":""},{"$f":"IF(OR(ISERROR(FIND(\"-\",S15)),AE15<='export html'!$AR$7),\"\",IF(LEFT(S15,1)<>\"*\",LEFT(S15,FIND(\"-\",S15)-1)-0,MID(S15,2,FIND(\"-\",S15)-2)-0))","v":""},{"$f":"IF(OR(ISERROR(FIND(\"-\",T15)),AF15<='export html'!$AR$7),\"\",IF(LEFT(T15,1)<>\"*\",LEFT(T15,FIND(\"-\",T15)-1)-0,MID(T15,2,FIND(\"-\",T15)-2)-0))","v":1},{"$f":"IF(OR(ISERROR(FIND(\"-\",U15)),AG15<='export html'!$AR$7),\"\",IF(LEFT(U15,1)<>\"*\",LEFT(U15,FIND(\"-\",U15)-1)-0,MID(U15,2,FIND(\"-\",U15)-2)-0))","v":0},{"$f":"IF(OR(ISERROR(FIND(\"-\",V15)),AH15<='export html'!$AR$7),\"\",IF(LEFT(V15,1)<>\"*\",LEFT(V15,FIND(\"-\",V15)-1)-0,MID(V15,2,FIND(\"-\",V15)-2)-0))","v":""},{"$f":"IF(OR(ISERROR(FIND(\"-\",W15)),AI15<='export html'!$AR$7),\"\",IF(LEFT(W15,1)<>\"*\",LEFT(W15,FIND(\"-\",W15)-1)-0,MID(W15,2,FIND(\"-\",W15)-2)-0))","v":1},{"$f":"IF(OR(ISERROR(FIND(\"-\",X15)),AJ15<='export html'!$AR$7),\"\",IF(LEFT(X15,1)<>\"*\",LEFT(X15,FIND(\"-\",X15)-1)-0,MID(X15,2,FIND(\"-\",X15)-2)-0))","v":""},{"$f":"IF(OR(ISERROR(FIND(\"-\",Y15)),AK15<='export html'!$AR$7),\"\",IF(LEFT(Y15,1)<>\"*\",LEFT(Y15,FIND(\"-\",Y15)-1)-0,MID(Y15,2,FIND(\"-\",Y15)-2)-0))","v":""},{"$f":"IF(OR(ISERROR(FIND(\"-\",Z15)),AL15<='export html'!$AR$7),\"\",IF(LEFT(Z15,1)<>\"*\",LEFT(Z15,FIND(\"-\",Z15)-1)-0,MID(Z15,2,FIND(\"-\",Z15)-2)-0))","v":""},null,{"$f":"IF(OR(ISERROR(FIND(\"-\",AB15)),AN15<='export html'!$AR$7),\"\",IF(LEFT(AB15,1)<>\"*\",LEFT(AB15,FIND(\"-\",AB15)-1)-0,MID(AB15,2,FIND(\"-\",AB15)-2)-0))","v":""},11]
[null,null,12,"Jolika",6,16,"-",1,12,3,13,43,-30,42,null,"De Vrede","5-0","2-1","","","2-3","6-2","2-1","4-1","1-1","1-1","",null,20,8,24,26,15,1,10,3,19,5,22,null,"2024-02-25","2023-10-22","2024-03-24","2024-04-14","2024-01-14","2023-09-03","2023-11-05","2023-09-17","2024-02-18","2023-10-01","2024-03-10",null,null,5.9806060712000004,"De Vrede",22,17,{"$f":"CHOOSE(StandBer,COUNTIF(BQ42:CB42,\"t\")+COUNTIF(CB31:CB42,\"u\")+COUNTIF(CD42:CO42,\"t\")+COUNTIF(CO31:CO42,\"u\"),COUNTIF(BQ42:CB42,\"t\")+COUNTIF(CB31:CB42,\"u\"),COUNTIF(CD42:CO42,\"t\")+COUNTIF(CO31:CO42,\"u\"),COUNTIF(BQ42:CB42,\"t\")+COUNTIF(CD42:CO42,\"t\"),COUNTIF(CB31:CB42,\"u\")+COUNTIF(CO31:CO42,\"u\"))","v":6},{"$f":"CHOOSE(StandBer,COUNTIF(BQ42:CB42,\"u\")+COUNTIF(CB31:CB42,\"t\")+COUNTIF(CD42:CO42,\"u\")+COUNTIF(CO31:CO42,\"t\"),COUNTIF(BQ42:CB42,\"u\")+COUNTIF(CB31:CB42,\"t\"),COUNTIF(CD42:CO42,\"u\")+COUNTIF(CO31:CO42,\"t\"),COUNTIF(BQ42:CB42,\"u\")+COUNTIF(CD42:CO42,\"u\"),COUNTIF(CB31:CB42,\"t\")+COUNTIF(CO31:CO42,\"t\"))+BL16","v":7},{"$f":"CHOOSE(StandBer,COUNTIF(BQ42:CB42,\"g\")+COUNTIF(CB31:CB42,\"g\")+COUNTIF(CD42:CO42,\"g\")+COUNTIF(CO31:CO42,\"g\"),COUNTIF(BQ42:CB42,\"g\")+COUNTIF(CB31:CB42,\"g\"),COUNTIF(CD42:CO42,\"g\")+COUNTIF(CO31:CO42,\"g\"),COUNTIF(BQ42:CB42,\"g\")+COUNTIF(CD42:CO42,\"g\"),COUNTIF(CB31:CB42,\"g\")+COUNTIF(CO31:CO42,\"g\"))","v":4},{"$f":"CHOOSE(StandBer,SUM(BQ16:CB16)+SUM(CB18:CB29)+SUM(CD16:CO16)+SUM(CO18:CO29),SUM(BQ16:CB16)+SUM(CB18:CB29),SUM(CD16:CO16)+SUM(CO18:CO29),SUM(BQ16:CB16)+SUM(CD16:CO16),SUM(CB18:CB29)+SUM(CO18:CO29))-5*BL16","v":43},{"$f":"CHOOSE(StandBer,SUM(CB5:CB16)+SUM(BQ29:CB29)+SUM(CO5:CO16)+SUM(CD29:CO29),SUM(CB5:CB16)+SUM(BQ29:CB29),SUM(CO5:CO16)+SUM(CD29:CO29),SUM(CB5:CB16)+SUM(CO5:CO16),SUM(BQ29:CB29)+SUM(CD29:CO29))","v":42},1,{"$f":"CHOOSE(StandBer,COUNTIF(BQ42:CB42,\"ff\")+COUNTIF(CB31:CB42,\"ff\")+COUNTIF(CD42:CO42,\"ff\")+COUNTIF(CO31:CO42,\"ff\"),COUNTIF(BQ42:CB42,\"ff\")+COUNTIF(CB31:CB42,\"ff\"),COUNTIF(CD42:CO42,\"ff\")+COUNTIF(CO31:CO42,\"ff\"),COUNTIF(BQ42:CB42,\"ff\")+COUNTIF(CD42:CO42,\"ff\"),COUNTIF(CB31:CB42,\"ff\")+COUNTIF(CO31:CO42,\"ff\"))","v":0},12,11.9212121207,null,12,{"$f":"IF(OR(ISERROR(FIND(\"-\",Q16)),AC16>'export html'!$AR$7),\"\",IF(LEFT(Q16,1)<>\"*\",LEFT(Q16,FIND(\"-\",Q16)-1)-0,MID(Q16,2,FIND(\"-\",Q16)-2)-0))","v":""},{"$f":"IF(OR(ISERROR(FIND(\"-\",R16)),AD16>'export html'!$AR$7),\"\",IF(LEFT(R16,1)<>\"*\",LEFT(R16,FIND(\"-\",R16)-1)-0,MID(R16,2,FIND(\"-\",R16)-2)-0))","v":2},{"$f":"IF(OR(ISERROR(FIND(\"-\",S16)),AE16>'export html'!$AR$7),\"\",IF(LEFT(S16,1)<>\"*\",LEFT(S16,FIND(\"-\",S16)-1)-0,MID(S16,2,FIND(\"-\",S16)-2)-0))","v":""},{"$f":"IF(OR(ISERROR(FIND(\"-\",T16)),AF16>'export html'!$AR$7),\"\",IF(LEFT(T16,1)<>\"*\",LEFT(T16,FIND(\"-\",T16)-1)-0,MID(T16,2,FIND(\"-\",T16)-2)-0))","v":""},{"$f":"IF(OR(ISERROR(FIND(\"-\",U16)),AG16>'export html'!$AR$7),\"\",IF(LEFT(U16,1)<>\"*\",LEFT(U16,FIND(\"-\",U16)-1)-0,MID(U16,2,FIND(\"-\",U16)-2)-0))","v":""},{"$f":"IF(OR(ISERROR(FIND(\"-\",V16)),AH16>'export html'!$AR$7),\"\",IF(LEFT(V16,1)<>\"*\",LEFT(V16,FIND(\"-\",V16)-1)-0,MID(V16,2,FIND(\"-\",V16)-2)-0))","v":6},{"$f":"IF(OR(ISERROR(FIND(\"-\",W16)),AI16>'export html'!$AR$7),\"\",IF(LEFT(W16,1)<>\"*\",LEFT(W16,FIND(\"-\",W16)-1)-0,MID(W16,2,FIND(\"-\",W16)-2)-0))","v":2},{"$f":"IF(OR(ISERROR(FIND(\"-\",X16)),AJ16>'export html'!$AR$7),\"\",IF(LEFT(X16,1)<>\"*\",LEFT(X16,FIND(\"-\",X16)-1)-0,MID(X16,2,FIND(\"-\",X16)-2)-0))","v":4},{"$f":"IF(OR(ISERROR(FIND(\"-\",Y16)),AK16>'export html'!$AR$7),\"\",IF(LEFT(Y16,1)<>\"*\",LEFT(Y16,FIND(\"-\",Y16)-1)-0,MID(Y16,2,FIND(\"-\",Y16)-2)-0))","v":""},{"$f":"IF(OR(ISERROR(FIND(\"-\",Z16)),AL16>'export html'!$AR$7),\"\",IF(LEFT(Z16,1)<>\"*\",LEFT(Z16,FIND(\"-\",Z16)-1)-0,MID(Z16,2,FIND(\"-\",Z16)-2)-0))","v":1},{"$f":"IF(OR(ISERROR(FIND(\"-\",AA16)),AM16>'export html'!$AR$7),\"\",IF(LEFT(AA16,1)<>\"*\",LEFT(AA16,FIND(\"-\",AA16)-1)-0,MID(AA16,2,FIND(\"-\",AA16)-2)-0))","v":""},null,12,{"$f":"IF(OR(ISERROR(FIND(\"-\",Q16)),AC16<='export html'!$AR$7),\"\",IF(LEFT(Q16,1)<>\"*\",LEFT(Q16,FIND(\"-\",Q16)-1)-0,MID(Q16,2,FIND(\"-\",Q16)-2)-0))","v":5},{"$f":"IF(OR(ISERROR(FIND(\"-\",R16)),AD16<='export html'!$AR$7),\"\",IF(LEFT(R16,1)<>\"*\",LEFT(R16,FIND(\"-\",R16)-1)-0,MID(R16,2,FIND(\"-\",R16)-2)-0))","v":""},{"$f":"IF(OR(ISERROR(FIND(\"-\",S16)),AE16<='export html'!$AR$7),\"\",IF(LEFT(S16,1)<>\"*\",LEFT(S16,FIND(\"-\",S16)-1)-0,MID(S16,2,FIND(\"-\",S16)-2)-0))","v":""},{"$f":"IF(OR(ISERROR(FIND(\"-\",T16)),AF16<='export html'!$AR$7),\"\",IF(LEFT(T16,1)<>\"*\",LEFT(T16,FIND(\"-\",T16)-1)-0,MID(T16,2,FIND(\"-\",T16)-2)-0))","v":""},{"$f":"IF(OR(ISERROR(FIND(\"-\",U16)),AG16<='export html'!$AR$7),\"\",IF(LEFT(U16,1)<>\"*\",LEFT(U16,FIND(\"-\",U16)-1)-0,MID(U16,2,FIND(\"-\",U16)-2)-0))","v":2},{"$f":"IF(OR(ISERROR(FIND(\"-\",V16)),AH16<='export html'!$AR$7),\"\",IF(LEFT(V16,1)<>\"*\",LEFT(V16,FIND(\"-\",V16)-1)-0,MID(V16,2,FIND(\"-\",V16)-2)-0))","v":""},{"$f":"IF(OR(ISERROR(FIND(\"-\",W16)),AI16<='export html'!$AR$7),\"\",IF(LEFT(W16,1)<>\"*\",LEFT(W16,FIND(\"-\",W16)-1)-0,MID(W16,2,FIND(\"-\",W16)-2)-0))","v":""},{"$f":"IF(OR(ISERROR(FIND(\"-\",X16)),AJ16<='export html'!$AR$7),\"\",IF(LEFT(X16,1)<>\"*\",LEFT(X16,FIND(\"-\",X16)-1)-0,MID(X16,2,FIND(\"-\",X16)-2)-0))","v":""},{"$f":"IF(OR(ISERROR(FIND(\"-\",Y16)),AK16<='export html'!$AR$7),\"\",IF(LEFT(Y16,1)<>\"*\",LEFT(Y16,FIND(\"-\",Y16)-1)-0,MID(Y16,2,FIND(\"-\",Y16)-2)-0))","v":1},{"$f":"IF(OR(ISERROR(FIND(\"-\",Z16)),AL16<='export html'!$AR$7),\"\",IF(LEFT(Z16,1)<>\"*\",LEFT(Z16,FIND(\"-\",Z16)-1)-0,MID(Z16,2,FIND(\"-\",Z16)-2)-0))","v":""},{"$f":"IF(OR(ISERROR(FIND(\"-\",AA16)),AM16<='export html'!$AR$7),\"\",IF(LEFT(AA16,1)<>\"*\",LEFT(AA16,FIND(\"-\",AA16)-1)-0,MID(AA16,2,FIND(\"-\",AA16)-2)-0))","v":""},null,12]
[null,null,null,null,null,null,null,null,null,null,null,null,null,null,null,null,null,"* regeling forfaits",null,null,null,null,null,null,null,null,null,null,null,null,null,null,null,null,null,null,null,null,null,null,null,null,null,null,null,null,null,null,null,null,null,null,null,null,null,null,null,null,null,null,null,null,null,null,null,null,null,null,1,2,3,4,5,6,7,8,9,10,11,12,null,1,2,3,4,5,6,7,8,9,10,11,12]
[null,null,null,null,null,null,null,null,null,null,null,null,null,null,null,null,null,null,null,null,null,null,null,null,null,null,null,null,null,null,null,null,null,null,null,null,null,null,null,null,null,null,null,null,null,null,null,null,null,null,null,null,null,null,null,null,null,null,null,null,null,null,null,null,null,null,null,1,null,{"$f":"IF(OR(ISERROR(FIND(\"-\",R5)),AD5>'export html'!$AR$7),\"\",IF(RIGHT(R5)<>\"*\",MID(R5,FIND(\"-\",R5)+1,LEN(R5)-FIND(\"-\",R5))-0,MID(R5,FIND(\"-\",R5)+1,LEN(R5)-FIND(\"-\",R5)-1)-0))","v":1},{"$f":"IF(OR(ISERROR(FIND(\"-\",S5)),AE5>'export html'!$AR$7),\"\",IF(RIGHT(S5)<>\"*\",MID(S5,FIND(\"-\",S5)+1,LEN(S5)-FIND(\"-\",S5))-0,MID(S5,FIND(\"-\",S5)+1,LEN(S5)-FIND(\"-\",S5)-1)-0))","v":""},{"$f":"IF(OR(ISERROR(FIND(\"-\",T5)),AF5>'export html'!$AR$7),\"\",IF(RIGHT(T5)<>\"*\",MID(T5,FIND(\"-\",T5)+1,LEN(T5)-FIND(\"-\",T5))-0,MID(T5,FIND(\"-\",T5)+1,LEN(T5)-FIND(\"-\",T5)-1)-0))","v":""},{"$f":"IF(OR(ISERROR(FIND(\"-\",U5)),AG5>'export html'!$AR$7),\"\",IF(RIGHT(U5)<>\"*\",MID(U5,FIND(\"-\",U5)+1,LEN(U5)-FIND(\"-\",U5))-0,MID(U5,FIND(\"-\",U5)+1,LEN(U5)-FIND(\"-\",U5)-1)-0))","v":""},{"$f":"IF(OR(ISERROR(FIND(\"-\",V5)),AH5>'export html'!$AR$7),\"\",IF(RIGHT(V5)<>\"*\",MID(V5,FIND(\"-\",V5)+1,LEN(V5)-FIND(\"-\",V5))-0,MID(V5,FIND(\"-\",V5)+1,LEN(V5)-FIND(\"-\",V5)-1)-0))","v":""},{"$f":"IF(OR(ISERROR(FIND(\"-\",W5)),AI5>'export html'!$AR$7),\"\",IF(RIGHT(W5)<>\"*\",MID(W5,FIND(\"-\",W5)+1,LEN(W5)-FIND(\"-\",W5))-0,MID(W5,FIND(\"-\",W5)+1,LEN(W5)-FIND(\"-\",W5)-1)-0))","v":""},{"$f":"IF(OR(ISERROR(FIND(\"-\",X5)),AJ5>'export html'!$AR$7),\"\",IF(RIGHT(X5)<>\"*\",MID(X5,FIND(\"-\",X5)+1,LEN(X5)-FIND(\"-\",X5))-0,MID(X5,FIND(\"-\",X5)+1,LEN(X5)-FIND(\"-\",X5)-1)-0))","v":""},{"$f":"IF(OR(ISERROR(FIND(\"-\",Y5)),AK5>'export html'!$AR$7),\"\",IF(RIGHT(Y5)<>\"*\",MID(Y5,FIND(\"-\",Y5)+1,LEN(Y5)-FIND(\"-\",Y5))-0,MID(Y5,FIND(\"-\",Y5)+1,LEN(Y5)-FIND(\"-\",Y5)-1)-0))","v":2},{"$f":"IF(OR(ISERROR(FIND(\"-\",Z5)),AL5>'export html'!$AR$7),\"\",IF(RIGHT(Z5)<>\"*\",MID(Z5,FIND(\"-\",Z5)+1,LEN(Z5)-FIND(\"-\",Z5))-0,MID(Z5,FIND(\"-\",Z5)+1,LEN(Z5)-FIND(\"-\",Z5)-1)-0))","v":3},{"$f":"IF(OR(ISERROR(FIND(\"-\",AA5)),AM5>'export html'!$AR$7),\"\",IF(RIGHT(AA5)<>\"*\",MID(AA5,FIND(\"-\",AA5)+1,LEN(AA5)-FIND(\"-\",AA5))-0,MID(AA5,FIND(\"-\",AA5)+1,LEN(AA5)-FIND(\"-\",AA5)-1)-0))","v":4},{"$f":"IF(OR(ISERROR(FIND(\"-\",AB5)),AN5>'export html'!$AR$7),\"\",IF(RIGHT(AB5)<>\"*\",MID(AB5,FIND(\"-\",AB5)+1,LEN(AB5)-FIND(\"-\",AB5))-0,MID(AB5,FIND(\"-\",AB5)+1,LEN(AB5)-FIND(\"-\",AB5)-1)-0))","v":3},1,null,{"$f":"IF(OR(ISERROR(FIND(\"-\",R5)),AD5<='export html'!$AR$7),\"\",IF(RIGHT(R5)<>\"*\",MID(R5,FIND(\"-\",R5)+1,LEN(R5)-FIND(\"-\",R5))-0,MID(R5,FIND(\"-\",R5)+1,LEN(R5)-FIND(\"-\",R5)-1)-0))","v":""},{"$f":"IF(OR(ISERROR(FIND(\"-\",S5)),AE5<='export html'!$AR$7),\"\",IF(RIGHT(S5)<>\"*\",MID(S5,FIND(\"-\",S5)+1,LEN(S5)-FIND(\"-\",S5))-0,MID(S5,FIND(\"-\",S5)+1,LEN(S5)-FIND(\"-\",S5)-1)-0))","v":3},{"$f":"IF(OR(ISERROR(FIND(\"-\",T5)),AF5<='export html'!$AR$7),\"\",IF(RIGHT(T5)<>\"*\",MID(T5,FIND(\"-\",T5)+1,LEN(T5)-FIND(\"-\",T5))-0,MID(T5,FIND(\"-\",T5)+1,LEN(T5)-FIND(\"-\",T5)-1)-0))","v":2},{"$f":"IF(OR(ISERROR(FIND(\"-\",U5)),AG5<='export html'!$AR$7),\"\",IF(RIGHT(U5)<>\"*\",MID(U5,FIND(\"-\",U5)+1,LEN(U5)-FIND(\"-\",U5))-0,MID(U5,FIND(\"-\",U5)+1,LEN(U5)-FIND(\"-\",U5)-1)-0))","v":""},{"$f":"IF(OR(ISERROR(FIND(\"-\",V5)),AH5<='export html'!$AR$7),\"\",IF(RIGHT(V5)<>\"*\",MID(V5,FIND(\"-\",V5)+1,LEN(V5)-FIND(\"-\",V5))-0,MID(V5,FIND(\"-\",V5)+1,LEN(V5)-FIND(\"-\",V5)-1)-0))","v":""},{"$f":"IF(OR(ISERROR(FIND(\"-\",W5)),AI5<='export html'!$AR$7),\"\",IF(RIGHT(W5)<>\"*\",MID(W5,FIND(\"-\",W5)+1,LEN(W5)-FIND(\"-\",W5))-0,MID(W5,FIND(\"-\",W5)+1,LEN(W5)-FIND(\"-\",W5)-1)-0))","v":""},{"$f":"IF(OR(ISERROR(FIND(\"-\",X5)),AJ5<='export html'!$AR$7),\"\",IF(RIGHT(X5)<>\"*\",MID(X5,FIND(\"-\",X5)+1,LEN(X5)-FIND(\"-\",X5))-0,MID(X5,FIND(\"-\",X5)+1,LEN(X5)-FIND(\"-\",X5)-1)-0))","v":5},{"$f":"IF(OR(ISERROR(FIND(\"-\",Y5)),AK5<='export html'!$AR$7),\"\",IF(RIGHT(Y5)<>\"*\",MID(Y5,FIND(\"-\",Y5)+1,LEN(Y5)-FIND(\"-\",Y5))-0,MID(Y5,FIND(\"-\",Y5)+1,LEN(Y5)-FIND(\"-\",Y5)-1)-0))","v":""},{"$f":"IF(OR(ISERROR(FIND(\"-\",Z5)),AL5<='export html'!$AR$7),\"\",IF(RIGHT(Z5)<>\"*\",MID(Z5,FIND(\"-\",Z5)+1,LEN(Z5)-FIND(\"-\",Z5))-0,MID(Z5,FIND(\"-\",Z5)+1,LEN(Z5)-FIND(\"-\",Z5)-1)-0))","v":""},{"$f":"IF(OR(ISERROR(FIND(\"-\",AA5)),AM5<='export html'!$AR$7),\"\",IF(RIGHT(AA5)<>\"*\",MID(AA5,FIND(\"-\",AA5)+1,LEN(AA5)-FIND(\"-\",AA5))-0,MID(AA5,FIND(\"-\",AA5)+1,LEN(AA5)-FIND(\"-\",AA5)-1)-0))","v":""},{"$f":"IF(OR(ISERROR(FIND(\"-\",AB5)),AN5<='export html'!$AR$7),\"\",IF(RIGHT(AB5)<>\"*\",MID(AB5,FIND(\"-\",AB5)+1,LEN(AB5)-FIND(\"-\",AB5))-0,MID(AB5,FIND(\"-\",AB5)+1,LEN(AB5)-FIND(\"-\",AB5)-1)-0))","v":""},1]
[null,null,null,null,{"$f":"'export html'!V1","v":"Recentste duels op "},"2024-02-27",null,null,null,null,null,null,null,null,null,null,"Topschutters:",null,null,{"$f":"\"(na \" & SUM(spelersstatistieken!AI1) & \" match\" & IF(SUM(spelersstatistieken!AI1) = 1, \"\", \"en\" ) & \")\"","v":"(na 18 matchen)"},null,null,null,"Man van het Seizoen:",null,null,null,{"$f":"\"(na \" & COUNTIF( spelersstatistieken!AL40:BG40, \">0\" ) & \" match\" & IF( COUNTIF( spelersstatistieken!AL40:BG40, \">0\" ) = 1, \"\", \"en\" ) & \")\"","v":"(na 18 matchen)"},null,null,null,null,null,null,null,null,null,null,null,null,null,null,null,null,null,null,null,null,null,null,null,null,null,null,null,null,null,null,null,null,null,null,null,null,null,null,null,2,{"$f":"IF(OR(ISERROR(FIND(\"-\",Q6)),AC6>'export html'!$AR$7),\"\",IF(RIGHT(Q6)<>\"*\",MID(Q6,FIND(\"-\",Q6)+1,LEN(Q6)-FIND(\"-\",Q6))-0,MID(Q6,FIND(\"-\",Q6)+1,LEN(Q6)-FIND(\"-\",Q6)-1)-0))","v":""},null,{"$f":"IF(OR(ISERROR(FIND(\"-\",S6)),AE6>'export html'!$AR$7),\"\",IF(RIGHT(S6)<>\"*\",MID(S6,FIND(\"-\",S6)+1,LEN(S6)-FIND(\"-\",S6))-0,MID(S6,FIND(\"-\",S6)+1,LEN(S6)-FIND(\"-\",S6)-1)-0))","v":""},{"$f":"IF(OR(ISERROR(FIND(\"-\",T6)),AF6>'export html'!$AR$7),\"\",IF(RIGHT(T6)<>\"*\",MID(T6,FIND(\"-\",T6)+1,LEN(T6)-FIND(\"-\",T6))-0,MID(T6,FIND(\"-\",T6)+1,LEN(T6)-FIND(\"-\",T6)-1)-0))","v":0},{"$f":"IF(OR(ISERROR(FIND(\"-\",U6)),AG6>'export html'!$AR$7),\"\",IF(RIGHT(U6)<>\"*\",MID(U6,FIND(\"-\",U6)+1,LEN(U6)-FIND(\"-\",U6))-0,MID(U6,FIND(\"-\",U6)+1,LEN(U6)-FIND(\"-\",U6)-1)-0))","v":0},{"$f":"IF(OR(ISERROR(FIND(\"-\",V6)),AH6>'export html'!$AR$7),\"\",IF(RIGHT(V6)<>\"*\",MID(V6,FIND(\"-\",V6)+1,LEN(V6)-FIND(\"-\",V6))-0,MID(V6,FIND(\"-\",V6)+1,LEN(V6)-FIND(\"-\",V6)-1)-0))","v":""},{"$f":"IF(OR(ISERROR(FIND(\"-\",W6)),AI6>'export html'!$AR$7),\"\",IF(RIGHT(W6)<>\"*\",MID(W6,FIND(\"-\",W6)+1,LEN(W6)-FIND(\"-\",W6))-0,MID(W6,FIND(\"-\",W6)+1,LEN(W6)-FIND(\"-\",W6)-1)-0))","v":""},{"$f":"IF(OR(ISERROR(FIND(\"-\",X6)),AJ6>'export html'!$AR$7),\"\",IF(RIGHT(X6)<>\"*\",MID(X6,FIND(\"-\",X6)+1,LEN(X6)-FIND(\"-\",X6))-0,MID(X6,FIND(\"-\",X6)+1,LEN(X6)-FIND(\"-\",X6)-1)-0))","v":""},{"$f":"IF(OR(ISERROR(FIND(\"-\",Y6)),AK6>'export html'!$AR$7),\"\",IF(RIGHT(Y6)<>\"*\",MID(Y6,FIND(\"-\",Y6)+1,LEN(Y6)-FIND(\"-\",Y6))-0,MID(Y6,FIND(\"-\",Y6)+1,LEN(Y6)-FIND(\"-\",Y6)-1)-0))","v":0},{"$f":"IF(OR(ISERROR(FIND(\"-\",Z6)),AL6>'export html'!$AR$7),\"\",IF(RIGHT(Z6)<>\"*\",MID(Z6,FIND(\"-\",Z6)+1,LEN(Z6)-FIND(\"-\",Z6))-0,MID(Z6,FIND(\"-\",Z6)+1,LEN(Z6)-FIND(\"-\",Z6)-1)-0))","v":""},{"$f":"IF(OR(ISERROR(FIND(\"-\",AA6)),AM6>'export html'!$AR$7),\"\",IF(RIGHT(AA6)<>\"*\",MID(AA6,FIND(\"-\",AA6)+1,LEN(AA6)-FIND(\"-\",AA6))-0,MID(AA6,FIND(\"-\",AA6)+1,LEN(AA6)-FIND(\"-\",AA6)-1)-0))","v":3},{"$f":"IF(OR(ISERROR(FIND(\"-\",AB6)),AN6>'export html'!$AR$7),\"\",IF(RIGHT(AB6)<>\"*\",MID(AB6,FIND(\"-\",AB6)+1,LEN(AB6)-FIND(\"-\",AB6))-0,MID(AB6,FIND(\"-\",AB6)+1,LEN(AB6)-FIND(\"-\",AB6)-1)-0))","v":""},2,{"$f":"IF(OR(ISERROR(FIND(\"-\",Q6)),AC6<='export html'!$AR$7),\"\",IF(RIGHT(Q6)<>\"*\",MID(Q6,FIND(\"-\",Q6)+1,LEN(Q6)-FIND(\"-\",Q6))-0,MID(Q6,FIND(\"-\",Q6)+1,LEN(Q6)-FIND(\"-\",Q6)-1)-0))","v":""},null,{"$f":"IF(OR(ISERROR(FIND(\"-\",S6)),AE6<='export html'!$AR$7),\"\",IF(RIGHT(S6)<>\"*\",MID(S6,FIND(\"-\",S6)+1,LEN(S6)-FIND(\"-\",S6))-0,MID(S6,FIND(\"-\",S6)+1,LEN(S6)-FIND(\"-\",S6)-1)-0))","v":""},{"$f":"IF(OR(ISERROR(FIND(\"-\",T6)),AF6<='export html'!$AR$7),\"\",IF(RIGHT(T6)<>\"*\",MID(T6,FIND(\"-\",T6)+1,LEN(T6)-FIND(\"-\",T6))-0,MID(T6,FIND(\"-\",T6)+1,LEN(T6)-FIND(\"-\",T6)-1)-0))","v":""},{"$f":"IF(OR(ISERROR(FIND(\"-\",U6)),AG6<='export html'!$AR$7),\"\",IF(RIGHT(U6)<>\"*\",MID(U6,FIND(\"-\",U6)+1,LEN(U6)-FIND(\"-\",U6))-0,MID(U6,FIND(\"-\",U6)+1,LEN(U6)-FIND(\"-\",U6)-1)-0))","v":""},{"$f":"IF(OR(ISERROR(FIND(\"-\",V6)),AH6<='export html'!$AR$7),\"\",IF(RIGHT(V6)<>\"*\",MID(V6,FIND(\"-\",V6)+1,LEN(V6)-FIND(\"-\",V6))-0,MID(V6,FIND(\"-\",V6)+1,LEN(V6)-FIND(\"-\",V6)-1)-0))","v":0},{"$f":"IF(OR(ISERROR(FIND(\"-\",W6)),AI6<='export html'!$AR$7),\"\",IF(RIGHT(W6)<>\"*\",MID(W6,FIND(\"-\",W6)+1,LEN(W6)-FIND(\"-\",W6))-0,MID(W6,FIND(\"-\",W6)+1,LEN(W6)-FIND(\"-\",W6)-1)-0))","v":""},{"$f":"IF(OR(ISERROR(FIND(\"-\",X6)),AJ6<='export html'!$AR$7),\"\",IF(RIGHT(X6)<>\"*\",MID(X6,FIND(\"-\",X6)+1,LEN(X6)-FIND(\"-\",X6))-0,MID(X6,FIND(\"-\",X6)+1,LEN(X6)-FIND(\"-\",X6)-1)-0))","v":1},{"$f":"IF(OR(ISERROR(FIND(\"-\",Y6)),AK6<='export html'!$AR$7),\"\",IF(RIGHT(Y6)<>\"*\",MID(Y6,FIND(\"-\",Y6)+1,LEN(Y6)-FIND(\"-\",Y6))-0,MID(Y6,FIND(\"-\",Y6)+1,LEN(Y6)-FIND(\"-\",Y6)-1)-0))","v":""},{"$f":"IF(OR(ISERROR(FIND(\"-\",Z6)),AL6<='export html'!$AR$7),\"\",IF(RIGHT(Z6)<>\"*\",MID(Z6,FIND(\"-\",Z6)+1,LEN(Z6)-FIND(\"-\",Z6))-0,MID(Z6,FIND(\"-\",Z6)+1,LEN(Z6)-FIND(\"-\",Z6)-1)-0))","v":2},{"$f":"IF(OR(ISERROR(FIND(\"-\",AA6)),AM6<='export html'!$AR$7),\"\",IF(RIGHT(AA6)<>\"*\",MID(AA6,FIND(\"-\",AA6)+1,LEN(AA6)-FIND(\"-\",AA6))-0,MID(AA6,FIND(\"-\",AA6)+1,LEN(AA6)-FIND(\"-\",AA6)-1)-0))","v":""},{"$f":"IF(OR(ISERROR(FIND(\"-\",AB6)),AN6<='export html'!$AR$7),\"\",IF(RIGHT(AB6)<>\"*\",MID(AB6,FIND(\"-\",AB6)+1,LEN(AB6)-FIND(\"-\",AB6))-0,MID(AB6,FIND(\"-\",AB6)+1,LEN(AB6)-FIND(\"-\",AB6)-1)-0))","v":""},2]
[null,null,null,null,null,null,null,null,null,null,null,null,null,null,null,null,null,null,null,null,null,null,null,null,null,null,null,null,null,null,null,null,null,null,null,null,null,null,null,null,null,null,null,null,null,null,null,null,null,null,null,null,null,null,null,null,null,null,null,null,null,null,null,null,null,null,null,3,{"$f":"IF(OR(ISERROR(FIND(\"-\",Q7)),AC7>'export html'!$AR$7),\"\",IF(RIGHT(Q7)<>\"*\",MID(Q7,FIND(\"-\",Q7)+1,LEN(Q7)-FIND(\"-\",Q7))-0,MID(Q7,FIND(\"-\",Q7)+1,LEN(Q7)-FIND(\"-\",Q7)-1)-0))","v":1},{"$f":"IF(OR(ISERROR(FIND(\"-\",R7)),AD7>'export html'!$AR$7),\"\",IF(RIGHT(R7)<>\"*\",MID(R7,FIND(\"-\",R7)+1,LEN(R7)-FIND(\"-\",R7))-0,MID(R7,FIND(\"-\",R7)+1,LEN(R7)-FIND(\"-\",R7)-1)-0))","v":""},null,{"$f":"IF(OR(ISERROR(FIND(\"-\",T7)),AF7>'export html'!$AR$7),\"\",IF(RIGHT(T7)<>\"*\",MID(T7,FIND(\"-\",T7)+1,LEN(T7)-FIND(\"-\",T7))-0,MID(T7,FIND(\"-\",T7)+1,LEN(T7)-FIND(\"-\",T7)-1)-0))","v":""},{"$f":"IF(OR(ISERROR(FIND(\"-\",U7)),AG7>'export html'!$AR$7),\"\",IF(RIGHT(U7)<>\"*\",MID(U7,FIND(\"-\",U7)+1,LEN(U7)-FIND(\"-\",U7))-0,MID(U7,FIND(\"-\",U7)+1,LEN(U7)-FIND(\"-\",U7)-1)-0))","v":""},{"$f":"IF(OR(ISERROR(FIND(\"-\",V7)),AH7>'export html'!$AR$7),\"\",IF(RIGHT(V7)<>\"*\",MID(V7,FIND(\"-\",V7)+1,LEN(V7)-FIND(\"-\",V7))-0,MID(V7,FIND(\"-\",V7)+1,LEN(V7)-FIND(\"-\",V7)-1)-0))","v":2},{"$f":"IF(OR(ISERROR(FIND(\"-\",W7)),AI7>'export html'!$AR$7),\"\",IF(RIGHT(W7)<>\"*\",MID(W7,FIND(\"-\",W7)+1,LEN(W7)-FIND(\"-\",W7))-0,MID(W7,FIND(\"-\",W7)+1,LEN(W7)-FIND(\"-\",W7)-1)-0))","v":""},{"$f":"IF(OR(ISERROR(FIND(\"-\",X7)),AJ7>'export html'!$AR$7),\"\",IF(RIGHT(X7)<>\"*\",MID(X7,FIND(\"-\",X7)+1,LEN(X7)-FIND(\"-\",X7))-0,MID(X7,FIND(\"-\",X7)+1,LEN(X7)-FIND(\"-\",X7)-1)-0))","v":0},{"$f":"IF(OR(ISERROR(FIND(\"-\",Y7)),AK7>'export html'!$AR$7),\"\",IF(RIGHT(Y7)<>\"*\",MID(Y7,FIND(\"-\",Y7)+1,LEN(Y7)-FIND(\"-\",Y7))-0,MID(Y7,FIND(\"-\",Y7)+1,LEN(Y7)-FIND(\"-\",Y7)-1)-0))","v":""},{"$f":"IF(OR(ISERROR(FIND(\"-\",Z7)),AL7>'export html'!$AR$7),\"\",IF(RIGHT(Z7)<>\"*\",MID(Z7,FIND(\"-\",Z7)+1,LEN(Z7)-FIND(\"-\",Z7))-0,MID(Z7,FIND(\"-\",Z7)+1,LEN(Z7)-FIND(\"-\",Z7)-1)-0))","v":3},{"$f":"IF(OR(ISERROR(FIND(\"-\",AA7)),AM7>'export html'!$AR$7),\"\",IF(RIGHT(AA7)<>\"*\",MID(AA7,FIND(\"-\",AA7)+1,LEN(AA7)-FIND(\"-\",AA7))-0,MID(AA7,FIND(\"-\",AA7)+1,LEN(AA7)-FIND(\"-\",AA7)-1)-0))","v":""},{"$f":"IF(OR(ISERROR(FIND(\"-\",AB7)),AN7>'export html'!$AR$7),\"\",IF(RIGHT(AB7)<>\"*\",MID(AB7,FIND(\"-\",AB7)+1,LEN(AB7)-FIND(\"-\",AB7))-0,MID(AB7,FIND(\"-\",AB7)+1,LEN(AB7)-FIND(\"-\",AB7)-1)-0))","v":2},3,{"$f":"IF(OR(ISERROR(FIND(\"-\",Q7)),AC7<='export html'!$AR$7),\"\",IF(RIGHT(Q7)<>\"*\",MID(Q7,FIND(\"-\",Q7)+1,LEN(Q7)-FIND(\"-\",Q7))-0,MID(Q7,FIND(\"-\",Q7)+1,LEN(Q7)-FIND(\"-\",Q7)-1)-0))","v":""},{"$f":"IF(OR(ISERROR(FIND(\"-\",R7)),AD7<='export html'!$AR$7),\"\",IF(RIGHT(R7)<>\"*\",MID(R7,FIND(\"-\",R7)+1,LEN(R7)-FIND(\"-\",R7))-0,MID(R7,FIND(\"-\",R7)+1,LEN(R7)-FIND(\"-\",R7)-1)-0))","v":0},null,{"$f":"IF(OR(ISERROR(FIND(\"-\",T7)),AF7<='export html'!$AR$7),\"\",IF(RIGHT(T7)<>\"*\",MID(T7,FIND(\"-\",T7)+1,LEN(T7)-FIND(\"-\",T7))-0,MID(T7,FIND(\"-\",T7)+1,LEN(T7)-FIND(\"-\",T7)-1)-0))","v":0},{"$f":"IF(OR(ISERROR(FIND(\"-\",U7)),AG7<='export html'!$AR$7),\"\",IF(RIGHT(U7)<>\"*\",MID(U7,FIND(\"-\",U7)+1,LEN(U7)-FIND(\"-\",U7))-0,MID(U7,FIND(\"-\",U7)+1,LEN(U7)-FIND(\"-\",U7)-1)-0))","v":4},{"$f":"IF(OR(ISERROR(FIND(\"-\",V7)),AH7<='export html'!$AR$7),\"\",IF(RIGHT(V7)<>\"*\",MID(V7,FIND(\"-\",V7)+1,LEN(V7)-FIND(\"-\",V7))-0,MID(V7,FIND(\"-\",V7)+1,LEN(V7)-FIND(\"-\",V7)-1)-0))","v":""},{"$f":"IF(OR(ISERROR(FIND(\"-\",W7)),AI7<='export html'!$AR$7),\"\",IF(RIGHT(W7)<>\"*\",MID(W7,FIND(\"-\",W7)+1,LEN(W7)-FIND(\"-\",W7))-0,MID(W7,FIND(\"-\",W7)+1,LEN(W7)-FIND(\"-\",W7)-1)-0))","v":0},{"$f":"IF(OR(ISERROR(FIND(\"-\",X7)),AJ7<='export html'!$AR$7),\"\",IF(RIGHT(X7)<>\"*\",MID(X7,FIND(\"-\",X7)+1,LEN(X7)-FIND(\"-\",X7))-0,MID(X7,FIND(\"-\",X7)+1,LEN(X7)-FIND(\"-\",X7)-1)-0))","v":""},{"$f":"IF(OR(ISERROR(FIND(\"-\",Y7)),AK7<='export html'!$AR$7),\"\",IF(RIGHT(Y7)<>\"*\",MID(Y7,FIND(\"-\",Y7)+1,LEN(Y7)-FIND(\"-\",Y7))-0,MID(Y7,FIND(\"-\",Y7)+1,LEN(Y7)-FIND(\"-\",Y7)-1)-0))","v":""},{"$f":"IF(OR(ISERROR(FIND(\"-\",Z7)),AL7<='export html'!$AR$7),\"\",IF(RIGHT(Z7)<>\"*\",MID(Z7,FIND(\"-\",Z7)+1,LEN(Z7)-FIND(\"-\",Z7))-0,MID(Z7,FIND(\"-\",Z7)+1,LEN(Z7)-FIND(\"-\",Z7)-1)-0))","v":""},{"$f":"IF(OR(ISERROR(FIND(\"-\",AA7)),AM7<='export html'!$AR$7),\"\",IF(RIGHT(AA7)<>\"*\",MID(AA7,FIND(\"-\",AA7)+1,LEN(AA7)-FIND(\"-\",AA7))-0,MID(AA7,FIND(\"-\",AA7)+1,LEN(AA7)-FIND(\"-\",AA7)-1)-0))","v":1},{"$f":"IF(OR(ISERROR(FIND(\"-\",AB7)),AN7<='export html'!$AR$7),\"\",IF(RIGHT(AB7)<>\"*\",MID(AB7,FIND(\"-\",AB7)+1,LEN(AB7)-FIND(\"-\",AB7))-0,MID(AB7,FIND(\"-\",AB7)+1,LEN(AB7)-FIND(\"-\",AB7)-1)-0))","v":""},3]
[null,null,null,{"$f":"IF('export html'!T3=\"\",\"\",'export html'!T3)","v":"2024-02-25"},{"$f":"IF('export html'!U3=\"\",\"\",'export html'!U3)","v":20},{"$f":"IF('export html'!V3=\"\",\"\",'export html'!V3)","v":"Lucyvo - Boerenbond"},null,null,null,null,null,null,null,{"$f":"IF('export html'!W3=\"\",\"\",'export html'!W3)","v":"2-7"},null,null,{"$f":"_xlfn.CHOOSECOLS(_xlfn.ANCHORARRAY( 'export html'!AF3), 2, 1 )","v":12},"Stijn Hofmans",null,null,null,null,null,{"$f":"_xlfn.CHOOSECOLS(_xlfn.ANCHORARRAY( spelersstatistieken!AG301), 2, 1 )","v":187.58627646862942},"Stijn Hofmans",null,null,null,null,null,null,null,null,null,null,null,null,null,null,null,null,null,null,null,null,null,null,null,null,null,null,null,null,null,null,null,null,null,null,null,null,null,null,null,null,null,null,4,{"$f":"IF(OR(ISERROR(FIND(\"-\",Q8)),AC8>'export html'!$AR$7),\"\",IF(RIGHT(Q8)<>\"*\",MID(Q8,FIND(\"-\",Q8)+1,LEN(Q8)-FIND(\"-\",Q8))-0,MID(Q8,FIND(\"-\",Q8)+1,LEN(Q8)-FIND(\"-\",Q8)-1)-0))","v":1},{"$f":"IF(OR(ISERROR(FIND(\"-\",R8)),AD8>'export html'!$AR$7),\"\",IF(RIGHT(R8)<>\"*\",MID(R8,FIND(\"-\",R8)+1,LEN(R8)-FIND(\"-\",R8))-0,MID(R8,FIND(\"-\",R8)+1,LEN(R8)-FIND(\"-\",R8)-1)-0))","v":""},{"$f":"IF(OR(ISERROR(FIND(\"-\",S8)),AE8>'export html'!$AR$7),\"\",IF(RIGHT(S8)<>\"*\",MID(S8,FIND(\"-\",S8)+1,LEN(S8)-FIND(\"-\",S8))-0,MID(S8,FIND(\"-\",S8)+1,LEN(S8)-FIND(\"-\",S8)-1)-0))","v":2},null,{"$f":"IF(OR(ISERROR(FIND(\"-\",U8)),AG8>'export html'!$AR$7),\"\",IF(RIGHT(U8)<>\"*\",MID(U8,FIND(\"-\",U8)+1,LEN(U8)-FIND(\"-\",U8))-0,MID(U8,FIND(\"-\",U8)+1,LEN(U8)-FIND(\"-\",U8)-1)-0))","v":""},{"$f":"IF(OR(ISERROR(FIND(\"-\",V8)),AH8>'export html'!$AR$7),\"\",IF(RIGHT(V8)<>\"*\",MID(V8,FIND(\"-\",V8)+1,LEN(V8)-FIND(\"-\",V8))-0,MID(V8,FIND(\"-\",V8)+1,LEN(V8)-FIND(\"-\",V8)-1)-0))","v":0},{"$f":"IF(OR(ISERROR(FIND(\"-\",W8)),AI8>'export html'!$AR$7),\"\",IF(RIGHT(W8)<>\"*\",MID(W8,FIND(\"-\",W8)+1,LEN(W8)-FIND(\"-\",W8))-0,MID(W8,FIND(\"-\",W8)+1,LEN(W8)-FIND(\"-\",W8)-1)-0))","v":""},{"$f":"IF(OR(ISERROR(FIND(\"-\",X8)),AJ8>'export html'!$AR$7),\"\",IF(RIGHT(X8)<>\"*\",MID(X8,FIND(\"-\",X8)+1,LEN(X8)-FIND(\"-\",X8))-0,MID(X8,FIND(\"-\",X8)+1,LEN(X8)-FIND(\"-\",X8)-1)-0))","v":2},{"$f":"IF(OR(ISERROR(FIND(\"-\",Y8)),AK8>'export html'!$AR$7),\"\",IF(RIGHT(Y8)<>\"*\",MID(Y8,FIND(\"-\",Y8)+1,LEN(Y8)-FIND(\"-\",Y8))-0,MID(Y8,FIND(\"-\",Y8)+1,LEN(Y8)-FIND(\"-\",Y8)-1)-0))","v":""},{"$f":"IF(OR(ISERROR(FIND(\"-\",Z8)),AL8>'export html'!$AR$7),\"\",IF(RIGHT(Z8)<>\"*\",MID(Z8,FIND(\"-\",Z8)+1,LEN(Z8)-FIND(\"-\",Z8))-0,MID(Z8,FIND(\"-\",Z8)+1,LEN(Z8)-FIND(\"-\",Z8)-1)-0))","v":5},{"$f":"IF(OR(ISERROR(FIND(\"-\",AA8)),AM8>'export html'!$AR$7),\"\",IF(RIGHT(AA8)<>\"*\",MID(AA8,FIND(\"-\",AA8)+1,LEN(AA8)-FIND(\"-\",AA8))-0,MID(AA8,FIND(\"-\",AA8)+1,LEN(AA8)-FIND(\"-\",AA8)-1)-0))","v":1},{"$f":"IF(OR(ISERROR(FIND(\"-\",AB8)),AN8>'export html'!$AR$7),\"\",IF(RIGHT(AB8)<>\"*\",MID(AB8,FIND(\"-\",AB8)+1,LEN(AB8)-FIND(\"-\",AB8))-0,MID(AB8,FIND(\"-\",AB8)+1,LEN(AB8)-FIND(\"-\",AB8)-1)-0))","v":""},4,{"$f":"IF(OR(ISERROR(FIND(\"-\",Q8)),AC8<='export html'!$AR$7),\"\",IF(RIGHT(Q8)<>\"*\",MID(Q8,FIND(\"-\",Q8)+1,LEN(Q8)-FIND(\"-\",Q8))-0,MID(Q8,FIND(\"-\",Q8)+1,LEN(Q8)-FIND(\"-\",Q8)-1)-0))","v":""},{"$f":"IF(OR(ISERROR(FIND(\"-\",R8)),AD8<='export html'!$AR$7),\"\",IF(RIGHT(R8)<>\"*\",MID(R8,FIND(\"-\",R8)+1,LEN(R8)-FIND(\"-\",R8))-0,MID(R8,FIND(\"-\",R8)+1,LEN(R8)-FIND(\"-\",R8)-1)-0))","v":2},{"$f":"IF(OR(ISERROR(FIND(\"-\",S8)),AE8<='export html'!$AR$7),\"\",IF(RIGHT(S8)<>\"*\",MID(S8,FIND(\"-\",S8)+1,LEN(S8)-FIND(\"-\",S8))-0,MID(S8,FIND(\"-\",S8)+1,LEN(S8)-FIND(\"-\",S8)-1)-0))","v":""},null,{"$f":"IF(OR(ISERROR(FIND(\"-\",U8)),AG8<='export html'!$AR$7),\"\",IF(RIGHT(U8)<>\"*\",MID(U8,FIND(\"-\",U8)+1,LEN(U8)-FIND(\"-\",U8))-0,MID(U8,FIND(\"-\",U8)+1,LEN(U8)-FIND(\"-\",U8)-1)-0))","v":""},{"$f":"IF(OR(ISERROR(FIND(\"-\",V8)),AH8<='export html'!$AR$7),\"\",IF(RIGHT(V8)<>\"*\",MID(V8,FIND(\"-\",V8)+1,LEN(V8)-FIND(\"-\",V8))-0,MID(V8,FIND(\"-\",V8)+1,LEN(V8)-FIND(\"-\",V8)-1)-0))","v":""},{"$f":"IF(OR(ISERROR(FIND(\"-\",W8)),AI8<='export html'!$AR$7),\"\",IF(RIGHT(W8)<>\"*\",MID(W8,FIND(\"-\",W8)+1,LEN(W8)-FIND(\"-\",W8))-0,MID(W8,FIND(\"-\",W8)+1,LEN(W8)-FIND(\"-\",W8)-1)-0))","v":1},{"$f":"IF(OR(ISERROR(FIND(\"-\",X8)),AJ8<='export html'!$AR$7),\"\",IF(RIGHT(X8)<>\"*\",MID(X8,FIND(\"-\",X8)+1,LEN(X8)-FIND(\"-\",X8))-0,MID(X8,FIND(\"-\",X8)+1,LEN(X8)-FIND(\"-\",X8)-1)-0))","v":""},{"$f":"IF(OR(ISERROR(FIND(\"-\",Y8)),AK8<='export html'!$AR$7),\"\",IF(RIGHT(Y8)<>\"*\",MID(Y8,FIND(\"-\",Y8)+1,LEN(Y8)-FIND(\"-\",Y8))-0,MID(Y8,FIND(\"-\",Y8)+1,LEN(Y8)-FIND(\"-\",Y8)-1)-0))","v":""},{"$f":"IF(OR(ISERROR(FIND(\"-\",Z8)),AL8<='export html'!$AR$7),\"\",IF(RIGHT(Z8)<>\"*\",MID(Z8,FIND(\"-\",Z8)+1,LEN(Z8)-FIND(\"-\",Z8))-0,MID(Z8,FIND(\"-\",Z8)+1,LEN(Z8)-FIND(\"-\",Z8)-1)-0))","v":""},{"$f":"IF(OR(ISERROR(FIND(\"-\",AA8)),AM8<='export html'!$AR$7),\"\",IF(RIGHT(AA8)<>\"*\",MID(AA8,FIND(\"-\",AA8)+1,LEN(AA8)-FIND(\"-\",AA8))-0,MID(AA8,FIND(\"-\",AA8)+1,LEN(AA8)-FIND(\"-\",AA8)-1)-0))","v":""},{"$f":"IF(OR(ISERROR(FIND(\"-\",AB8)),AN8<='export html'!$AR$7),\"\",IF(RIGHT(AB8)<>\"*\",MID(AB8,FIND(\"-\",AB8)+1,LEN(AB8)-FIND(\"-\",AB8))-0,MID(AB8,FIND(\"-\",AB8)+1,LEN(AB8)-FIND(\"-\",AB8)-1)-0))","v":2},4]
[null,null,null,{"$f":"IF('export html'!T4=\"\",\"\",'export html'!T4)","v":"2024-02-18"},{"$f":"IF('export html'!U4=\"\",\"\",'export html'!U4)","v":19},{"$f":"IF('export html'!V4=\"\",\"\",'export html'!V4)","v":"Jolika - Lucyvo"},null,null,null,null,null,null,null,{"$f":"IF('export html'!W4=\"\",\"\",'export html'!W4)","v":"1-2"},null,null,11,"Glenn De Vinster",null,null,null,null,null,183.26878676878675,"Maarten De Groof",null,null,null,null,null,null,null,null,null,null,null,null,null,null,null,null,null,null,null,null,null,null,null,null,null,null,null,null,null,null,null,null,null,null,null,null,null,null,null,null,null,null,5,{"$f":"IF(OR(ISERROR(FIND(\"-\",Q9)),AC9>'export html'!$AR$7),\"\",IF(RIGHT(Q9)<>\"*\",MID(Q9,FIND(\"-\",Q9)+1,LEN(Q9)-FIND(\"-\",Q9))-0,MID(Q9,FIND(\"-\",Q9)+1,LEN(Q9)-FIND(\"-\",Q9)-1)-0))","v":0},{"$f":"IF(OR(ISERROR(FIND(\"-\",R9)),AD9>'export html'!$AR$7),\"\",IF(RIGHT(R9)<>\"*\",MID(R9,FIND(\"-\",R9)+1,LEN(R9)-FIND(\"-\",R9))-0,MID(R9,FIND(\"-\",R9)+1,LEN(R9)-FIND(\"-\",R9)-1)-0))","v":""},{"$f":"IF(OR(ISERROR(FIND(\"-\",S9)),AE9>'export html'!$AR$7),\"\",IF(RIGHT(S9)<>\"*\",MID(S9,FIND(\"-\",S9)+1,LEN(S9)-FIND(\"-\",S9))-0,MID(S9,FIND(\"-\",S9)+1,LEN(S9)-FIND(\"-\",S9)-1)-0))","v":1},{"$f":"IF(OR(ISERROR(FIND(\"-\",T9)),AF9>'export html'!$AR$7),\"\",IF(RIGHT(T9)<>\"*\",MID(T9,FIND(\"-\",T9)+1,LEN(T9)-FIND(\"-\",T9))-0,MID(T9,FIND(\"-\",T9)+1,LEN(T9)-FIND(\"-\",T9)-1)-0))","v":0},null,{"$f":"IF(OR(ISERROR(FIND(\"-\",V9)),AH9>'export html'!$AR$7),\"\",IF(RIGHT(V9)<>\"*\",MID(V9,FIND(\"-\",V9)+1,LEN(V9)-FIND(\"-\",V9))-0,MID(V9,FIND(\"-\",V9)+1,LEN(V9)-FIND(\"-\",V9)-1)-0))","v":""},{"$f":"IF(OR(ISERROR(FIND(\"-\",W9)),AI9>'export html'!$AR$7),\"\",IF(RIGHT(W9)<>\"*\",MID(W9,FIND(\"-\",W9)+1,LEN(W9)-FIND(\"-\",W9))-0,MID(W9,FIND(\"-\",W9)+1,LEN(W9)-FIND(\"-\",W9)-1)-0))","v":""},{"$f":"IF(OR(ISERROR(FIND(\"-\",X9)),AJ9>'export html'!$AR$7),\"\",IF(RIGHT(X9)<>\"*\",MID(X9,FIND(\"-\",X9)+1,LEN(X9)-FIND(\"-\",X9))-0,MID(X9,FIND(\"-\",X9)+1,LEN(X9)-FIND(\"-\",X9)-1)-0))","v":2},{"$f":"IF(OR(ISERROR(FIND(\"-\",Y9)),AK9>'export html'!$AR$7),\"\",IF(RIGHT(Y9)<>\"*\",MID(Y9,FIND(\"-\",Y9)+1,LEN(Y9)-FIND(\"-\",Y9))-0,MID(Y9,FIND(\"-\",Y9)+1,LEN(Y9)-FIND(\"-\",Y9)-1)-0))","v":""},{"$f":"IF(OR(ISERROR(FIND(\"-\",Z9)),AL9>'export html'!$AR$7),\"\",IF(RIGHT(Z9)<>\"*\",MID(Z9,FIND(\"-\",Z9)+1,LEN(Z9)-FIND(\"-\",Z9))-0,MID(Z9,FIND(\"-\",Z9)+1,LEN(Z9)-FIND(\"-\",Z9)-1)-0))","v":""},{"$f":"IF(OR(ISERROR(FIND(\"-\",AA9)),AM9>'export html'!$AR$7),\"\",IF(RIGHT(AA9)<>\"*\",MID(AA9,FIND(\"-\",AA9)+1,LEN(AA9)-FIND(\"-\",AA9))-0,MID(AA9,FIND(\"-\",AA9)+1,LEN(AA9)-FIND(\"-\",AA9)-1)-0))","v":1},{"$f":"IF(OR(ISERROR(FIND(\"-\",AB9)),AN9>'export html'!$AR$7),\"\",IF(RIGHT(AB9)<>\"*\",MID(AB9,FIND(\"-\",AB9)+1,LEN(AB9)-FIND(\"-\",AB9))-0,MID(AB9,FIND(\"-\",AB9)+1,LEN(AB9)-FIND(\"-\",AB9)-1)-0))","v":4},5,{"$f":"IF(OR(ISERROR(FIND(\"-\",Q9)),AC9<='export html'!$AR$7),\"\",IF(RIGHT(Q9)<>\"*\",MID(Q9,FIND(\"-\",Q9)+1,LEN(Q9)-FIND(\"-\",Q9))-0,MID(Q9,FIND(\"-\",Q9)+1,LEN(Q9)-FIND(\"-\",Q9)-1)-0))","v":""},{"$f":"IF(OR(ISERROR(FIND(\"-\",R9)),AD9<='export html'!$AR$7),\"\",IF(RIGHT(R9)<>\"*\",MID(R9,FIND(\"-\",R9)+1,LEN(R9)-FIND(\"-\",R9))-0,MID(R9,FIND(\"-\",R9)+1,LEN(R9)-FIND(\"-\",R9)-1)-0))","v":1},{"$f":"IF(OR(ISERROR(FIND(\"-\",S9)),AE9<='export html'!$AR$7),\"\",IF(RIGHT(S9)<>\"*\",MID(S9,FIND(\"-\",S9)+1,LEN(S9)-FIND(\"-\",S9))-0,MID(S9,FIND(\"-\",S9)+1,LEN(S9)-FIND(\"-\",S9)-1)-0))","v":""},{"$f":"IF(OR(ISERROR(FIND(\"-\",T9)),AF9<='export html'!$AR$7),\"\",IF(RIGHT(T9)<>\"*\",MID(T9,FIND(\"-\",T9)+1,LEN(T9)-FIND(\"-\",T9))-0,MID(T9,FIND(\"-\",T9)+1,LEN(T9)-FIND(\"-\",T9)-1)-0))","v":""},null,{"$f":"IF(OR(ISERROR(FIND(\"-\",V9)),AH9<='export html'!$AR$7),\"\",IF(RIGHT(V9)<>\"*\",MID(V9,FIND(\"-\",V9)+1,LEN(V9)-FIND(\"-\",V9))-0,MID(V9,FIND(\"-\",V9)+1,LEN(V9)-FIND(\"-\",V9)-1)-0))","v":""},{"$f":"IF(OR(ISERROR(FIND(\"-\",W9)),AI9<='export html'!$AR$7),\"\",IF(RIGHT(W9)<>\"*\",MID(W9,FIND(\"-\",W9)+1,LEN(W9)-FIND(\"-\",W9))-0,MID(W9,FIND(\"-\",W9)+1,LEN(W9)-FIND(\"-\",W9)-1)-0))","v":0},{"$f":"IF(OR(ISERROR(FIND(\"-\",X9)),AJ9<='export html'!$AR$7),\"\",IF(RIGHT(X9)<>\"*\",MID(X9,FIND(\"-\",X9)+1,LEN(X9)-FIND(\"-\",X9))-0,MID(X9,FIND(\"-\",X9)+1,LEN(X9)-FIND(\"-\",X9)-1)-0))","v":""},{"$f":"IF(OR(ISERROR(FIND(\"-\",Y9)),AK9<='export html'!$AR$7),\"\",IF(RIGHT(Y9)<>\"*\",MID(Y9,FIND(\"-\",Y9)+1,LEN(Y9)-FIND(\"-\",Y9))-0,MID(Y9,FIND(\"-\",Y9)+1,LEN(Y9)-FIND(\"-\",Y9)-1)-0))","v":1},{"$f":"IF(OR(ISERROR(FIND(\"-\",Z9)),AL9<='export html'!$AR$7),\"\",IF(RIGHT(Z9)<>\"*\",MID(Z9,FIND(\"-\",Z9)+1,LEN(Z9)-FIND(\"-\",Z9))-0,MID(Z9,FIND(\"-\",Z9)+1,LEN(Z9)-FIND(\"-\",Z9)-1)-0))","v":3},{"$f":"IF(OR(ISERROR(FIND(\"-\",AA9)),AM9<='export html'!$AR$7),\"\",IF(RIGHT(AA9)<>\"*\",MID(AA9,FIND(\"-\",AA9)+1,LEN(AA9)-FIND(\"-\",AA9))-0,MID(AA9,FIND(\"-\",AA9)+1,LEN(AA9)-FIND(\"-\",AA9)-1)-0))","v":""},{"$f":"IF(OR(ISERROR(FIND(\"-\",AB9)),AN9<='export html'!$AR$7),\"\",IF(RIGHT(AB9)<>\"*\",MID(AB9,FIND(\"-\",AB9)+1,LEN(AB9)-FIND(\"-\",AB9))-0,MID(AB9,FIND(\"-\",AB9)+1,LEN(AB9)-FIND(\"-\",AB9)-1)-0))","v":""},5]
[null,null,null,{"$f":"IF('export html'!T5=\"\",\"\",'export html'!T5)","v":"2024-02-11"},{"$f":"IF('export html'!U5=\"\",\"\",'export html'!U5)","v":16},{"$f":"IF('export html'!V5=\"\",\"\",'export html'!V5)","v":"Lucyvo - De Vrede"},null,null,null,null,null,null,null,{"$f":"IF('export html'!W5=\"\",\"\",'export html'!W5)","v":"6-5"},null,null,6,"Maarten De Groof",null,null,null,null,null,152.10540113481292,"Kaïn Verlooy",null,null,null,null,null,null,null,null,null,null,null,null,null,null,null,null,null,null,null,null,null,null,null,null,null,null,null,null,null,null,null,null,null,null,null,null,null,null,null,null,null,null,6,{"$f":"IF(OR(ISERROR(FIND(\"-\",Q10)),AC10>'export html'!$AR$7),\"\",IF(RIGHT(Q10)<>\"*\",MID(Q10,FIND(\"-\",Q10)+1,LEN(Q10)-FIND(\"-\",Q10))-0,MID(Q10,FIND(\"-\",Q10)+1,LEN(Q10)-FIND(\"-\",Q10)-1)-0))","v":1},{"$f":"IF(OR(ISERROR(FIND(\"-\",R10)),AD10>'export html'!$AR$7),\"\",IF(RIGHT(R10)<>\"*\",MID(R10,FIND(\"-\",R10)+1,LEN(R10)-FIND(\"-\",R10))-0,MID(R10,FIND(\"-\",R10)+1,LEN(R10)-FIND(\"-\",R10)-1)-0))","v":1},{"$f":"IF(OR(ISERROR(FIND(\"-\",S10)),AE10>'export html'!$AR$7),\"\",IF(RIGHT(S10)<>\"*\",MID(S10,FIND(\"-\",S10)+1,LEN(S10)-FIND(\"-\",S10))-0,MID(S10,FIND(\"-\",S10)+1,LEN(S10)-FIND(\"-\",S10)-1)-0))","v":""},{"$f":"IF(OR(ISERROR(FIND(\"-\",T10)),AF10>'export html'!$AR$7),\"\",IF(RIGHT(T10)<>\"*\",MID(T10,FIND(\"-\",T10)+1,LEN(T10)-FIND(\"-\",T10))-0,MID(T10,FIND(\"-\",T10)+1,LEN(T10)-FIND(\"-\",T10)-1)-0))","v":""},{"$f":"IF(OR(ISERROR(FIND(\"-\",U10)),AG10>'export html'!$AR$7),\"\",IF(RIGHT(U10)<>\"*\",MID(U10,FIND(\"-\",U10)+1,LEN(U10)-FIND(\"-\",U10))-0,MID(U10,FIND(\"-\",U10)+1,LEN(U10)-FIND(\"-\",U10)-1)-0))","v":7},null,{"$f":"IF(OR(ISERROR(FIND(\"-\",W10)),AI10>'export html'!$AR$7),\"\",IF(RIGHT(W10)<>\"*\",MID(W10,FIND(\"-\",W10)+1,LEN(W10)-FIND(\"-\",W10))-0,MID(W10,FIND(\"-\",W10)+1,LEN(W10)-FIND(\"-\",W10)-1)-0))","v":1},{"$f":"IF(OR(ISERROR(FIND(\"-\",X10)),AJ10>'export html'!$AR$7),\"\",IF(RIGHT(X10)<>\"*\",MID(X10,FIND(\"-\",X10)+1,LEN(X10)-FIND(\"-\",X10))-0,MID(X10,FIND(\"-\",X10)+1,LEN(X10)-FIND(\"-\",X10)-1)-0))","v":""},{"$f":"IF(OR(ISERROR(FIND(\"-\",Y10)),AK10>'export html'!$AR$7),\"\",IF(RIGHT(Y10)<>\"*\",MID(Y10,FIND(\"-\",Y10)+1,LEN(Y10)-FIND(\"-\",Y10))-0,MID(Y10,FIND(\"-\",Y10)+1,LEN(Y10)-FIND(\"-\",Y10)-1)-0))","v":""},{"$f":"IF(OR(ISERROR(FIND(\"-\",Z10)),AL10>'export html'!$AR$7),\"\",IF(RIGHT(Z10)<>\"*\",MID(Z10,FIND(\"-\",Z10)+1,LEN(Z10)-FIND(\"-\",Z10))-0,MID(Z10,FIND(\"-\",Z10)+1,LEN(Z10)-FIND(\"-\",Z10)-1)-0))","v":""},{"$f":"IF(OR(ISERROR(FIND(\"-\",AA10)),AM10>'export html'!$AR$7),\"\",IF(RIGHT(AA10)<>\"*\",MID(AA10,FIND(\"-\",AA10)+1,LEN(AA10)-FIND(\"-\",AA10))-0,MID(AA10,FIND(\"-\",AA10)+1,LEN(AA10)-FIND(\"-\",AA10)-1)-0))","v":""},{"$f":"IF(OR(ISERROR(FIND(\"-\",AB10)),AN10>'export html'!$AR$7),\"\",IF(RIGHT(AB10)<>\"*\",MID(AB10,FIND(\"-\",AB10)+1,LEN(AB10)-FIND(\"-\",AB10))-0,MID(AB10,FIND(\"-\",AB10)+1,LEN(AB10)-FIND(\"-\",AB10)-1)-0))","v":""},6,{"$f":"IF(OR(ISERROR(FIND(\"-\",Q10)),AC10<='export html'!$AR$7),\"\",IF(RIGHT(Q10)<>\"*\",MID(Q10,FIND(\"-\",Q10)+1,LEN(Q10)-FIND(\"-\",Q10))-0,MID(Q10,FIND(\"-\",Q10)+1,LEN(Q10)-FIND(\"-\",Q10)-1)-0))","v":""},{"$f":"IF(OR(ISERROR(FIND(\"-\",R10)),AD10<='export html'!$AR$7),\"\",IF(RIGHT(R10)<>\"*\",MID(R10,FIND(\"-\",R10)+1,LEN(R10)-FIND(\"-\",R10))-0,MID(R10,FIND(\"-\",R10)+1,LEN(R10)-FIND(\"-\",R10)-1)-0))","v":""},{"$f":"IF(OR(ISERROR(FIND(\"-\",S10)),AE10<='export html'!$AR$7),\"\",IF(RIGHT(S10)<>\"*\",MID(S10,FIND(\"-\",S10)+1,LEN(S10)-FIND(\"-\",S10))-0,MID(S10,FIND(\"-\",S10)+1,LEN(S10)-FIND(\"-\",S10)-1)-0))","v":1},{"$f":"IF(OR(ISERROR(FIND(\"-\",T10)),AF10<='export html'!$AR$7),\"\",IF(RIGHT(T10)<>\"*\",MID(T10,FIND(\"-\",T10)+1,LEN(T10)-FIND(\"-\",T10))-0,MID(T10,FIND(\"-\",T10)+1,LEN(T10)-FIND(\"-\",T10)-1)-0))","v":1},{"$f":"IF(OR(ISERROR(FIND(\"-\",U10)),AG10<='export html'!$AR$7),\"\",IF(RIGHT(U10)<>\"*\",MID(U10,FIND(\"-\",U10)+1,LEN(U10)-FIND(\"-\",U10))-0,MID(U10,FIND(\"-\",U10)+1,LEN(U10)-FIND(\"-\",U10)-1)-0))","v":""},null,{"$f":"IF(OR(ISERROR(FIND(\"-\",W10)),AI10<='export html'!$AR$7),\"\",IF(RIGHT(W10)<>\"*\",MID(W10,FIND(\"-\",W10)+1,LEN(W10)-FIND(\"-\",W10))-0,MID(W10,FIND(\"-\",W10)+1,LEN(W10)-FIND(\"-\",W10)-1)-0))","v":""},{"$f":"IF(OR(ISERROR(FIND(\"-\",X10)),AJ10<='export html'!$AR$7),\"\",IF(RIGHT(X10)<>\"*\",MID(X10,FIND(\"-\",X10)+1,LEN(X10)-FIND(\"-\",X10))-0,MID(X10,FIND(\"-\",X10)+1,LEN(X10)-FIND(\"-\",X10)-1)-0))","v":""},{"$f":"IF(OR(ISERROR(FIND(\"-\",Y10)),AK10<='export html'!$AR$7),\"\",IF(RIGHT(Y10)<>\"*\",MID(Y10,FIND(\"-\",Y10)+1,LEN(Y10)-FIND(\"-\",Y10))-0,MID(Y10,FIND(\"-\",Y10)+1,LEN(Y10)-FIND(\"-\",Y10)-1)-0))","v":2},{"$f":"IF(OR(ISERROR(FIND(\"-\",Z10)),AL10<='export html'!$AR$7),\"\",IF(RIGHT(Z10)<>\"*\",MID(Z10,FIND(\"-\",Z10)+1,LEN(Z10)-FIND(\"-\",Z10))-0,MID(Z10,FIND(\"-\",Z10)+1,LEN(Z10)-FIND(\"-\",Z10)-1)-0))","v":""},{"$f":"IF(OR(ISERROR(FIND(\"-\",AA10)),AM10<='export html'!$AR$7),\"\",IF(RIGHT(AA10)<>\"*\",MID(AA10,FIND(\"-\",AA10)+1,LEN(AA10)-FIND(\"-\",AA10))-0,MID(AA10,FIND(\"-\",AA10)+1,LEN(AA10)-FIND(\"-\",AA10)-1)-0))","v":2},{"$f":"IF(OR(ISERROR(FIND(\"-\",AB10)),AN10<='export html'!$AR$7),\"\",IF(RIGHT(AB10)<>\"*\",MID(AB10,FIND(\"-\",AB10)+1,LEN(AB10)-FIND(\"-\",AB10))-0,MID(AB10,FIND(\"-\",AB10)+1,LEN(AB10)-FIND(\"-\",AB10)-1)-0))","v":1},6]
[null,null,null,{"$f":"IF('export html'!T6=\"\",\"\",'export html'!T6)","v":"2024-02-04"},{"$f":"IF('export html'!U6=\"\",\"\",'export html'!U6)","v":18},{"$f":"IF('export html'!V6=\"\",\"\",'export html'!V6)","v":"Lucyvo - Racing Emblem"},null,null,null,null,null,null,null,{"$f":"IF('export html'!W6=\"\",\"\",'export html'!W6)","v":"3-5"},null,null,6,"Jason Vermeylen",null,null,null,null,null,145.79075989370108,"Glenn De Vinster",null,null,null,null,null,null,null,null,null,null,null,null,null,null,null,null,null,null,null,null,null,null,null,null,null,null,null,null,null,null,null,null,null,null,null,null,null,null,null,null,null,null,7,{"$f":"IF(OR(ISERROR(FIND(\"-\",Q11)),AC11>'export html'!$AR$7),\"\",IF(RIGHT(Q11)<>\"*\",MID(Q11,FIND(\"-\",Q11)+1,LEN(Q11)-FIND(\"-\",Q11))-0,MID(Q11,FIND(\"-\",Q11)+1,LEN(Q11)-FIND(\"-\",Q11)-1)-0))","v":""},{"$f":"IF(OR(ISERROR(FIND(\"-\",R11)),AD11>'export html'!$AR$7),\"\",IF(RIGHT(R11)<>\"*\",MID(R11,FIND(\"-\",R11)+1,LEN(R11)-FIND(\"-\",R11))-0,MID(R11,FIND(\"-\",R11)+1,LEN(R11)-FIND(\"-\",R11)-1)-0))","v":4},{"$f":"IF(OR(ISERROR(FIND(\"-\",S11)),AE11>'export html'!$AR$7),\"\",IF(RIGHT(S11)<>\"*\",MID(S11,FIND(\"-\",S11)+1,LEN(S11)-FIND(\"-\",S11))-0,MID(S11,FIND(\"-\",S11)+1,LEN(S11)-FIND(\"-\",S11)-1)-0))","v":1},{"$f":"IF(OR(ISERROR(FIND(\"-\",T11)),AF11>'export html'!$AR$7),\"\",IF(RIGHT(T11)<>\"*\",MID(T11,FIND(\"-\",T11)+1,LEN(T11)-FIND(\"-\",T11))-0,MID(T11,FIND(\"-\",T11)+1,LEN(T11)-FIND(\"-\",T11)-1)-0))","v":5},{"$f":"IF(OR(ISERROR(FIND(\"-\",U11)),AG11>'export html'!$AR$7),\"\",IF(RIGHT(U11)<>\"*\",MID(U11,FIND(\"-\",U11)+1,LEN(U11)-FIND(\"-\",U11))-0,MID(U11,FIND(\"-\",U11)+1,LEN(U11)-FIND(\"-\",U11)-1)-0))","v":1},{"$f":"IF(OR(ISERROR(FIND(\"-\",V11)),AH11>'export html'!$AR$7),\"\",IF(RIGHT(V11)<>\"*\",MID(V11,FIND(\"-\",V11)+1,LEN(V11)-FIND(\"-\",V11))-0,MID(V11,FIND(\"-\",V11)+1,LEN(V11)-FIND(\"-\",V11)-1)-0))","v":""},null,{"$f":"IF(OR(ISERROR(FIND(\"-\",X11)),AJ11>'export html'!$AR$7),\"\",IF(RIGHT(X11)<>\"*\",MID(X11,FIND(\"-\",X11)+1,LEN(X11)-FIND(\"-\",X11))-0,MID(X11,FIND(\"-\",X11)+1,LEN(X11)-FIND(\"-\",X11)-1)-0))","v":""},{"$f":"IF(OR(ISERROR(FIND(\"-\",Y11)),AK11>'export html'!$AR$7),\"\",IF(RIGHT(Y11)<>\"*\",MID(Y11,FIND(\"-\",Y11)+1,LEN(Y11)-FIND(\"-\",Y11))-0,MID(Y11,FIND(\"-\",Y11)+1,LEN(Y11)-FIND(\"-\",Y11)-1)-0))","v":1},{"$f":"IF(OR(ISERROR(FIND(\"-\",Z11)),AL11>'export html'!$AR$7),\"\",IF(RIGHT(Z11)<>\"*\",MID(Z11,FIND(\"-\",Z11)+1,LEN(Z11)-FIND(\"-\",Z11))-0,MID(Z11,FIND(\"-\",Z11)+1,LEN(Z11)-FIND(\"-\",Z11)-1)-0))","v":""},{"$f":"IF(OR(ISERROR(FIND(\"-\",AA11)),AM11>'export html'!$AR$7),\"\",IF(RIGHT(AA11)<>\"*\",MID(AA11,FIND(\"-\",AA11)+1,LEN(AA11)-FIND(\"-\",AA11))-0,MID(AA11,FIND(\"-\",AA11)+1,LEN(AA11)-FIND(\"-\",AA11)-1)-0))","v":""},{"$f":"IF(OR(ISERROR(FIND(\"-\",AB11)),AN11>'export html'!$AR$7),\"\",IF(RIGHT(AB11)<>\"*\",MID(AB11,FIND(\"-\",AB11)+1,LEN(AB11)-FIND(\"-\",AB11))-0,MID(AB11,FIND(\"-\",AB11)+1,LEN(AB11)-FIND(\"-\",AB11)-1)-0))","v":""},7,{"$f":"IF(OR(ISERROR(FIND(\"-\",Q11)),AC11<='export html'!$AR$7),\"\",IF(RIGHT(Q11)<>\"*\",MID(Q11,FIND(\"-\",Q11)+1,LEN(Q11)-FIND(\"-\",Q11))-0,MID(Q11,FIND(\"-\",Q11)+1,LEN(Q11)-FIND(\"-\",Q11)-1)-0))","v":5},{"$f":"IF(OR(ISERROR(FIND(\"-\",R11)),AD11<='export html'!$AR$7),\"\",IF(RIGHT(R11)<>\"*\",MID(R11,FIND(\"-\",R11)+1,LEN(R11)-FIND(\"-\",R11))-0,MID(R11,FIND(\"-\",R11)+1,LEN(R11)-FIND(\"-\",R11)-1)-0))","v":""},{"$f":"IF(OR(ISERROR(FIND(\"-\",S11)),AE11<='export html'!$AR$7),\"\",IF(RIGHT(S11)<>\"*\",MID(S11,FIND(\"-\",S11)+1,LEN(S11)-FIND(\"-\",S11))-0,MID(S11,FIND(\"-\",S11)+1,LEN(S11)-FIND(\"-\",S11)-1)-0))","v":""},{"$f":"IF(OR(ISERROR(FIND(\"-\",T11)),AF11<='export html'!$AR$7),\"\",IF(RIGHT(T11)<>\"*\",MID(T11,FIND(\"-\",T11)+1,LEN(T11)-FIND(\"-\",T11))-0,MID(T11,FIND(\"-\",T11)+1,LEN(T11)-FIND(\"-\",T11)-1)-0))","v":""},{"$f":"IF(OR(ISERROR(FIND(\"-\",U11)),AG11<='export html'!$AR$7),\"\",IF(RIGHT(U11)<>\"*\",MID(U11,FIND(\"-\",U11)+1,LEN(U11)-FIND(\"-\",U11))-0,MID(U11,FIND(\"-\",U11)+1,LEN(U11)-FIND(\"-\",U11)-1)-0))","v":""},{"$f":"IF(OR(ISERROR(FIND(\"-\",V11)),AH11<='export html'!$AR$7),\"\",IF(RIGHT(V11)<>\"*\",MID(V11,FIND(\"-\",V11)+1,LEN(V11)-FIND(\"-\",V11))-0,MID(V11,FIND(\"-\",V11)+1,LEN(V11)-FIND(\"-\",V11)-1)-0))","v":1},null,{"$f":"IF(OR(ISERROR(FIND(\"-\",X11)),AJ11<='export html'!$AR$7),\"\",IF(RIGHT(X11)<>\"*\",MID(X11,FIND(\"-\",X11)+1,LEN(X11)-FIND(\"-\",X11))-0,MID(X11,FIND(\"-\",X11)+1,LEN(X11)-FIND(\"-\",X11)-1)-0))","v":2},{"$f":"IF(OR(ISERROR(FIND(\"-\",Y11)),AK11<='export html'!$AR$7),\"\",IF(RIGHT(Y11)<>\"*\",MID(Y11,FIND(\"-\",Y11)+1,LEN(Y11)-FIND(\"-\",Y11))-0,MID(Y11,FIND(\"-\",Y11)+1,LEN(Y11)-FIND(\"-\",Y11)-1)-0))","v":""},{"$f":"IF(OR(ISERROR(FIND(\"-\",Z11)),AL11<='export html'!$AR$7),\"\",IF(RIGHT(Z11)<>\"*\",MID(Z11,FIND(\"-\",Z11)+1,LEN(Z11)-FIND(\"-\",Z11))-0,MID(Z11,FIND(\"-\",Z11)+1,LEN(Z11)-FIND(\"-\",Z11)-1)-0))","v":""},{"$f":"IF(OR(ISERROR(FIND(\"-\",AA11)),AM11<='export html'!$AR$7),\"\",IF(RIGHT(AA11)<>\"*\",MID(AA11,FIND(\"-\",AA11)+1,LEN(AA11)-FIND(\"-\",AA11))-0,MID(AA11,FIND(\"-\",AA11)+1,LEN(AA11)-FIND(\"-\",AA11)-1)-0))","v":""},{"$f":"IF(OR(ISERROR(FIND(\"-\",AB11)),AN11<='export html'!$AR$7),\"\",IF(RIGHT(AB11)<>\"*\",MID(AB11,FIND(\"-\",AB11)+1,LEN(AB11)-FIND(\"-\",AB11))-0,MID(AB11,FIND(\"-\",AB11)+1,LEN(AB11)-FIND(\"-\",AB11)-1)-0))","v":""},7]
[null,null,null,{"$f":"IF('export html'!T7=\"\",\"\",'export html'!T7)","v":"2024-01-28"},{"$f":"IF('export html'!U7=\"\",\"\",'export html'!U7)","v":17},{"$f":"IF('export html'!V7=\"\",\"\",'export html'!V7)","v":"Bariton - Lucyvo"},null,null,null,null,null,null,null,{"$f":"IF('export html'!W7=\"\",\"\",'export html'!W7)","v":"8-1"},null,null,4,"Steven De Groof",null,null,null,null,null,144.09082747318041,"Steven De Groof",null,null,null,null,null,null,null,null,null,null,null,null,null,null,null,null,null,null,null,null,null,null,null,null,null,null,null,null,null,null,null,null,null,null,null,null,null,null,null,null,null,null,8,{"$f":"IF(OR(ISERROR(FIND(\"-\",Q12)),AC12>'export html'!$AR$7),\"\",IF(RIGHT(Q12)<>\"*\",MID(Q12,FIND(\"-\",Q12)+1,LEN(Q12)-FIND(\"-\",Q12))-0,MID(Q12,FIND(\"-\",Q12)+1,LEN(Q12)-FIND(\"-\",Q12)-1)-0))","v":""},{"$f":"IF(OR(ISERROR(FIND(\"-\",R12)),AD12>'export html'!$AR$7),\"\",IF(RIGHT(R12)<>\"*\",MID(R12,FIND(\"-\",R12)+1,LEN(R12)-FIND(\"-\",R12))-0,MID(R12,FIND(\"-\",R12)+1,LEN(R12)-FIND(\"-\",R12)-1)-0))","v":1},{"$f":"IF(OR(ISERROR(FIND(\"-\",S12)),AE12>'export html'!$AR$7),\"\",IF(RIGHT(S12)<>\"*\",MID(S12,FIND(\"-\",S12)+1,LEN(S12)-FIND(\"-\",S12))-0,MID(S12,FIND(\"-\",S12)+1,LEN(S12)-FIND(\"-\",S12)-1)-0))","v":""},{"$f":"IF(OR(ISERROR(FIND(\"-\",T12)),AF12>'export html'!$AR$7),\"\",IF(RIGHT(T12)<>\"*\",MID(T12,FIND(\"-\",T12)+1,LEN(T12)-FIND(\"-\",T12))-0,MID(T12,FIND(\"-\",T12)+1,LEN(T12)-FIND(\"-\",T12)-1)-0))","v":""},{"$f":"IF(OR(ISERROR(FIND(\"-\",U12)),AG12>'export html'!$AR$7),\"\",IF(RIGHT(U12)<>\"*\",MID(U12,FIND(\"-\",U12)+1,LEN(U12)-FIND(\"-\",U12))-0,MID(U12,FIND(\"-\",U12)+1,LEN(U12)-FIND(\"-\",U12)-1)-0))","v":""},{"$f":"IF(OR(ISERROR(FIND(\"-\",V12)),AH12>'export html'!$AR$7),\"\",IF(RIGHT(V12)<>\"*\",MID(V12,FIND(\"-\",V12)+1,LEN(V12)-FIND(\"-\",V12))-0,MID(V12,FIND(\"-\",V12)+1,LEN(V12)-FIND(\"-\",V12)-1)-0))","v":1},{"$f":"IF(OR(ISERROR(FIND(\"-\",W12)),AI12>'export html'!$AR$7),\"\",IF(RIGHT(W12)<>\"*\",MID(W12,FIND(\"-\",W12)+1,LEN(W12)-FIND(\"-\",W12))-0,MID(W12,FIND(\"-\",W12)+1,LEN(W12)-FIND(\"-\",W12)-1)-0))","v":0},null,{"$f":"IF(OR(ISERROR(FIND(\"-\",Y12)),AK12>'export html'!$AR$7),\"\",IF(RIGHT(Y12)<>\"*\",MID(Y12,FIND(\"-\",Y12)+1,LEN(Y12)-FIND(\"-\",Y12))-0,MID(Y12,FIND(\"-\",Y12)+1,LEN(Y12)-FIND(\"-\",Y12)-1)-0))","v":6},{"$f":"IF(OR(ISERROR(FIND(\"-\",Z12)),AL12>'export html'!$AR$7),\"\",IF(RIGHT(Z12)<>\"*\",MID(Z12,FIND(\"-\",Z12)+1,LEN(Z12)-FIND(\"-\",Z12))-0,MID(Z12,FIND(\"-\",Z12)+1,LEN(Z12)-FIND(\"-\",Z12)-1)-0))","v":""},{"$f":"IF(OR(ISERROR(FIND(\"-\",AA12)),AM12>'export html'!$AR$7),\"\",IF(RIGHT(AA12)<>\"*\",MID(AA12,FIND(\"-\",AA12)+1,LEN(AA12)-FIND(\"-\",AA12))-0,MID(AA12,FIND(\"-\",AA12)+1,LEN(AA12)-FIND(\"-\",AA12)-1)-0))","v":""},{"$f":"IF(OR(ISERROR(FIND(\"-\",AB12)),AN12>'export html'!$AR$7),\"\",IF(RIGHT(AB12)<>\"*\",MID(AB12,FIND(\"-\",AB12)+1,LEN(AB12)-FIND(\"-\",AB12))-0,MID(AB12,FIND(\"-\",AB12)+1,LEN(AB12)-FIND(\"-\",AB12)-1)-0))","v":""},8,{"$f":"IF(OR(ISERROR(FIND(\"-\",Q12)),AC12<='export html'!$AR$7),\"\",IF(RIGHT(Q12)<>\"*\",MID(Q12,FIND(\"-\",Q12)+1,LEN(Q12)-FIND(\"-\",Q12))-0,MID(Q12,FIND(\"-\",Q12)+1,LEN(Q12)-FIND(\"-\",Q12)-1)-0))","v":""},{"$f":"IF(OR(ISERROR(FIND(\"-\",R12)),AD12<='export html'!$AR$7),\"\",IF(RIGHT(R12)<>\"*\",MID(R12,FIND(\"-\",R12)+1,LEN(R12)-FIND(\"-\",R12))-0,MID(R12,FIND(\"-\",R12)+1,LEN(R12)-FIND(\"-\",R12)-1)-0))","v":""},{"$f":"IF(OR(ISERROR(FIND(\"-\",S12)),AE12<='export html'!$AR$7),\"\",IF(RIGHT(S12)<>\"*\",MID(S12,FIND(\"-\",S12)+1,LEN(S12)-FIND(\"-\",S12))-0,MID(S12,FIND(\"-\",S12)+1,LEN(S12)-FIND(\"-\",S12)-1)-0))","v":7},{"$f":"IF(OR(ISERROR(FIND(\"-\",T12)),AF12<='export html'!$AR$7),\"\",IF(RIGHT(T12)<>\"*\",MID(T12,FIND(\"-\",T12)+1,LEN(T12)-FIND(\"-\",T12))-0,MID(T12,FIND(\"-\",T12)+1,LEN(T12)-FIND(\"-\",T12)-1)-0))","v":""},{"$f":"IF(OR(ISERROR(FIND(\"-\",U12)),AG12<='export html'!$AR$7),\"\",IF(RIGHT(U12)<>\"*\",MID(U12,FIND(\"-\",U12)+1,LEN(U12)-FIND(\"-\",U12))-0,MID(U12,FIND(\"-\",U12)+1,LEN(U12)-FIND(\"-\",U12)-1)-0))","v":""},{"$f":"IF(OR(ISERROR(FIND(\"-\",V12)),AH12<='export html'!$AR$7),\"\",IF(RIGHT(V12)<>\"*\",MID(V12,FIND(\"-\",V12)+1,LEN(V12)-FIND(\"-\",V12))-0,MID(V12,FIND(\"-\",V12)+1,LEN(V12)-FIND(\"-\",V12)-1)-0))","v":""},{"$f":"IF(OR(ISERROR(FIND(\"-\",W12)),AI12<='export html'!$AR$7),\"\",IF(RIGHT(W12)<>\"*\",MID(W12,FIND(\"-\",W12)+1,LEN(W12)-FIND(\"-\",W12))-0,MID(W12,FIND(\"-\",W12)+1,LEN(W12)-FIND(\"-\",W12)-1)-0))","v":""},null,{"$f":"IF(OR(ISERROR(FIND(\"-\",Y12)),AK12<='export html'!$AR$7),\"\",IF(RIGHT(Y12)<>\"*\",MID(Y12,FIND(\"-\",Y12)+1,LEN(Y12)-FIND(\"-\",Y12))-0,MID(Y12,FIND(\"-\",Y12)+1,LEN(Y12)-FIND(\"-\",Y12)-1)-0))","v":""},{"$f":"IF(OR(ISERROR(FIND(\"-\",Z12)),AL12<='export html'!$AR$7),\"\",IF(RIGHT(Z12)<>\"*\",MID(Z12,FIND(\"-\",Z12)+1,LEN(Z12)-FIND(\"-\",Z12))-0,MID(Z12,FIND(\"-\",Z12)+1,LEN(Z12)-FIND(\"-\",Z12)-1)-0))","v":4},{"$f":"IF(OR(ISERROR(FIND(\"-\",AA12)),AM12<='export html'!$AR$7),\"\",IF(RIGHT(AA12)<>\"*\",MID(AA12,FIND(\"-\",AA12)+1,LEN(AA12)-FIND(\"-\",AA12))-0,MID(AA12,FIND(\"-\",AA12)+1,LEN(AA12)-FIND(\"-\",AA12)-1)-0))","v":5},{"$f":"IF(OR(ISERROR(FIND(\"-\",AB12)),AN12<='export html'!$AR$7),\"\",IF(RIGHT(AB12)<>\"*\",MID(AB12,FIND(\"-\",AB12)+1,LEN(AB12)-FIND(\"-\",AB12))-0,MID(AB12,FIND(\"-\",AB12)+1,LEN(AB12)-FIND(\"-\",AB12)-1)-0))","v":5},8]
[null,null,null,{"$f":"IF('export html'!T8=\"\",\"\",'export html'!T8)","v":""},{"$f":"IF('export html'!U8=\"\",\"\",'export html'!U8)","v":""},{"$f":"IF('export html'!V8=\"\",\"\",'export html'!V8)","v":""},null,null,null,null,null,null,null,{"$f":"IF('export html'!W8=\"\",\"\",'export html'!W8)","v":""},null,null,null,null,null,null,null,null,null,null,null,null,null,null,null,null,null,null,null,null,null,null,null,null,null,null,null,null,null,null,null,null,null,null,null,null,null,null,null,null,null,null,null,null,null,null,null,null,null,null,null,null,null,9,{"$f":"IF(OR(ISERROR(FIND(\"-\",Q13)),AC13>'export html'!$AR$7),\"\",IF(RIGHT(Q13)<>\"*\",MID(Q13,FIND(\"-\",Q13)+1,LEN(Q13)-FIND(\"-\",Q13))-0,MID(Q13,FIND(\"-\",Q13)+1,LEN(Q13)-FIND(\"-\",Q13)-1)-0))","v":""},{"$f":"IF(OR(ISERROR(FIND(\"-\",R13)),AD13>'export html'!$AR$7),\"\",IF(RIGHT(R13)<>\"*\",MID(R13,FIND(\"-\",R13)+1,LEN(R13)-FIND(\"-\",R13))-0,MID(R13,FIND(\"-\",R13)+1,LEN(R13)-FIND(\"-\",R13)-1)-0))","v":""},{"$f":"IF(OR(ISERROR(FIND(\"-\",S13)),AE13>'export html'!$AR$7),\"\",IF(RIGHT(S13)<>\"*\",MID(S13,FIND(\"-\",S13)+1,LEN(S13)-FIND(\"-\",S13))-0,MID(S13,FIND(\"-\",S13)+1,LEN(S13)-FIND(\"-\",S13)-1)-0))","v":2},{"$f":"IF(OR(ISERROR(FIND(\"-\",T13)),AF13>'export html'!$AR$7),\"\",IF(RIGHT(T13)<>\"*\",MID(T13,FIND(\"-\",T13)+1,LEN(T13)-FIND(\"-\",T13))-0,MID(T13,FIND(\"-\",T13)+1,LEN(T13)-FIND(\"-\",T13)-1)-0))","v":""},{"$f":"IF(OR(ISERROR(FIND(\"-\",U13)),AG13>'export html'!$AR$7),\"\",IF(RIGHT(U13)<>\"*\",MID(U13,FIND(\"-\",U13)+1,LEN(U13)-FIND(\"-\",U13))-0,MID(U13,FIND(\"-\",U13)+1,LEN(U13)-FIND(\"-\",U13)-1)-0))","v":3},{"$f":"IF(OR(ISERROR(FIND(\"-\",V13)),AH13>'export html'!$AR$7),\"\",IF(RIGHT(V13)<>\"*\",MID(V13,FIND(\"-\",V13)+1,LEN(V13)-FIND(\"-\",V13))-0,MID(V13,FIND(\"-\",V13)+1,LEN(V13)-FIND(\"-\",V13)-1)-0))","v":""},{"$f":"IF(OR(ISERROR(FIND(\"-\",W13)),AI13>'export html'!$AR$7),\"\",IF(RIGHT(W13)<>\"*\",MID(W13,FIND(\"-\",W13)+1,LEN(W13)-FIND(\"-\",W13))-0,MID(W13,FIND(\"-\",W13)+1,LEN(W13)-FIND(\"-\",W13)-1)-0))","v":""},{"$f":"IF(OR(ISERROR(FIND(\"-\",X13)),AJ13>'export html'!$AR$7),\"\",IF(RIGHT(X13)<>\"*\",MID(X13,FIND(\"-\",X13)+1,LEN(X13)-FIND(\"-\",X13))-0,MID(X13,FIND(\"-\",X13)+1,LEN(X13)-FIND(\"-\",X13)-1)-0))","v":""},null,{"$f":"IF(OR(ISERROR(FIND(\"-\",Z13)),AL13>'export html'!$AR$7),\"\",IF(RIGHT(Z13)<>\"*\",MID(Z13,FIND(\"-\",Z13)+1,LEN(Z13)-FIND(\"-\",Z13))-0,MID(Z13,FIND(\"-\",Z13)+1,LEN(Z13)-FIND(\"-\",Z13)-1)-0))","v":""},{"$f":"IF(OR(ISERROR(FIND(\"-\",AA13)),AM13>'export html'!$AR$7),\"\",IF(RIGHT(AA13)<>\"*\",MID(AA13,FIND(\"-\",AA13)+1,LEN(AA13)-FIND(\"-\",AA13))-0,MID(AA13,FIND(\"-\",AA13)+1,LEN(AA13)-FIND(\"-\",AA13)-1)-0))","v":2},{"$f":"IF(OR(ISERROR(FIND(\"-\",AB13)),AN13>'export html'!$AR$7),\"\",IF(RIGHT(AB13)<>\"*\",MID(AB13,FIND(\"-\",AB13)+1,LEN(AB13)-FIND(\"-\",AB13))-0,MID(AB13,FIND(\"-\",AB13)+1,LEN(AB13)-FIND(\"-\",AB13)-1)-0))","v":2},9,{"$f":"IF(OR(ISERROR(FIND(\"-\",Q13)),AC13<='export html'!$AR$7),\"\",IF(RIGHT(Q13)<>\"*\",MID(Q13,FIND(\"-\",Q13)+1,LEN(Q13)-FIND(\"-\",Q13))-0,MID(Q13,FIND(\"-\",Q13)+1,LEN(Q13)-FIND(\"-\",Q13)-1)-0))","v":5},{"$f":"IF(OR(ISERROR(FIND(\"-\",R13)),AD13<='export html'!$AR$7),\"\",IF(RIGHT(R13)<>\"*\",MID(R13,FIND(\"-\",R13)+1,LEN(R13)-FIND(\"-\",R13))-0,MID(R13,FIND(\"-\",R13)+1,LEN(R13)-FIND(\"-\",R13)-1)-0))","v":""},{"$f":"IF(OR(ISERROR(FIND(\"-\",S13)),AE13<='export html'!$AR$7),\"\",IF(RIGHT(S13)<>\"*\",MID(S13,FIND(\"-\",S13)+1,LEN(S13)-FIND(\"-\",S13))-0,MID(S13,FIND(\"-\",S13)+1,LEN(S13)-FIND(\"-\",S13)-1)-0))","v":""},{"$f":"IF(OR(ISERROR(FIND(\"-\",T13)),AF13<='export html'!$AR$7),\"\",IF(RIGHT(T13)<>\"*\",MID(T13,FIND(\"-\",T13)+1,LEN(T13)-FIND(\"-\",T13))-0,MID(T13,FIND(\"-\",T13)+1,LEN(T13)-FIND(\"-\",T13)-1)-0))","v":2},{"$f":"IF(OR(ISERROR(FIND(\"-\",U13)),AG13<='export html'!$AR$7),\"\",IF(RIGHT(U13)<>\"*\",MID(U13,FIND(\"-\",U13)+1,LEN(U13)-FIND(\"-\",U13))-0,MID(U13,FIND(\"-\",U13)+1,LEN(U13)-FIND(\"-\",U13)-1)-0))","v":""},{"$f":"IF(OR(ISERROR(FIND(\"-\",V13)),AH13<='export html'!$AR$7),\"\",IF(RIGHT(V13)<>\"*\",MID(V13,FIND(\"-\",V13)+1,LEN(V13)-FIND(\"-\",V13))-0,MID(V13,FIND(\"-\",V13)+1,LEN(V13)-FIND(\"-\",V13)-1)-0))","v":""},{"$f":"IF(OR(ISERROR(FIND(\"-\",W13)),AI13<='export html'!$AR$7),\"\",IF(RIGHT(W13)<>\"*\",MID(W13,FIND(\"-\",W13)+1,LEN(W13)-FIND(\"-\",W13))-0,MID(W13,FIND(\"-\",W13)+1,LEN(W13)-FIND(\"-\",W13)-1)-0))","v":""},{"$f":"IF(OR(ISERROR(FIND(\"-\",X13)),AJ13<='export html'!$AR$7),\"\",IF(RIGHT(X13)<>\"*\",MID(X13,FIND(\"-\",X13)+1,LEN(X13)-FIND(\"-\",X13))-0,MID(X13,FIND(\"-\",X13)+1,LEN(X13)-FIND(\"-\",X13)-1)-0))","v":1},null,{"$f":"IF(OR(ISERROR(FIND(\"-\",Z13)),AL13<='export html'!$AR$7),\"\",IF(RIGHT(Z13)<>\"*\",MID(Z13,FIND(\"-\",Z13)+1,LEN(Z13)-FIND(\"-\",Z13))-0,MID(Z13,FIND(\"-\",Z13)+1,LEN(Z13)-FIND(\"-\",Z13)-1)-0))","v":6},{"$f":"IF(OR(ISERROR(FIND(\"-\",AA13)),AM13<='export html'!$AR$7),\"\",IF(RIGHT(AA13)<>\"*\",MID(AA13,FIND(\"-\",AA13)+1,LEN(AA13)-FIND(\"-\",AA13))-0,MID(AA13,FIND(\"-\",AA13)+1,LEN(AA13)-FIND(\"-\",AA13)-1)-0))","v":""},{"$f":"IF(OR(ISERROR(FIND(\"-\",AB13)),AN13<='export html'!$AR$7),\"\",IF(RIGHT(AB13)<>\"*\",MID(AB13,FIND(\"-\",AB13)+1,LEN(AB13)-FIND(\"-\",AB13))-0,MID(AB13,FIND(\"-\",AB13)+1,LEN(AB13)-FIND(\"-\",AB13)-1)-0))","v":""},9]
[null,null,null,null,null,null,null,null,null,null,null,null,null,null,null,null,null,null,null,null,null,null,null,null,null,null,null,null,null,null,null,null,null,null,null,null,null,null,null,null,null,null,null,null,null,null,null,null,null,null,null,null,null,null,null,null,null,null,null,null,null,null,null,null,null,null,null,10,{"$f":"IF(OR(ISERROR(FIND(\"-\",Q14)),AC14>'export html'!$AR$7),\"\",IF(RIGHT(Q14)<>\"*\",MID(Q14,FIND(\"-\",Q14)+1,LEN(Q14)-FIND(\"-\",Q14))-0,MID(Q14,FIND(\"-\",Q14)+1,LEN(Q14)-FIND(\"-\",Q14)-1)-0))","v":""},{"$f":"IF(OR(ISERROR(FIND(\"-\",R14)),AD14>'export html'!$AR$7),\"\",IF(RIGHT(R14)<>\"*\",MID(R14,FIND(\"-\",R14)+1,LEN(R14)-FIND(\"-\",R14))-0,MID(R14,FIND(\"-\",R14)+1,LEN(R14)-FIND(\"-\",R14)-1)-0))","v":1},{"$f":"IF(OR(ISERROR(FIND(\"-\",S14)),AE14>'export html'!$AR$7),\"\",IF(RIGHT(S14)<>\"*\",MID(S14,FIND(\"-\",S14)+1,LEN(S14)-FIND(\"-\",S14))-0,MID(S14,FIND(\"-\",S14)+1,LEN(S14)-FIND(\"-\",S14)-1)-0))","v":""},{"$f":"IF(OR(ISERROR(FIND(\"-\",T14)),AF14>'export html'!$AR$7),\"\",IF(RIGHT(T14)<>\"*\",MID(T14,FIND(\"-\",T14)+1,LEN(T14)-FIND(\"-\",T14))-0,MID(T14,FIND(\"-\",T14)+1,LEN(T14)-FIND(\"-\",T14)-1)-0))","v":""},{"$f":"IF(OR(ISERROR(FIND(\"-\",U14)),AG14>'export html'!$AR$7),\"\",IF(RIGHT(U14)<>\"*\",MID(U14,FIND(\"-\",U14)+1,LEN(U14)-FIND(\"-\",U14))-0,MID(U14,FIND(\"-\",U14)+1,LEN(U14)-FIND(\"-\",U14)-1)-0))","v":""},{"$f":"IF(OR(ISERROR(FIND(\"-\",V14)),AH14>'export html'!$AR$7),\"\",IF(RIGHT(V14)<>\"*\",MID(V14,FIND(\"-\",V14)+1,LEN(V14)-FIND(\"-\",V14))-0,MID(V14,FIND(\"-\",V14)+1,LEN(V14)-FIND(\"-\",V14)-1)-0))","v":""},{"$f":"IF(OR(ISERROR(FIND(\"-\",W14)),AI14>'export html'!$AR$7),\"\",IF(RIGHT(W14)<>\"*\",MID(W14,FIND(\"-\",W14)+1,LEN(W14)-FIND(\"-\",W14))-0,MID(W14,FIND(\"-\",W14)+1,LEN(W14)-FIND(\"-\",W14)-1)-0))","v":0},{"$f":"IF(OR(ISERROR(FIND(\"-\",X14)),AJ14>'export html'!$AR$7),\"\",IF(RIGHT(X14)<>\"*\",MID(X14,FIND(\"-\",X14)+1,LEN(X14)-FIND(\"-\",X14))-0,MID(X14,FIND(\"-\",X14)+1,LEN(X14)-FIND(\"-\",X14)-1)-0))","v":2},{"$f":"IF(OR(ISERROR(FIND(\"-\",Y14)),AK14>'export html'!$AR$7),\"\",IF(RIGHT(Y14)<>\"*\",MID(Y14,FIND(\"-\",Y14)+1,LEN(Y14)-FIND(\"-\",Y14))-0,MID(Y14,FIND(\"-\",Y14)+1,LEN(Y14)-FIND(\"-\",Y14)-1)-0))","v":2},null,{"$f":"IF(OR(ISERROR(FIND(\"-\",AA14)),AM14>'export html'!$AR$7),\"\",IF(RIGHT(AA14)<>\"*\",MID(AA14,FIND(\"-\",AA14)+1,LEN(AA14)-FIND(\"-\",AA14))-0,MID(AA14,FIND(\"-\",AA14)+1,LEN(AA14)-FIND(\"-\",AA14)-1)-0))","v":""},{"$f":"IF(OR(ISERROR(FIND(\"-\",AB14)),AN14>'export html'!$AR$7),\"\",IF(RIGHT(AB14)<>\"*\",MID(AB14,FIND(\"-\",AB14)+1,LEN(AB14)-FIND(\"-\",AB14))-0,MID(AB14,FIND(\"-\",AB14)+1,LEN(AB14)-FIND(\"-\",AB14)-1)-0))","v":""},10,{"$f":"IF(OR(ISERROR(FIND(\"-\",Q14)),AC14<='export html'!$AR$7),\"\",IF(RIGHT(Q14)<>\"*\",MID(Q14,FIND(\"-\",Q14)+1,LEN(Q14)-FIND(\"-\",Q14))-0,MID(Q14,FIND(\"-\",Q14)+1,LEN(Q14)-FIND(\"-\",Q14)-1)-0))","v":8},{"$f":"IF(OR(ISERROR(FIND(\"-\",R14)),AD14<='export html'!$AR$7),\"\",IF(RIGHT(R14)<>\"*\",MID(R14,FIND(\"-\",R14)+1,LEN(R14)-FIND(\"-\",R14))-0,MID(R14,FIND(\"-\",R14)+1,LEN(R14)-FIND(\"-\",R14)-1)-0))","v":""},{"$f":"IF(OR(ISERROR(FIND(\"-\",S14)),AE14<='export html'!$AR$7),\"\",IF(RIGHT(S14)<>\"*\",MID(S14,FIND(\"-\",S14)+1,LEN(S14)-FIND(\"-\",S14))-0,MID(S14,FIND(\"-\",S14)+1,LEN(S14)-FIND(\"-\",S14)-1)-0))","v":""},{"$f":"IF(OR(ISERROR(FIND(\"-\",T14)),AF14<='export html'!$AR$7),\"\",IF(RIGHT(T14)<>\"*\",MID(T14,FIND(\"-\",T14)+1,LEN(T14)-FIND(\"-\",T14))-0,MID(T14,FIND(\"-\",T14)+1,LEN(T14)-FIND(\"-\",T14)-1)-0))","v":""},{"$f":"IF(OR(ISERROR(FIND(\"-\",U14)),AG14<='export html'!$AR$7),\"\",IF(RIGHT(U14)<>\"*\",MID(U14,FIND(\"-\",U14)+1,LEN(U14)-FIND(\"-\",U14))-0,MID(U14,FIND(\"-\",U14)+1,LEN(U14)-FIND(\"-\",U14)-1)-0))","v":""},{"$f":"IF(OR(ISERROR(FIND(\"-\",V14)),AH14<='export html'!$AR$7),\"\",IF(RIGHT(V14)<>\"*\",MID(V14,FIND(\"-\",V14)+1,LEN(V14)-FIND(\"-\",V14))-0,MID(V14,FIND(\"-\",V14)+1,LEN(V14)-FIND(\"-\",V14)-1)-0))","v":1},{"$f":"IF(OR(ISERROR(FIND(\"-\",W14)),AI14<='export html'!$AR$7),\"\",IF(RIGHT(W14)<>\"*\",MID(W14,FIND(\"-\",W14)+1,LEN(W14)-FIND(\"-\",W14))-0,MID(W14,FIND(\"-\",W14)+1,LEN(W14)-FIND(\"-\",W14)-1)-0))","v":""},{"$f":"IF(OR(ISERROR(FIND(\"-\",X14)),AJ14<='export html'!$AR$7),\"\",IF(RIGHT(X14)<>\"*\",MID(X14,FIND(\"-\",X14)+1,LEN(X14)-FIND(\"-\",X14))-0,MID(X14,FIND(\"-\",X14)+1,LEN(X14)-FIND(\"-\",X14)-1)-0))","v":""},{"$f":"IF(OR(ISERROR(FIND(\"-\",Y14)),AK14<='export html'!$AR$7),\"\",IF(RIGHT(Y14)<>\"*\",MID(Y14,FIND(\"-\",Y14)+1,LEN(Y14)-FIND(\"-\",Y14))-0,MID(Y14,FIND(\"-\",Y14)+1,LEN(Y14)-FIND(\"-\",Y14)-1)-0))","v":""},null,{"$f":"IF(OR(ISERROR(FIND(\"-\",AA14)),AM14<='export html'!$AR$7),\"\",IF(RIGHT(AA14)<>\"*\",MID(AA14,FIND(\"-\",AA14)+1,LEN(AA14)-FIND(\"-\",AA14))-0,MID(AA14,FIND(\"-\",AA14)+1,LEN(AA14)-FIND(\"-\",AA14)-1)-0))","v":2},{"$f":"IF(OR(ISERROR(FIND(\"-\",AB14)),AN14<='export html'!$AR$7),\"\",IF(RIGHT(AB14)<>\"*\",MID(AB14,FIND(\"-\",AB14)+1,LEN(AB14)-FIND(\"-\",AB14))-0,MID(AB14,FIND(\"-\",AB14)+1,LEN(AB14)-FIND(\"-\",AB14)-1)-0))","v":0},10]
[null,null,null,null,null,null,null,null,null,null,null,null,null,null,null,null,null,null,null,null,null,null,null,null,null,null,null,null,null,null,null,null,null,null,null,null,null,null,null,null,null,null,null,null,null,null,null,null,null,null,null,null,null,null,null,null,null,null,null,null,null,null,null,null,null,null,null,11,{"$f":"IF(OR(ISERROR(FIND(\"-\",Q15)),AC15>'export html'!$AR$7),\"\",IF(RIGHT(Q15)<>\"*\",MID(Q15,FIND(\"-\",Q15)+1,LEN(Q15)-FIND(\"-\",Q15))-0,MID(Q15,FIND(\"-\",Q15)+1,LEN(Q15)-FIND(\"-\",Q15)-1)-0))","v":""},{"$f":"IF(OR(ISERROR(FIND(\"-\",R15)),AD15>'export html'!$AR$7),\"\",IF(RIGHT(R15)<>\"*\",MID(R15,FIND(\"-\",R15)+1,LEN(R15)-FIND(\"-\",R15))-0,MID(R15,FIND(\"-\",R15)+1,LEN(R15)-FIND(\"-\",R15)-1)-0))","v":""},{"$f":"IF(OR(ISERROR(FIND(\"-\",S15)),AE15>'export html'!$AR$7),\"\",IF(RIGHT(S15)<>\"*\",MID(S15,FIND(\"-\",S15)+1,LEN(S15)-FIND(\"-\",S15))-0,MID(S15,FIND(\"-\",S15)+1,LEN(S15)-FIND(\"-\",S15)-1)-0))","v":""},{"$f":"IF(OR(ISERROR(FIND(\"-\",T15)),AF15>'export html'!$AR$7),\"\",IF(RIGHT(T15)<>\"*\",MID(T15,FIND(\"-\",T15)+1,LEN(T15)-FIND(\"-\",T15))-0,MID(T15,FIND(\"-\",T15)+1,LEN(T15)-FIND(\"-\",T15)-1)-0))","v":""},{"$f":"IF(OR(ISERROR(FIND(\"-\",U15)),AG15>'export html'!$AR$7),\"\",IF(RIGHT(U15)<>\"*\",MID(U15,FIND(\"-\",U15)+1,LEN(U15)-FIND(\"-\",U15))-0,MID(U15,FIND(\"-\",U15)+1,LEN(U15)-FIND(\"-\",U15)-1)-0))","v":""},{"$f":"IF(OR(ISERROR(FIND(\"-\",V15)),AH15>'export html'!$AR$7),\"\",IF(RIGHT(V15)<>\"*\",MID(V15,FIND(\"-\",V15)+1,LEN(V15)-FIND(\"-\",V15))-0,MID(V15,FIND(\"-\",V15)+1,LEN(V15)-FIND(\"-\",V15)-1)-0))","v":3},{"$f":"IF(OR(ISERROR(FIND(\"-\",W15)),AI15>'export html'!$AR$7),\"\",IF(RIGHT(W15)<>\"*\",MID(W15,FIND(\"-\",W15)+1,LEN(W15)-FIND(\"-\",W15))-0,MID(W15,FIND(\"-\",W15)+1,LEN(W15)-FIND(\"-\",W15)-1)-0))","v":""},{"$f":"IF(OR(ISERROR(FIND(\"-\",X15)),AJ15>'export html'!$AR$7),\"\",IF(RIGHT(X15)<>\"*\",MID(X15,FIND(\"-\",X15)+1,LEN(X15)-FIND(\"-\",X15))-0,MID(X15,FIND(\"-\",X15)+1,LEN(X15)-FIND(\"-\",X15)-1)-0))","v":3},{"$f":"IF(OR(ISERROR(FIND(\"-\",Y15)),AK15>'export html'!$AR$7),\"\",IF(RIGHT(Y15)<>\"*\",MID(Y15,FIND(\"-\",Y15)+1,LEN(Y15)-FIND(\"-\",Y15))-0,MID(Y15,FIND(\"-\",Y15)+1,LEN(Y15)-FIND(\"-\",Y15)-1)-0))","v":""},{"$f":"IF(OR(ISERROR(FIND(\"-\",Z15)),AL15>'export html'!$AR$7),\"\",IF(RIGHT(Z15)<>\"*\",MID(Z15,FIND(\"-\",Z15)+1,LEN(Z15)-FIND(\"-\",Z15))-0,MID(Z15,FIND(\"-\",Z15)+1,LEN(Z15)-FIND(\"-\",Z15)-1)-0))","v":3},null,{"$f":"IF(OR(ISERROR(FIND(\"-\",AB15)),AN15>'export html'!$AR$7),\"\",IF(RIGHT(AB15)<>\"*\",MID(AB15,FIND(\"-\",AB15)+1,LEN(AB15)-FIND(\"-\",AB15))-0,MID(AB15,FIND(\"-\",AB15)+1,LEN(AB15)-FIND(\"-\",AB15)-1)-0))","v":1},11,{"$f":"IF(OR(ISERROR(FIND(\"-\",Q15)),AC15<='export html'!$AR$7),\"\",IF(RIGHT(Q15)<>\"*\",MID(Q15,FIND(\"-\",Q15)+1,LEN(Q15)-FIND(\"-\",Q15))-0,MID(Q15,FIND(\"-\",Q15)+1,LEN(Q15)-FIND(\"-\",Q15)-1)-0))","v":""},{"$f":"IF(OR(ISERROR(FIND(\"-\",R15)),AD15<='export html'!$AR$7),\"\",IF(RIGHT(R15)<>\"*\",MID(R15,FIND(\"-\",R15)+1,LEN(R15)-FIND(\"-\",R15))-0,MID(R15,FIND(\"-\",R15)+1,LEN(R15)-FIND(\"-\",R15)-1)-0))","v":""},{"$f":"IF(OR(ISERROR(FIND(\"-\",S15)),AE15<='export html'!$AR$7),\"\",IF(RIGHT(S15)<>\"*\",MID(S15,FIND(\"-\",S15)+1,LEN(S15)-FIND(\"-\",S15))-0,MID(S15,FIND(\"-\",S15)+1,LEN(S15)-FIND(\"-\",S15)-1)-0))","v":""},{"$f":"IF(OR(ISERROR(FIND(\"-\",T15)),AF15<='export html'!$AR$7),\"\",IF(RIGHT(T15)<>\"*\",MID(T15,FIND(\"-\",T15)+1,LEN(T15)-FIND(\"-\",T15))-0,MID(T15,FIND(\"-\",T15)+1,LEN(T15)-FIND(\"-\",T15)-1)-0))","v":1},{"$f":"IF(OR(ISERROR(FIND(\"-\",U15)),AG15<='export html'!$AR$7),\"\",IF(RIGHT(U15)<>\"*\",MID(U15,FIND(\"-\",U15)+1,LEN(U15)-FIND(\"-\",U15))-0,MID(U15,FIND(\"-\",U15)+1,LEN(U15)-FIND(\"-\",U15)-1)-0))","v":1},{"$f":"IF(OR(ISERROR(FIND(\"-\",V15)),AH15<='export html'!$AR$7),\"\",IF(RIGHT(V15)<>\"*\",MID(V15,FIND(\"-\",V15)+1,LEN(V15)-FIND(\"-\",V15))-0,MID(V15,FIND(\"-\",V15)+1,LEN(V15)-FIND(\"-\",V15)-1)-0))","v":""},{"$f":"IF(OR(ISERROR(FIND(\"-\",W15)),AI15<='export html'!$AR$7),\"\",IF(RIGHT(W15)<>\"*\",MID(W15,FIND(\"-\",W15)+1,LEN(W15)-FIND(\"-\",W15))-0,MID(W15,FIND(\"-\",W15)+1,LEN(W15)-FIND(\"-\",W15)-1)-0))","v":1},{"$f":"IF(OR(ISERROR(FIND(\"-\",X15)),AJ15<='export html'!$AR$7),\"\",IF(RIGHT(X15)<>\"*\",MID(X15,FIND(\"-\",X15)+1,LEN(X15)-FIND(\"-\",X15))-0,MID(X15,FIND(\"-\",X15)+1,LEN(X15)-FIND(\"-\",X15)-1)-0))","v":""},{"$f":"IF(OR(ISERROR(FIND(\"-\",Y15)),AK15<='export html'!$AR$7),\"\",IF(RIGHT(Y15)<>\"*\",MID(Y15,FIND(\"-\",Y15)+1,LEN(Y15)-FIND(\"-\",Y15))-0,MID(Y15,FIND(\"-\",Y15)+1,LEN(Y15)-FIND(\"-\",Y15)-1)-0))","v":""},{"$f":"IF(OR(ISERROR(FIND(\"-\",Z15)),AL15<='export html'!$AR$7),\"\",IF(RIGHT(Z15)<>\"*\",MID(Z15,FIND(\"-\",Z15)+1,LEN(Z15)-FIND(\"-\",Z15))-0,MID(Z15,FIND(\"-\",Z15)+1,LEN(Z15)-FIND(\"-\",Z15)-1)-0))","v":""},null,{"$f":"IF(OR(ISERROR(FIND(\"-\",AB15)),AN15<='export html'!$AR$7),\"\",IF(RIGHT(AB15)<>\"*\",MID(AB15,FIND(\"-\",AB15)+1,LEN(AB15)-FIND(\"-\",AB15))-0,MID(AB15,FIND(\"-\",AB15)+1,LEN(AB15)-FIND(\"-\",AB15)-1)-0))","v":""},11]
[null,null,null,{"$f":"'export html'!C2","v":"Matchen van speeldag 20"},null,20,null,null,null,null,null,null,null,null,null,null,null,null,null,null,null,null,null,null,null,null,null,null,null,null,null,null,null,null,null,null,null,null,null,null,null,null,null,null,null,null,null,null,null,null,null,null,null,null,null,null,null,null,null,null,null,null,null,null,null,null,null,12,{"$f":"IF(OR(ISERROR(FIND(\"-\",Q16)),AC16>'export html'!$AR$7),\"\",IF(RIGHT(Q16)<>\"*\",MID(Q16,FIND(\"-\",Q16)+1,LEN(Q16)-FIND(\"-\",Q16))-0,MID(Q16,FIND(\"-\",Q16)+1,LEN(Q16)-FIND(\"-\",Q16)-1)-0))","v":""},{"$f":"IF(OR(ISERROR(FIND(\"-\",R16)),AD16>'export html'!$AR$7),\"\",IF(RIGHT(R16)<>\"*\",MID(R16,FIND(\"-\",R16)+1,LEN(R16)-FIND(\"-\",R16))-0,MID(R16,FIND(\"-\",R16)+1,LEN(R16)-FIND(\"-\",R16)-1)-0))","v":1},{"$f":"IF(OR(ISERROR(FIND(\"-\",S16)),AE16>'export html'!$AR$7),\"\",IF(RIGHT(S16)<>\"*\",MID(S16,FIND(\"-\",S16)+1,LEN(S16)-FIND(\"-\",S16))-0,MID(S16,FIND(\"-\",S16)+1,LEN(S16)-FIND(\"-\",S16)-1)-0))","v":""},{"$f":"IF(OR(ISERROR(FIND(\"-\",T16)),AF16>'export html'!$AR$7),\"\",IF(RIGHT(T16)<>\"*\",MID(T16,FIND(\"-\",T16)+1,LEN(T16)-FIND(\"-\",T16))-0,MID(T16,FIND(\"-\",T16)+1,LEN(T16)-FIND(\"-\",T16)-1)-0))","v":""},{"$f":"IF(OR(ISERROR(FIND(\"-\",U16)),AG16>'export html'!$AR$7),\"\",IF(RIGHT(U16)<>\"*\",MID(U16,FIND(\"-\",U16)+1,LEN(U16)-FIND(\"-\",U16))-0,MID(U16,FIND(\"-\",U16)+1,LEN(U16)-FIND(\"-\",U16)-1)-0))","v":""},{"$f":"IF(OR(ISERROR(FIND(\"-\",V16)),AH16>'export html'!$AR$7),\"\",IF(RIGHT(V16)<>\"*\",MID(V16,FIND(\"-\",V16)+1,LEN(V16)-FIND(\"-\",V16))-0,MID(V16,FIND(\"-\",V16)+1,LEN(V16)-FIND(\"-\",V16)-1)-0))","v":2},{"$f":"IF(OR(ISERROR(FIND(\"-\",W16)),AI16>'export html'!$AR$7),\"\",IF(RIGHT(W16)<>\"*\",MID(W16,FIND(\"-\",W16)+1,LEN(W16)-FIND(\"-\",W16))-0,MID(W16,FIND(\"-\",W16)+1,LEN(W16)-FIND(\"-\",W16)-1)-0))","v":1},{"$f":"IF(OR(ISERROR(FIND(\"-\",X16)),AJ16>'export html'!$AR$7),\"\",IF(RIGHT(X16)<>\"*\",MID(X16,FIND(\"-\",X16)+1,LEN(X16)-FIND(\"-\",X16))-0,MID(X16,FIND(\"-\",X16)+1,LEN(X16)-FIND(\"-\",X16)-1)-0))","v":1},{"$f":"IF(OR(ISERROR(FIND(\"-\",Y16)),AK16>'export html'!$AR$7),\"\",IF(RIGHT(Y16)<>\"*\",MID(Y16,FIND(\"-\",Y16)+1,LEN(Y16)-FIND(\"-\",Y16))-0,MID(Y16,FIND(\"-\",Y16)+1,LEN(Y16)-FIND(\"-\",Y16)-1)-0))","v":""},{"$f":"IF(OR(ISERROR(FIND(\"-\",Z16)),AL16>'export html'!$AR$7),\"\",IF(RIGHT(Z16)<>\"*\",MID(Z16,FIND(\"-\",Z16)+1,LEN(Z16)-FIND(\"-\",Z16))-0,MID(Z16,FIND(\"-\",Z16)+1,LEN(Z16)-FIND(\"-\",Z16)-1)-0))","v":1},{"$f":"IF(OR(ISERROR(FIND(\"-\",AA16)),AM16>'export html'!$AR$7),\"\",IF(RIGHT(AA16)<>\"*\",MID(AA16,FIND(\"-\",AA16)+1,LEN(AA16)-FIND(\"-\",AA16))-0,MID(AA16,FIND(\"-\",AA16)+1,LEN(AA16)-FIND(\"-\",AA16)-1)-0))","v":""},null,12,{"$f":"IF(OR(ISERROR(FIND(\"-\",Q16)),AC16<='export html'!$AR$7),\"\",IF(RIGHT(Q16)<>\"*\",MID(Q16,FIND(\"-\",Q16)+1,LEN(Q16)-FIND(\"-\",Q16))-0,MID(Q16,FIND(\"-\",Q16)+1,LEN(Q16)-FIND(\"-\",Q16)-1)-0))","v":0},{"$f":"IF(OR(ISERROR(FIND(\"-\",R16)),AD16<='export html'!$AR$7),\"\",IF(RIGHT(R16)<>\"*\",MID(R16,FIND(\"-\",R16)+1,LEN(R16)-FIND(\"-\",R16))-0,MID(R16,FIND(\"-\",R16)+1,LEN(R16)-FIND(\"-\",R16)-1)-0))","v":""},{"$f":"IF(OR(ISERROR(FIND(\"-\",S16)),AE16<='export html'!$AR$7),\"\",IF(RIGHT(S16)<>\"*\",MID(S16,FIND(\"-\",S16)+1,LEN(S16)-FIND(\"-\",S16))-0,MID(S16,FIND(\"-\",S16)+1,LEN(S16)-FIND(\"-\",S16)-1)-0))","v":""},{"$f":"IF(OR(ISERROR(FIND(\"-\",T16)),AF16<='export html'!$AR$7),\"\",IF(RIGHT(T16)<>\"*\",MID(T16,FIND(\"-\",T16)+1,LEN(T16)-FIND(\"-\",T16))-0,MID(T16,FIND(\"-\",T16)+1,LEN(T16)-FIND(\"-\",T16)-1)-0))","v":""},{"$f":"IF(OR(ISERROR(FIND(\"-\",U16)),AG16<='export html'!$AR$7),\"\",IF(RIGHT(U16)<>\"*\",MID(U16,FIND(\"-\",U16)+1,LEN(U16)-FIND(\"-\",U16))-0,MID(U16,FIND(\"-\",U16)+1,LEN(U16)-FIND(\"-\",U16)-1)-0))","v":3},{"$f":"IF(OR(ISERROR(FIND(\"-\",V16)),AH16<='export html'!$AR$7),\"\",IF(RIGHT(V16)<>\"*\",MID(V16,FIND(\"-\",V16)+1,LEN(V16)-FIND(\"-\",V16))-0,MID(V16,FIND(\"-\",V16)+1,LEN(V16)-FIND(\"-\",V16)-1)-0))","v":""},{"$f":"IF(OR(ISERROR(FIND(\"-\",W16)),AI16<='export html'!$AR$7),\"\",IF(RIGHT(W16)<>\"*\",MID(W16,FIND(\"-\",W16)+1,LEN(W16)-FIND(\"-\",W16))-0,MID(W16,FIND(\"-\",W16)+1,LEN(W16)-FIND(\"-\",W16)-1)-0))","v":""},{"$f":"IF(OR(ISERROR(FIND(\"-\",X16)),AJ16<='export html'!$AR$7),\"\",IF(RIGHT(X16)<>\"*\",MID(X16,FIND(\"-\",X16)+1,LEN(X16)-FIND(\"-\",X16))-0,MID(X16,FIND(\"-\",X16)+1,LEN(X16)-FIND(\"-\",X16)-1)-0))","v":""},{"$f":"IF(OR(ISERROR(FIND(\"-\",Y16)),AK16<='export html'!$AR$7),\"\",IF(RIGHT(Y16)<>\"*\",MID(Y16,FIND(\"-\",Y16)+1,LEN(Y16)-FIND(\"-\",Y16))-0,MID(Y16,FIND(\"-\",Y16)+1,LEN(Y16)-FIND(\"-\",Y16)-1)-0))","v":1},{"$f":"IF(OR(ISERROR(FIND(\"-\",Z16)),AL16<='export html'!$AR$7),\"\",IF(RIGHT(Z16)<>\"*\",MID(Z16,FIND(\"-\",Z16)+1,LEN(Z16)-FIND(\"-\",Z16))-0,MID(Z16,FIND(\"-\",Z16)+1,LEN(Z16)-FIND(\"-\",Z16)-1)-0))","v":""},{"$f":"IF(OR(ISERROR(FIND(\"-\",AA16)),AM16<='export html'!$AR$7),\"\",IF(RIGHT(AA16)<>\"*\",MID(AA16,FIND(\"-\",AA16)+1,LEN(AA16)-FIND(\"-\",AA16))-0,MID(AA16,FIND(\"-\",AA16)+1,LEN(AA16)-FIND(\"-\",AA16)-1)-0))","v":""},null,12]
[null,null,null,null,null,null,null,null,null,null,null,null,null,null,null,null,null,null,null,null,null,null,null,null,null,null,null,null,null,null,null,null,null,null,null,null,null,null,null,null,null,null,null,null,null,null,null,null,null,null,null,null,null,null,null,null,null,null,null,null,null,null,null,null,null,null,null,null,1,2,3,4,5,6,7,8,9,10,11,12,null,1,2,3,4,5,6,7,8,9,10,11,12]
[null,null,null,{"$f":"IF('export html'!A3=\"\",\"\",'export html'!A3)","v":"2024-02-25"},{"$f":"IF('export html'!B3=\"\",\"\",'export html'!B3)","v":20},{"$f":"IF('export html'!C3=\"\",\"\",'export html'!C3)","v":"Hombeek - Goka"},null,null,null,null,null,null,null,{"$f":"IF('export html'!D3=\"\",\"\",'export html'!D3)","v":"4-1"},null,null,null,null,null,null,null,null,null,null,null,null,null,null,null,null,null,null,null,null,null,null,null,null,null,null,null,null,null,null,null,null,null,null,null,null,null,null,null,null,null,null,null,null,null,null,null,null,null,null,null,null,null,1,null,{"$f":"IF(OR(ISERROR(FIND(\"-\",R5)),AD5>'export html'!$AR$7),\"\",IF(AND(LEFT(R5)=\"*\",RIGHT(R5)=\"*\"),\"ff\",IF(BR5>BR18,\"t\",IF(BR5<BR18,\"u\",\"g\"))))","v":"t"},{"$f":"IF(OR(ISERROR(FIND(\"-\",S5)),AE5>'export html'!$AR$7),\"\",IF(AND(LEFT(S5)=\"*\",RIGHT(S5)=\"*\"),\"ff\",IF(BS5>BS18,\"t\",IF(BS5<BS18,\"u\",\"g\"))))","v":""},{"$f":"IF(OR(ISERROR(FIND(\"-\",T5)),AF5>'export html'!$AR$7),\"\",IF(AND(LEFT(T5)=\"*\",RIGHT(T5)=\"*\"),\"ff\",IF(BT5>BT18,\"t\",IF(BT5<BT18,\"u\",\"g\"))))","v":""},{"$f":"IF(OR(ISERROR(FIND(\"-\",U5)),AG5>'export html'!$AR$7),\"\",IF(AND(LEFT(U5)=\"*\",RIGHT(U5)=\"*\"),\"ff\",IF(BU5>BU18,\"t\",IF(BU5<BU18,\"u\",\"g\"))))","v":""},{"$f":"IF(OR(ISERROR(FIND(\"-\",V5)),AH5>'export html'!$AR$7),\"\",IF(AND(LEFT(V5)=\"*\",RIGHT(V5)=\"*\"),\"ff\",IF(BV5>BV18,\"t\",IF(BV5<BV18,\"u\",\"g\"))))","v":""},{"$f":"IF(OR(ISERROR(FIND(\"-\",W5)),AI5>'export html'!$AR$7),\"\",IF(AND(LEFT(W5)=\"*\",RIGHT(W5)=\"*\"),\"ff\",IF(BW5>BW18,\"t\",IF(BW5<BW18,\"u\",\"g\"))))","v":""},{"$f":"IF(OR(ISERROR(FIND(\"-\",X5)),AJ5>'export html'!$AR$7),\"\",IF(AND(LEFT(X5)=\"*\",RIGHT(X5)=\"*\"),\"ff\",IF(BX5>BX18,\"t\",IF(BX5<BX18,\"u\",\"g\"))))","v":""},{"$f":"IF(OR(ISERROR(FIND(\"-\",Y5)),AK5>'export html'!$AR$7),\"\",IF(AND(LEFT(Y5)=\"*\",RIGHT(Y5)=\"*\"),\"ff\",IF(BY5>BY18,\"t\",IF(BY5<BY18,\"u\",\"g\"))))","v":"t"},{"$f":"IF(OR(ISERROR(FIND(\"-\",Z5)),AL5>'export html'!$AR$7),\"\",IF(AND(LEFT(Z5)=\"*\",RIGHT(Z5)=\"*\"),\"ff\",IF(BZ5>BZ18,\"t\",IF(BZ5<BZ18,\"u\",\"g\"))))","v":"u"},{"$f":"IF(OR(ISERROR(FIND(\"-\",AA5)),AM5>'export html'!$AR$7),\"\",IF(AND(LEFT(AA5)=\"*\",RIGHT(AA5)=\"*\"),\"ff\",IF(CA5>CA18,\"t\",IF(CA5<CA18,\"u\",\"g\"))))","v":"u"},{"$f":"IF(OR(ISERROR(FIND(\"-\",AB5)),AN5>'export html'!$AR$7),\"\",IF(AND(LEFT(AB5)=\"*\",RIGHT(AB5)=\"*\"),\"ff\",IF(CB5>CB18,\"t\",IF(CB5<CB18,\"u\",\"g\"))))","v":"t"},1,null,{"$f":"IF(OR(ISERROR(FIND(\"-\",R5)),AD5<='export html'!$AR$7),\"\",IF(AND(LEFT(R5)=\"*\",RIGHT(R5)=\"*\"),\"ff\",IF(CE5>CE18,\"t\",IF(CE5<CE18,\"u\",\"g\"))))","v":""},{"$f":"IF(OR(ISERROR(FIND(\"-\",S5)),AE5<='export html'!$AR$7),\"\",IF(AND(LEFT(S5)=\"*\",RIGHT(S5)=\"*\"),\"ff\",IF(CF5>CF18,\"t\",IF(CF5<CF18,\"u\",\"g\"))))","v":"u"},{"$f":"IF(OR(ISERROR(FIND(\"-\",T5)),AF5<='export html'!$AR$7),\"\",IF(AND(LEFT(T5)=\"*\",RIGHT(T5)=\"*\"),\"ff\",IF(CG5>CG18,\"t\",IF(CG5<CG18,\"u\",\"g\"))))","v":"t"},{"$f":"IF(OR(ISERROR(FIND(\"-\",U5)),AG5<='export html'!$AR$7),\"\",IF(AND(LEFT(U5)=\"*\",RIGHT(U5)=\"*\"),\"ff\",IF(CH5>CH18,\"t\",IF(CH5<CH18,\"u\",\"g\"))))","v":""},{"$f":"IF(OR(ISERROR(FIND(\"-\",V5)),AH5<='export html'!$AR$7),\"\",IF(AND(LEFT(V5)=\"*\",RIGHT(V5)=\"*\"),\"ff\",IF(CI5>CI18,\"t\",IF(CI5<CI18,\"u\",\"g\"))))","v":""},{"$f":"IF(OR(ISERROR(FIND(\"-\",W5)),AI5<='export html'!$AR$7),\"\",IF(AND(LEFT(W5)=\"*\",RIGHT(W5)=\"*\"),\"ff\",IF(CJ5>CJ18,\"t\",IF(CJ5<CJ18,\"u\",\"g\"))))","v":""},{"$f":"IF(OR(ISERROR(FIND(\"-\",X5)),AJ5<='export html'!$AR$7),\"\",IF(AND(LEFT(X5)=\"*\",RIGHT(X5)=\"*\"),\"ff\",IF(CK5>CK18,\"t\",IF(CK5<CK18,\"u\",\"g\"))))","v":"g"},{"$f":"IF(OR(ISERROR(FIND(\"-\",Y5)),AK5<='export html'!$AR$7),\"\",IF(AND(LEFT(Y5)=\"*\",RIGHT(Y5)=\"*\"),\"ff\",IF(CL5>CL18,\"t\",IF(CL5<CL18,\"u\",\"g\"))))","v":""},{"$f":"IF(OR(ISERROR(FIND(\"-\",Z5)),AL5<='export html'!$AR$7),\"\",IF(AND(LEFT(Z5)=\"*\",RIGHT(Z5)=\"*\"),\"ff\",IF(CM5>CM18,\"t\",IF(CM5<CM18,\"u\",\"g\"))))","v":""},{"$f":"IF(OR(ISERROR(FIND(\"-\",AA5)),AM5<='export html'!$AR$7),\"\",IF(AND(LEFT(AA5)=\"*\",RIGHT(AA5)=\"*\"),\"ff\",IF(CN5>CN18,\"t\",IF(CN5<CN18,\"u\",\"g\"))))","v":""},{"$f":"IF(OR(ISERROR(FIND(\"-\",AB5)),AN5<='export html'!$AR$7),\"\",IF(AND(LEFT(AB5)=\"*\",RIGHT(AB5)=\"*\"),\"ff\",IF(CO5>CO18,\"t\",IF(CO5<CO18,\"u\",\"g\"))))","v":""},1]
[null,null,null,{"$f":"IF('export html'!A4=\"\",\"\",'export html'!A4)","v":"2024-02-25"},{"$f":"IF('export html'!B4=\"\",\"\",'export html'!B4)","v":20},{"$f":"IF('export html'!C4=\"\",\"\",'export html'!C4)","v":"Lucyvo - Boerenbond"},null,null,null,null,null,null,null,{"$f":"IF('export html'!D4=\"\",\"\",'export html'!D4)","v":"2-7"},null,null,null,null,null,null,null,null,null,null,null,null,null,null,null,null,null,null,null,null,null,null,null,null,null,null,null,null,null,null,null,null,null,null,null,null,null,null,null,null,null,null,null,null,null,null,null,null,null,null,null,null,null,2,{"$f":"IF(OR(ISERROR(FIND(\"-\",Q6)),AC6>'export html'!$AR$7),\"\",IF(AND(LEFT(Q6)=\"*\",RIGHT(Q6)=\"*\"),\"ff\",IF(BQ6>BQ19,\"t\",IF(BQ6<BQ19,\"u\",\"g\"))))","v":""},null,{"$f":"IF(OR(ISERROR(FIND(\"-\",S6)),AE6>'export html'!$AR$7),\"\",IF(AND(LEFT(S6)=\"*\",RIGHT(S6)=\"*\"),\"ff\",IF(BS6>BS19,\"t\",IF(BS6<BS19,\"u\",\"g\"))))","v":""},{"$f":"IF(OR(ISERROR(FIND(\"-\",T6)),AF6>'export html'!$AR$7),\"\",IF(AND(LEFT(T6)=\"*\",RIGHT(T6)=\"*\"),\"ff\",IF(BT6>BT19,\"t\",IF(BT6<BT19,\"u\",\"g\"))))","v":"t"},{"$f":"IF(OR(ISERROR(FIND(\"-\",U6)),AG6>'export html'!$AR$7),\"\",IF(AND(LEFT(U6)=\"*\",RIGHT(U6)=\"*\"),\"ff\",IF(BU6>BU19,\"t\",IF(BU6<BU19,\"u\",\"g\"))))","v":"t"},{"$f":"IF(OR(ISERROR(FIND(\"-\",V6)),AH6>'export html'!$AR$7),\"\",IF(AND(LEFT(V6)=\"*\",RIGHT(V6)=\"*\"),\"ff\",IF(BV6>BV19,\"t\",IF(BV6<BV19,\"u\",\"g\"))))","v":""},{"$f":"IF(OR(ISERROR(FIND(\"-\",W6)),AI6>'export html'!$AR$7),\"\",IF(AND(LEFT(W6)=\"*\",RIGHT(W6)=\"*\"),\"ff\",IF(BW6>BW19,\"t\",IF(BW6<BW19,\"u\",\"g\"))))","v":""},{"$f":"IF(OR(ISERROR(FIND(\"-\",X6)),AJ6>'export html'!$AR$7),\"\",IF(AND(LEFT(X6)=\"*\",RIGHT(X6)=\"*\"),\"ff\",IF(BX6>BX19,\"t\",IF(BX6<BX19,\"u\",\"g\"))))","v":""},{"$f":"IF(OR(ISERROR(FIND(\"-\",Y6)),AK6>'export html'!$AR$7),\"\",IF(AND(LEFT(Y6)=\"*\",RIGHT(Y6)=\"*\"),\"ff\",IF(BY6>BY19,\"t\",IF(BY6<BY19,\"u\",\"g\"))))","v":"t"},{"$f":"IF(OR(ISERROR(FIND(\"-\",Z6)),AL6>'export html'!$AR$7),\"\",IF(AND(LEFT(Z6)=\"*\",RIGHT(Z6)=\"*\"),\"ff\",IF(BZ6>BZ19,\"t\",IF(BZ6<BZ19,\"u\",\"g\"))))","v":""},{"$f":"IF(OR(ISERROR(FIND(\"-\",AA6)),AM6>'export html'!$AR$7),\"\",IF(AND(LEFT(AA6)=\"*\",RIGHT(AA6)=\"*\"),\"ff\",IF(CA6>CA19,\"t\",IF(CA6<CA19,\"u\",\"g\"))))","v":"u"},{"$f":"IF(OR(ISERROR(FIND(\"-\",AB6)),AN6>'export html'!$AR$7),\"\",IF(AND(LEFT(AB6)=\"*\",RIGHT(AB6)=\"*\"),\"ff\",IF(CB6>CB19,\"t\",IF(CB6<CB19,\"u\",\"g\"))))","v":""},2,{"$f":"IF(OR(ISERROR(FIND(\"-\",Q6)),AC6<='export html'!$AR$7),\"\",IF(AND(LEFT(Q6)=\"*\",RIGHT(Q6)=\"*\"),\"ff\",IF(CD6>CD19,\"t\",IF(CD6<CD19,\"u\",\"g\"))))","v":""},null,{"$f":"IF(OR(ISERROR(FIND(\"-\",S6)),AE6<='export html'!$AR$7),\"\",IF(AND(LEFT(S6)=\"*\",RIGHT(S6)=\"*\"),\"ff\",IF(CF6>CF19,\"t\",IF(CF6<CF19,\"u\",\"g\"))))","v":""},{"$f":"IF(OR(ISERROR(FIND(\"-\",T6)),AF6<='export html'!$AR$7),\"\",IF(AND(LEFT(T6)=\"*\",RIGHT(T6)=\"*\"),\"ff\",IF(CG6>CG19,\"t\",IF(CG6<CG19,\"u\",\"g\"))))","v":""},{"$f":"IF(OR(ISERROR(FIND(\"-\",U6)),AG6<='export html'!$AR$7),\"\",IF(AND(LEFT(U6)=\"*\",RIGHT(U6)=\"*\"),\"ff\",IF(CH6>CH19,\"t\",IF(CH6<CH19,\"u\",\"g\"))))","v":""},{"$f":"IF(OR(ISERROR(FIND(\"-\",V6)),AH6<='export html'!$AR$7),\"\",IF(AND(LEFT(V6)=\"*\",RIGHT(V6)=\"*\"),\"ff\",IF(CI6>CI19,\"t\",IF(CI6<CI19,\"u\",\"g\"))))","v":"t"},{"$f":"IF(OR(ISERROR(FIND(\"-\",W6)),AI6<='export html'!$AR$7),\"\",IF(AND(LEFT(W6)=\"*\",RIGHT(W6)=\"*\"),\"ff\",IF(CJ6>CJ19,\"t\",IF(CJ6<CJ19,\"u\",\"g\"))))","v":""},{"$f":"IF(OR(ISERROR(FIND(\"-\",X6)),AJ6<='export html'!$AR$7),\"\",IF(AND(LEFT(X6)=\"*\",RIGHT(X6)=\"*\"),\"ff\",IF(CK6>CK19,\"t\",IF(CK6<CK19,\"u\",\"g\"))))","v":"t"},{"$f":"IF(OR(ISERROR(FIND(\"-\",Y6)),AK6<='export html'!$AR$7),\"\",IF(AND(LEFT(Y6)=\"*\",RIGHT(Y6)=\"*\"),\"ff\",IF(CL6>CL19,\"t\",IF(CL6<CL19,\"u\",\"g\"))))","v":""},{"$f":"IF(OR(ISERROR(FIND(\"-\",Z6)),AL6<='export html'!$AR$7),\"\",IF(AND(LEFT(Z6)=\"*\",RIGHT(Z6)=\"*\"),\"ff\",IF(CM6>CM19,\"t\",IF(CM6<CM19,\"u\",\"g\"))))","v":"t"},{"$f":"IF(OR(ISERROR(FIND(\"-\",AA6)),AM6<='export html'!$AR$7),\"\",IF(AND(LEFT(AA6)=\"*\",RIGHT(AA6)=\"*\"),\"ff\",IF(CN6>CN19,\"t\",IF(CN6<CN19,\"u\",\"g\"))))","v":""},{"$f":"IF(OR(ISERROR(FIND(\"-\",AB6)),AN6<='export html'!$AR$7),\"\",IF(AND(LEFT(AB6)=\"*\",RIGHT(AB6)=\"*\"),\"ff\",IF(CO6>CO19,\"t\",IF(CO6<CO19,\"u\",\"g\"))))","v":""},2]
[null,null,null,{"$f":"IF('export html'!A5=\"\",\"\",'export html'!A5)","v":"2024-02-25"},{"$f":"IF('export html'!B5=\"\",\"\",'export html'!B5)","v":20},{"$f":"IF('export html'!C5=\"\",\"\",'export html'!C5)","v":"Paradeske - Bariton"},null,null,null,null,null,null,null,{"$f":"IF('export html'!D5=\"\",\"\",'export html'!D5)","v":""},null,null,null,null,null,null,null,null,null,null,null,null,null,null,null,null,null,null,null,null,null,null,null,null,null,null,null,null,null,null,null,null,null,null,null,null,null,null,null,null,null,null,null,null,null,null,null,null,null,null,null,null,null,3,{"$f":"IF(OR(ISERROR(FIND(\"-\",Q7)),AC7>'export html'!$AR$7),\"\",IF(AND(LEFT(Q7)=\"*\",RIGHT(Q7)=\"*\"),\"ff\",IF(BQ7>BQ20,\"t\",IF(BQ7<BQ20,\"u\",\"g\"))))","v":"t"},{"$f":"IF(OR(ISERROR(FIND(\"-\",R7)),AD7>'export html'!$AR$7),\"\",IF(AND(LEFT(R7)=\"*\",RIGHT(R7)=\"*\"),\"ff\",IF(BR7>BR20,\"t\",IF(BR7<BR20,\"u\",\"g\"))))","v":""},null,{"$f":"IF(OR(ISERROR(FIND(\"-\",T7)),AF7>'export html'!$AR$7),\"\",IF(AND(LEFT(T7)=\"*\",RIGHT(T7)=\"*\"),\"ff\",IF(BT7>BT20,\"t\",IF(BT7<BT20,\"u\",\"g\"))))","v":""},{"$f":"IF(OR(ISERROR(FIND(\"-\",U7)),AG7>'export html'!$AR$7),\"\",IF(AND(LEFT(U7)=\"*\",RIGHT(U7)=\"*\"),\"ff\",IF(BU7>BU20,\"t\",IF(BU7<BU20,\"u\",\"g\"))))","v":""},{"$f":"IF(OR(ISERROR(FIND(\"-\",V7)),AH7>'export html'!$AR$7),\"\",IF(AND(LEFT(V7)=\"*\",RIGHT(V7)=\"*\"),\"ff\",IF(BV7>BV20,\"t\",IF(BV7<BV20,\"u\",\"g\"))))","v":"g"},{"$f":"IF(OR(ISERROR(FIND(\"-\",W7)),AI7>'export html'!$AR$7),\"\",IF(AND(LEFT(W7)=\"*\",RIGHT(W7)=\"*\"),\"ff\",IF(BW7>BW20,\"t\",IF(BW7<BW20,\"u\",\"g\"))))","v":""},{"$f":"IF(OR(ISERROR(FIND(\"-\",X7)),AJ7>'export html'!$AR$7),\"\",IF(AND(LEFT(X7)=\"*\",RIGHT(X7)=\"*\"),\"ff\",IF(BX7>BX20,\"t\",IF(BX7<BX20,\"u\",\"g\"))))","v":"t"},{"$f":"IF(OR(ISERROR(FIND(\"-\",Y7)),AK7>'export html'!$AR$7),\"\",IF(AND(LEFT(Y7)=\"*\",RIGHT(Y7)=\"*\"),\"ff\",IF(BY7>BY20,\"t\",IF(BY7<BY20,\"u\",\"g\"))))","v":""},{"$f":"IF(OR(ISERROR(FIND(\"-\",Z7)),AL7>'export html'!$AR$7),\"\",IF(AND(LEFT(Z7)=\"*\",RIGHT(Z7)=\"*\"),\"ff\",IF(BZ7>BZ20,\"t\",IF(BZ7<BZ20,\"u\",\"g\"))))","v":"u"},{"$f":"IF(OR(ISERROR(FIND(\"-\",AA7)),AM7>'export html'!$AR$7),\"\",IF(AND(LEFT(AA7)=\"*\",RIGHT(AA7)=\"*\"),\"ff\",IF(CA7>CA20,\"t\",IF(CA7<CA20,\"u\",\"g\"))))","v":""},{"$f":"IF(OR(ISERROR(FIND(\"-\",AB7)),AN7>'export html'!$AR$7),\"\",IF(AND(LEFT(AB7)=\"*\",RIGHT(AB7)=\"*\"),\"ff\",IF(CB7>CB20,\"t\",IF(CB7<CB20,\"u\",\"g\"))))","v":"t"},3,{"$f":"IF(OR(ISERROR(FIND(\"-\",Q7)),AC7<='export html'!$AR$7),\"\",IF(AND(LEFT(Q7)=\"*\",RIGHT(Q7)=\"*\"),\"ff\",IF(CD7>CD20,\"t\",IF(CD7<CD20,\"u\",\"g\"))))","v":""},{"$f":"IF(OR(ISERROR(FIND(\"-\",R7)),AD7<='export html'!$AR$7),\"\",IF(AND(LEFT(R7)=\"*\",RIGHT(R7)=\"*\"),\"ff\",IF(CE7>CE20,\"t\",IF(CE7<CE20,\"u\",\"g\"))))","v":"t"},null,{"$f":"IF(OR(ISERROR(FIND(\"-\",T7)),AF7<='export html'!$AR$7),\"\",IF(AND(LEFT(T7)=\"*\",RIGHT(T7)=\"*\"),\"ff\",IF(CG7>CG20,\"t\",IF(CG7<CG20,\"u\",\"g\"))))","v":"t"},{"$f":"IF(OR(ISERROR(FIND(\"-\",U7)),AG7<='export html'!$AR$7),\"\",IF(AND(LEFT(U7)=\"*\",RIGHT(U7)=\"*\"),\"ff\",IF(CH7>CH20,\"t\",IF(CH7<CH20,\"u\",\"g\"))))","v":"u"},{"$f":"IF(OR(ISERROR(FIND(\"-\",V7)),AH7<='export html'!$AR$7),\"\",IF(AND(LEFT(V7)=\"*\",RIGHT(V7)=\"*\"),\"ff\",IF(CI7>CI20,\"t\",IF(CI7<CI20,\"u\",\"g\"))))","v":""},{"$f":"IF(OR(ISERROR(FIND(\"-\",W7)),AI7<='export html'!$AR$7),\"\",IF(AND(LEFT(W7)=\"*\",RIGHT(W7)=\"*\"),\"ff\",IF(CJ7>CJ20,\"t\",IF(CJ7<CJ20,\"u\",\"g\"))))","v":"t"},{"$f":"IF(OR(ISERROR(FIND(\"-\",X7)),AJ7<='export html'!$AR$7),\"\",IF(AND(LEFT(X7)=\"*\",RIGHT(X7)=\"*\"),\"ff\",IF(CK7>CK20,\"t\",IF(CK7<CK20,\"u\",\"g\"))))","v":""},{"$f":"IF(OR(ISERROR(FIND(\"-\",Y7)),AK7<='export html'!$AR$7),\"\",IF(AND(LEFT(Y7)=\"*\",RIGHT(Y7)=\"*\"),\"ff\",IF(CL7>CL20,\"t\",IF(CL7<CL20,\"u\",\"g\"))))","v":""},{"$f":"IF(OR(ISERROR(FIND(\"-\",Z7)),AL7<='export html'!$AR$7),\"\",IF(AND(LEFT(Z7)=\"*\",RIGHT(Z7)=\"*\"),\"ff\",IF(CM7>CM20,\"t\",IF(CM7<CM20,\"u\",\"g\"))))","v":""},{"$f":"IF(OR(ISERROR(FIND(\"-\",AA7)),AM7<='export html'!$AR$7),\"\",IF(AND(LEFT(AA7)=\"*\",RIGHT(AA7)=\"*\"),\"ff\",IF(CN7>CN20,\"t\",IF(CN7<CN20,\"u\",\"g\"))))","v":"t"},{"$f":"IF(OR(ISERROR(FIND(\"-\",AB7)),AN7<='export html'!$AR$7),\"\",IF(AND(LEFT(AB7)=\"*\",RIGHT(AB7)=\"*\"),\"ff\",IF(CO7>CO20,\"t\",IF(CO7<CO20,\"u\",\"g\"))))","v":""},3]
[null,null,null,{"$f":"IF('export html'!A6=\"\",\"\",'export html'!A6)","v":"2024-02-25"},{"$f":"IF('export html'!B6=\"\",\"\",'export html'!B6)","v":20},{"$f":"IF('export html'!C6=\"\",\"\",'export html'!C6)","v":"Pouma United - Racing Emblem"},null,null,null,null,null,null,null,{"$f":"IF('export html'!D6=\"\",\"\",'export html'!D6)","v":"2-2"},null,null,null,null,null,null,null,null,null,null,null,null,null,null,null,null,null,null,null,null,null,null,null,null,null,null,null,null,null,null,null,null,null,null,null,null,null,null,null,null,null,null,null,null,null,null,null,null,null,null,null,null,null,4,{"$f":"IF(OR(ISERROR(FIND(\"-\",Q8)),AC8>'export html'!$AR$7),\"\",IF(AND(LEFT(Q8)=\"*\",RIGHT(Q8)=\"*\"),\"ff\",IF(BQ8>BQ21,\"t\",IF(BQ8<BQ21,\"u\",\"g\"))))","v":"u"},{"$f":"IF(OR(ISERROR(FIND(\"-\",R8)),AD8>'export html'!$AR$7),\"\",IF(AND(LEFT(R8)=\"*\",RIGHT(R8)=\"*\"),\"ff\",IF(BR8>BR21,\"t\",IF(BR8<BR21,\"u\",\"g\"))))","v":""},{"$f":"IF(OR(ISERROR(FIND(\"-\",S8)),AE8>'export html'!$AR$7),\"\",IF(AND(LEFT(S8)=\"*\",RIGHT(S8)=\"*\"),\"ff\",IF(BS8>BS21,\"t\",IF(BS8<BS21,\"u\",\"g\"))))","v":"g"},null,{"$f":"IF(OR(ISERROR(FIND(\"-\",U8)),AG8>'export html'!$AR$7),\"\",IF(AND(LEFT(U8)=\"*\",RIGHT(U8)=\"*\"),\"ff\",IF(BU8>BU21,\"t\",IF(BU8<BU21,\"u\",\"g\"))))","v":""},{"$f":"IF(OR(ISERROR(FIND(\"-\",V8)),AH8>'export html'!$AR$7),\"\",IF(AND(LEFT(V8)=\"*\",RIGHT(V8)=\"*\"),\"ff\",IF(BV8>BV21,\"t\",IF(BV8<BV21,\"u\",\"g\"))))","v":"t"},{"$f":"IF(OR(ISERROR(FIND(\"-\",W8)),AI8>'export html'!$AR$7),\"\",IF(AND(LEFT(W8)=\"*\",RIGHT(W8)=\"*\"),\"ff\",IF(BW8>BW21,\"t\",IF(BW8<BW21,\"u\",\"g\"))))","v":""},{"$f":"IF(OR(ISERROR(FIND(\"-\",X8)),AJ8>'export html'!$AR$7),\"\",IF(AND(LEFT(X8)=\"*\",RIGHT(X8)=\"*\"),\"ff\",IF(BX8>BX21,\"t\",IF(BX8<BX21,\"u\",\"g\"))))","v":"t"},{"$f":"IF(OR(ISERROR(FIND(\"-\",Y8)),AK8>'export html'!$AR$7),\"\",IF(AND(LEFT(Y8)=\"*\",RIGHT(Y8)=\"*\"),\"ff\",IF(BY8>BY21,\"t\",IF(BY8<BY21,\"u\",\"g\"))))","v":""},{"$f":"IF(OR(ISERROR(FIND(\"-\",Z8)),AL8>'export html'!$AR$7),\"\",IF(AND(LEFT(Z8)=\"*\",RIGHT(Z8)=\"*\"),\"ff\",IF(BZ8>BZ21,\"t\",IF(BZ8<BZ21,\"u\",\"g\"))))","v":"u"},{"$f":"IF(OR(ISERROR(FIND(\"-\",AA8)),AM8>'export html'!$AR$7),\"\",IF(AND(LEFT(AA8)=\"*\",RIGHT(AA8)=\"*\"),\"ff\",IF(CA8>CA21,\"t\",IF(CA8<CA21,\"u\",\"g\"))))","v":"t"},{"$f":"IF(OR(ISERROR(FIND(\"-\",AB8)),AN8>'export html'!$AR$7),\"\",IF(AND(LEFT(AB8)=\"*\",RIGHT(AB8)=\"*\"),\"ff\",IF(CB8>CB21,\"t\",IF(CB8<CB21,\"u\",\"g\"))))","v":""},4,{"$f":"IF(OR(ISERROR(FIND(\"-\",Q8)),AC8<='export html'!$AR$7),\"\",IF(AND(LEFT(Q8)=\"*\",RIGHT(Q8)=\"*\"),\"ff\",IF(CD8>CD21,\"t\",IF(CD8<CD21,\"u\",\"g\"))))","v":""},{"$f":"IF(OR(ISERROR(FIND(\"-\",R8)),AD8<='export html'!$AR$7),\"\",IF(AND(LEFT(R8)=\"*\",RIGHT(R8)=\"*\"),\"ff\",IF(CE8>CE21,\"t\",IF(CE8<CE21,\"u\",\"g\"))))","v":"g"},{"$f":"IF(OR(ISERROR(FIND(\"-\",S8)),AE8<='export html'!$AR$7),\"\",IF(AND(LEFT(S8)=\"*\",RIGHT(S8)=\"*\"),\"ff\",IF(CF8>CF21,\"t\",IF(CF8<CF21,\"u\",\"g\"))))","v":""},null,{"$f":"IF(OR(ISERROR(FIND(\"-\",U8)),AG8<='export html'!$AR$7),\"\",IF(AND(LEFT(U8)=\"*\",RIGHT(U8)=\"*\"),\"ff\",IF(CH8>CH21,\"t\",IF(CH8<CH21,\"u\",\"g\"))))","v":""},{"$f":"IF(OR(ISERROR(FIND(\"-\",V8)),AH8<='export html'!$AR$7),\"\",IF(AND(LEFT(V8)=\"*\",RIGHT(V8)=\"*\"),\"ff\",IF(CI8>CI21,\"t\",IF(CI8<CI21,\"u\",\"g\"))))","v":""},{"$f":"IF(OR(ISERROR(FIND(\"-\",W8)),AI8<='export html'!$AR$7),\"\",IF(AND(LEFT(W8)=\"*\",RIGHT(W8)=\"*\"),\"ff\",IF(CJ8>CJ21,\"t\",IF(CJ8<CJ21,\"u\",\"g\"))))","v":"t"},{"$f":"IF(OR(ISERROR(FIND(\"-\",X8)),AJ8<='export html'!$AR$7),\"\",IF(AND(LEFT(X8)=\"*\",RIGHT(X8)=\"*\"),\"ff\",IF(CK8>CK21,\"t\",IF(CK8<CK21,\"u\",\"g\"))))","v":""},{"$f":"IF(OR(ISERROR(FIND(\"-\",Y8)),AK8<='export html'!$AR$7),\"\",IF(AND(LEFT(Y8)=\"*\",RIGHT(Y8)=\"*\"),\"ff\",IF(CL8>CL21,\"t\",IF(CL8<CL21,\"u\",\"g\"))))","v":""},{"$f":"IF(OR(ISERROR(FIND(\"-\",Z8)),AL8<='export html'!$AR$7),\"\",IF(AND(LEFT(Z8)=\"*\",RIGHT(Z8)=\"*\"),\"ff\",IF(CM8>CM21,\"t\",IF(CM8<CM21,\"u\",\"g\"))))","v":""},{"$f":"IF(OR(ISERROR(FIND(\"-\",AA8)),AM8<='export html'!$AR$7),\"\",IF(AND(LEFT(AA8)=\"*\",RIGHT(AA8)=\"*\"),\"ff\",IF(CN8>CN21,\"t\",IF(CN8<CN21,\"u\",\"g\"))))","v":""},{"$f":"IF(OR(ISERROR(FIND(\"-\",AB8)),AN8<='export html'!$AR$7),\"\",IF(AND(LEFT(AB8)=\"*\",RIGHT(AB8)=\"*\"),\"ff\",IF(CO8>CO21,\"t\",IF(CO8<CO21,\"u\",\"g\"))))","v":"t"},4]
[null,null,null,{"$f":"IF('export html'!A7=\"\",\"\",'export html'!A7)","v":"2024-02-25"},{"$f":"IF('export html'!B7=\"\",\"\",'export html'!B7)","v":20},{"$f":"IF('export html'!C7=\"\",\"\",'export html'!C7)","v":"De Vrede - Antverpia 98"},null,null,null,null,null,null,null,{"$f":"IF('export html'!D7=\"\",\"\",'export html'!D7)","v":"5-0"},null,null,null,null,null,null,null,null,null,null,null,null,null,null,null,null,null,null,null,null,null,null,null,null,null,null,null,null,null,null,null,null,null,null,null,null,null,null,null,null,null,null,null,null,null,null,null,null,null,null,null,null,null,5,{"$f":"IF(OR(ISERROR(FIND(\"-\",Q9)),AC9>'export html'!$AR$7),\"\",IF(AND(LEFT(Q9)=\"*\",RIGHT(Q9)=\"*\"),\"ff\",IF(BQ9>BQ22,\"t\",IF(BQ9<BQ22,\"u\",\"g\"))))","v":"t"},{"$f":"IF(OR(ISERROR(FIND(\"-\",R9)),AD9>'export html'!$AR$7),\"\",IF(AND(LEFT(R9)=\"*\",RIGHT(R9)=\"*\"),\"ff\",IF(BR9>BR22,\"t\",IF(BR9<BR22,\"u\",\"g\"))))","v":""},{"$f":"IF(OR(ISERROR(FIND(\"-\",S9)),AE9>'export html'!$AR$7),\"\",IF(AND(LEFT(S9)=\"*\",RIGHT(S9)=\"*\"),\"ff\",IF(BS9>BS22,\"t\",IF(BS9<BS22,\"u\",\"g\"))))","v":"t"},{"$f":"IF(OR(ISERROR(FIND(\"-\",T9)),AF9>'export html'!$AR$7),\"\",IF(AND(LEFT(T9)=\"*\",RIGHT(T9)=\"*\"),\"ff\",IF(BT9>BT22,\"t\",IF(BT9<BT22,\"u\",\"g\"))))","v":"t"},null,{"$f":"IF(OR(ISERROR(FIND(\"-\",V9)),AH9>'export html'!$AR$7),\"\",IF(AND(LEFT(V9)=\"*\",RIGHT(V9)=\"*\"),\"ff\",IF(BV9>BV22,\"t\",IF(BV9<BV22,\"u\",\"g\"))))","v":""},{"$f":"IF(OR(ISERROR(FIND(\"-\",W9)),AI9>'export html'!$AR$7),\"\",IF(AND(LEFT(W9)=\"*\",RIGHT(W9)=\"*\"),\"ff\",IF(BW9>BW22,\"t\",IF(BW9<BW22,\"u\",\"g\"))))","v":""},{"$f":"IF(OR(ISERROR(FIND(\"-\",X9)),AJ9>'export html'!$AR$7),\"\",IF(AND(LEFT(X9)=\"*\",RIGHT(X9)=\"*\"),\"ff\",IF(BX9>BX22,\"t\",IF(BX9<BX22,\"u\",\"g\"))))","v":"t"},{"$f":"IF(OR(ISERROR(FIND(\"-\",Y9)),AK9>'export html'!$AR$7),\"\",IF(AND(LEFT(Y9)=\"*\",RIGHT(Y9)=\"*\"),\"ff\",IF(BY9>BY22,\"t\",IF(BY9<BY22,\"u\",\"g\"))))","v":""},{"$f":"IF(OR(ISERROR(FIND(\"-\",Z9)),AL9>'export html'!$AR$7),\"\",IF(AND(LEFT(Z9)=\"*\",RIGHT(Z9)=\"*\"),\"ff\",IF(BZ9>BZ22,\"t\",IF(BZ9<BZ22,\"u\",\"g\"))))","v":""},{"$f":"IF(OR(ISERROR(FIND(\"-\",AA9)),AM9>'export html'!$AR$7),\"\",IF(AND(LEFT(AA9)=\"*\",RIGHT(AA9)=\"*\"),\"ff\",IF(CA9>CA22,\"t\",IF(CA9<CA22,\"u\",\"g\"))))","v":"t"},{"$f":"IF(OR(ISERROR(FIND(\"-\",AB9)),AN9>'export html'!$AR$7),\"\",IF(AND(LEFT(AB9)=\"*\",RIGHT(AB9)=\"*\"),\"ff\",IF(CB9>CB22,\"t\",IF(CB9<CB22,\"u\",\"g\"))))","v":"g"},5,{"$f":"IF(OR(ISERROR(FIND(\"-\",Q9)),AC9<='export html'!$AR$7),\"\",IF(AND(LEFT(Q9)=\"*\",RIGHT(Q9)=\"*\"),\"ff\",IF(CD9>CD22,\"t\",IF(CD9<CD22,\"u\",\"g\"))))","v":""},{"$f":"IF(OR(ISERROR(FIND(\"-\",R9)),AD9<='export html'!$AR$7),\"\",IF(AND(LEFT(R9)=\"*\",RIGHT(R9)=\"*\"),\"ff\",IF(CE9>CE22,\"t\",IF(CE9<CE22,\"u\",\"g\"))))","v":"t"},{"$f":"IF(OR(ISERROR(FIND(\"-\",S9)),AE9<='export html'!$AR$7),\"\",IF(AND(LEFT(S9)=\"*\",RIGHT(S9)=\"*\"),\"ff\",IF(CF9>CF22,\"t\",IF(CF9<CF22,\"u\",\"g\"))))","v":""},{"$f":"IF(OR(ISERROR(FIND(\"-\",T9)),AF9<='export html'!$AR$7),\"\",IF(AND(LEFT(T9)=\"*\",RIGHT(T9)=\"*\"),\"ff\",IF(CG9>CG22,\"t\",IF(CG9<CG22,\"u\",\"g\"))))","v":""},null,{"$f":"IF(OR(ISERROR(FIND(\"-\",V9)),AH9<='export html'!$AR$7),\"\",IF(AND(LEFT(V9)=\"*\",RIGHT(V9)=\"*\"),\"ff\",IF(CI9>CI22,\"t\",IF(CI9<CI22,\"u\",\"g\"))))","v":""},{"$f":"IF(OR(ISERROR(FIND(\"-\",W9)),AI9<='export html'!$AR$7),\"\",IF(AND(LEFT(W9)=\"*\",RIGHT(W9)=\"*\"),\"ff\",IF(CJ9>CJ22,\"t\",IF(CJ9<CJ22,\"u\",\"g\"))))","v":"t"},{"$f":"IF(OR(ISERROR(FIND(\"-\",X9)),AJ9<='export html'!$AR$7),\"\",IF(AND(LEFT(X9)=\"*\",RIGHT(X9)=\"*\"),\"ff\",IF(CK9>CK22,\"t\",IF(CK9<CK22,\"u\",\"g\"))))","v":""},{"$f":"IF(OR(ISERROR(FIND(\"-\",Y9)),AK9<='export html'!$AR$7),\"\",IF(AND(LEFT(Y9)=\"*\",RIGHT(Y9)=\"*\"),\"ff\",IF(CL9>CL22,\"t\",IF(CL9<CL22,\"u\",\"g\"))))","v":"t"},{"$f":"IF(OR(ISERROR(FIND(\"-\",Z9)),AL9<='export html'!$AR$7),\"\",IF(AND(LEFT(Z9)=\"*\",RIGHT(Z9)=\"*\"),\"ff\",IF(CM9>CM22,\"t\",IF(CM9<CM22,\"u\",\"g\"))))","v":"t"},{"$f":"IF(OR(ISERROR(FIND(\"-\",AA9)),AM9<='export html'!$AR$7),\"\",IF(AND(LEFT(AA9)=\"*\",RIGHT(AA9)=\"*\"),\"ff\",IF(CN9>CN22,\"t\",IF(CN9<CN22,\"u\",\"g\"))))","v":""},{"$f":"IF(OR(ISERROR(FIND(\"-\",AB9)),AN9<='export html'!$AR$7),\"\",IF(AND(LEFT(AB9)=\"*\",RIGHT(AB9)=\"*\"),\"ff\",IF(CO9>CO22,\"t\",IF(CO9<CO22,\"u\",\"g\"))))","v":""},5]
[null,null,null,{"$f":"IF('export html'!A8=\"\",\"\",'export html'!A8)","v":""},{"$f":"IF('export html'!B8=\"\",\"\",'export html'!B8)","v":""},{"$f":"IF('export html'!C8=\"\",\"\",'export html'!C8)","v":""},null,null,null,null,null,null,null,{"$f":"IF('export html'!D8=\"\",\"\",'export html'!D8)","v":""},null,null,null,null,null,null,null,null,null,null,null,null,null,null,null,null,null,null,null,null,null,null,null,null,null,null,null,null,null,null,null,null,null,null,null,null,null,null,null,null,null,null,null,null,null,null,null,null,null,null,null,null,null,6,{"$f":"IF(OR(ISERROR(FIND(\"-\",Q10)),AC10>'export html'!$AR$7),\"\",IF(AND(LEFT(Q10)=\"*\",RIGHT(Q10)=\"*\"),\"ff\",IF(BQ10>BQ23,\"t\",IF(BQ10<BQ23,\"u\",\"g\"))))","v":"t"},{"$f":"IF(OR(ISERROR(FIND(\"-\",R10)),AD10>'export html'!$AR$7),\"\",IF(AND(LEFT(R10)=\"*\",RIGHT(R10)=\"*\"),\"ff\",IF(BR10>BR23,\"t\",IF(BR10<BR23,\"u\",\"g\"))))","v":"t"},{"$f":"IF(OR(ISERROR(FIND(\"-\",S10)),AE10>'export html'!$AR$7),\"\",IF(AND(LEFT(S10)=\"*\",RIGHT(S10)=\"*\"),\"ff\",IF(BS10>BS23,\"t\",IF(BS10<BS23,\"u\",\"g\"))))","v":""},{"$f":"IF(OR(ISERROR(FIND(\"-\",T10)),AF10>'export html'!$AR$7),\"\",IF(AND(LEFT(T10)=\"*\",RIGHT(T10)=\"*\"),\"ff\",IF(BT10>BT23,\"t\",IF(BT10<BT23,\"u\",\"g\"))))","v":""},{"$f":"IF(OR(ISERROR(FIND(\"-\",U10)),AG10>'export html'!$AR$7),\"\",IF(AND(LEFT(U10)=\"*\",RIGHT(U10)=\"*\"),\"ff\",IF(BU10>BU23,\"t\",IF(BU10<BU23,\"u\",\"g\"))))","v":"u"},null,{"$f":"IF(OR(ISERROR(FIND(\"-\",W10)),AI10>'export html'!$AR$7),\"\",IF(AND(LEFT(W10)=\"*\",RIGHT(W10)=\"*\"),\"ff\",IF(BW10>BW23,\"t\",IF(BW10<BW23,\"u\",\"g\"))))","v":"t"},{"$f":"IF(OR(ISERROR(FIND(\"-\",X10)),AJ10>'export html'!$AR$7),\"\",IF(AND(LEFT(X10)=\"*\",RIGHT(X10)=\"*\"),\"ff\",IF(BX10>BX23,\"t\",IF(BX10<BX23,\"u\",\"g\"))))","v":""},{"$f":"IF(OR(ISERROR(FIND(\"-\",Y10)),AK10>'export html'!$AR$7),\"\",IF(AND(LEFT(Y10)=\"*\",RIGHT(Y10)=\"*\"),\"ff\",IF(BY10>BY23,\"t\",IF(BY10<BY23,\"u\",\"g\"))))","v":""},{"$f":"IF(OR(ISERROR(FIND(\"-\",Z10)),AL10>'export html'!$AR$7),\"\",IF(AND(LEFT(Z10)=\"*\",RIGHT(Z10)=\"*\"),\"ff\",IF(BZ10>BZ23,\"t\",IF(BZ10<BZ23,\"u\",\"g\"))))","v":""},{"$f":"IF(OR(ISERROR(FIND(\"-\",AA10)),AM10>'export html'!$AR$7),\"\",IF(AND(LEFT(AA10)=\"*\",RIGHT(AA10)=\"*\"),\"ff\",IF(CA10>CA23,\"t\",IF(CA10<CA23,\"u\",\"g\"))))","v":""},{"$f":"IF(OR(ISERROR(FIND(\"-\",AB10)),AN10>'export html'!$AR$7),\"\",IF(AND(LEFT(AB10)=\"*\",RIGHT(AB10)=\"*\"),\"ff\",IF(CB10>CB23,\"t\",IF(CB10<CB23,\"u\",\"g\"))))","v":""},6,{"$f":"IF(OR(ISERROR(FIND(\"-\",Q10)),AC10<='export html'!$AR$7),\"\",IF(AND(LEFT(Q10)=\"*\",RIGHT(Q10)=\"*\"),\"ff\",IF(CD10>CD23,\"t\",IF(CD10<CD23,\"u\",\"g\"))))","v":""},{"$f":"IF(OR(ISERROR(FIND(\"-\",R10)),AD10<='export html'!$AR$7),\"\",IF(AND(LEFT(R10)=\"*\",RIGHT(R10)=\"*\"),\"ff\",IF(CE10>CE23,\"t\",IF(CE10<CE23,\"u\",\"g\"))))","v":""},{"$f":"IF(OR(ISERROR(FIND(\"-\",S10)),AE10<='export html'!$AR$7),\"\",IF(AND(LEFT(S10)=\"*\",RIGHT(S10)=\"*\"),\"ff\",IF(CF10>CF23,\"t\",IF(CF10<CF23,\"u\",\"g\"))))","v":"t"},{"$f":"IF(OR(ISERROR(FIND(\"-\",T10)),AF10<='export html'!$AR$7),\"\",IF(AND(LEFT(T10)=\"*\",RIGHT(T10)=\"*\"),\"ff\",IF(CG10>CG23,\"t\",IF(CG10<CG23,\"u\",\"g\"))))","v":"t"},{"$f":"IF(OR(ISERROR(FIND(\"-\",U10)),AG10<='export html'!$AR$7),\"\",IF(AND(LEFT(U10)=\"*\",RIGHT(U10)=\"*\"),\"ff\",IF(CH10>CH23,\"t\",IF(CH10<CH23,\"u\",\"g\"))))","v":""},null,{"$f":"IF(OR(ISERROR(FIND(\"-\",W10)),AI10<='export html'!$AR$7),\"\",IF(AND(LEFT(W10)=\"*\",RIGHT(W10)=\"*\"),\"ff\",IF(CJ10>CJ23,\"t\",IF(CJ10<CJ23,\"u\",\"g\"))))","v":""},{"$f":"IF(OR(ISERROR(FIND(\"-\",X10)),AJ10<='export html'!$AR$7),\"\",IF(AND(LEFT(X10)=\"*\",RIGHT(X10)=\"*\"),\"ff\",IF(CK10>CK23,\"t\",IF(CK10<CK23,\"u\",\"g\"))))","v":""},{"$f":"IF(OR(ISERROR(FIND(\"-\",Y10)),AK10<='export html'!$AR$7),\"\",IF(AND(LEFT(Y10)=\"*\",RIGHT(Y10)=\"*\"),\"ff\",IF(CL10>CL23,\"t\",IF(CL10<CL23,\"u\",\"g\"))))","v":"t"},{"$f":"IF(OR(ISERROR(FIND(\"-\",Z10)),AL10<='export html'!$AR$7),\"\",IF(AND(LEFT(Z10)=\"*\",RIGHT(Z10)=\"*\"),\"ff\",IF(CM10>CM23,\"t\",IF(CM10<CM23,\"u\",\"g\"))))","v":""},{"$f":"IF(OR(ISERROR(FIND(\"-\",AA10)),AM10<='export html'!$AR$7),\"\",IF(AND(LEFT(AA10)=\"*\",RIGHT(AA10)=\"*\"),\"ff\",IF(CN10>CN23,\"t\",IF(CN10<CN23,\"u\",\"g\"))))","v":"u"},{"$f":"IF(OR(ISERROR(FIND(\"-\",AB10)),AN10<='export html'!$AR$7),\"\",IF(AND(LEFT(AB10)=\"*\",RIGHT(AB10)=\"*\"),\"ff\",IF(CO10>CO23,\"t\",IF(CO10<CO23,\"u\",\"g\"))))","v":"t"},6]
[null,null,null,{"$f":"IF('export html'!A9=\"\",\"\",'export html'!A9)","v":""},{"$f":"IF('export html'!B9=\"\",\"\",'export html'!B9)","v":""},{"$f":"IF('export html'!C9=\"\",\"\",'export html'!C9)","v":""},null,null,null,null,null,null,null,{"$f":"IF('export html'!D9=\"\",\"\",'export html'!D9)","v":""},null,null,null,null,null,null,null,null,null,null,null,null,null,null,null,null,null,null,null,null,null,null,null,null,null,null,null,null,null,null,null,null,null,null,null,null,null,null,null,null,null,null,null,null,null,null,null,null,null,null,null,null,null,7,{"$f":"IF(OR(ISERROR(FIND(\"-\",Q11)),AC11>'export html'!$AR$7),\"\",IF(AND(LEFT(Q11)=\"*\",RIGHT(Q11)=\"*\"),\"ff\",IF(BQ11>BQ24,\"t\",IF(BQ11<BQ24,\"u\",\"g\"))))","v":""},{"$f":"IF(OR(ISERROR(FIND(\"-\",R11)),AD11>'export html'!$AR$7),\"\",IF(AND(LEFT(R11)=\"*\",RIGHT(R11)=\"*\"),\"ff\",IF(BR11>BR24,\"t\",IF(BR11<BR24,\"u\",\"g\"))))","v":"g"},{"$f":"IF(OR(ISERROR(FIND(\"-\",S11)),AE11>'export html'!$AR$7),\"\",IF(AND(LEFT(S11)=\"*\",RIGHT(S11)=\"*\"),\"ff\",IF(BS11>BS24,\"t\",IF(BS11<BS24,\"u\",\"g\"))))","v":"g"},{"$f":"IF(OR(ISERROR(FIND(\"-\",T11)),AF11>'export html'!$AR$7),\"\",IF(AND(LEFT(T11)=\"*\",RIGHT(T11)=\"*\"),\"ff\",IF(BT11>BT24,\"t\",IF(BT11<BT24,\"u\",\"g\"))))","v":"u"},{"$f":"IF(OR(ISERROR(FIND(\"-\",U11)),AG11>'export html'!$AR$7),\"\",IF(AND(LEFT(U11)=\"*\",RIGHT(U11)=\"*\"),\"ff\",IF(BU11>BU24,\"t\",IF(BU11<BU24,\"u\",\"g\"))))","v":"u"},{"$f":"IF(OR(ISERROR(FIND(\"-\",V11)),AH11>'export html'!$AR$7),\"\",IF(AND(LEFT(V11)=\"*\",RIGHT(V11)=\"*\"),\"ff\",IF(BV11>BV24,\"t\",IF(BV11<BV24,\"u\",\"g\"))))","v":""},null,{"$f":"IF(OR(ISERROR(FIND(\"-\",X11)),AJ11>'export html'!$AR$7),\"\",IF(AND(LEFT(X11)=\"*\",RIGHT(X11)=\"*\"),\"ff\",IF(BX11>BX24,\"t\",IF(BX11<BX24,\"u\",\"g\"))))","v":""},{"$f":"IF(OR(ISERROR(FIND(\"-\",Y11)),AK11>'export html'!$AR$7),\"\",IF(AND(LEFT(Y11)=\"*\",RIGHT(Y11)=\"*\"),\"ff\",IF(BY11>BY24,\"t\",IF(BY11<BY24,\"u\",\"g\"))))","v":"t"},{"$f":"IF(OR(ISERROR(FIND(\"-\",Z11)),AL11>'export html'!$AR$7),\"\",IF(AND(LEFT(Z11)=\"*\",RIGHT(Z11)=\"*\"),\"ff\",IF(BZ11>BZ24,\"t\",IF(BZ11<BZ24,\"u\",\"g\"))))","v":""},{"$f":"IF(OR(ISERROR(FIND(\"-\",AA11)),AM11>'export html'!$AR$7),\"\",IF(AND(LEFT(AA11)=\"*\",RIGHT(AA11)=\"*\"),\"ff\",IF(CA11>CA24,\"t\",IF(CA11<CA24,\"u\",\"g\"))))","v":""},{"$f":"IF(OR(ISERROR(FIND(\"-\",AB11)),AN11>'export html'!$AR$7),\"\",IF(AND(LEFT(AB11)=\"*\",RIGHT(AB11)=\"*\"),\"ff\",IF(CB11>CB24,\"t\",IF(CB11<CB24,\"u\",\"g\"))))","v":""},7,{"$f":"IF(OR(ISERROR(FIND(\"-\",Q11)),AC11<='export html'!$AR$7),\"\",IF(AND(LEFT(Q11)=\"*\",RIGHT(Q11)=\"*\"),\"ff\",IF(CD11>CD24,\"t\",IF(CD11<CD24,\"u\",\"g\"))))","v":"u"},{"$f":"IF(OR(ISERROR(FIND(\"-\",R11)),AD11<='export html'!$AR$7),\"\",IF(AND(LEFT(R11)=\"*\",RIGHT(R11)=\"*\"),\"ff\",IF(CE11>CE24,\"t\",IF(CE11<CE24,\"u\",\"g\"))))","v":""},{"$f":"IF(OR(ISERROR(FIND(\"-\",S11)),AE11<='export html'!$AR$7),\"\",IF(AND(LEFT(S11)=\"*\",RIGHT(S11)=\"*\"),\"ff\",IF(CF11>CF24,\"t\",IF(CF11<CF24,\"u\",\"g\"))))","v":""},{"$f":"IF(OR(ISERROR(FIND(\"-\",T11)),AF11<='export html'!$AR$7),\"\",IF(AND(LEFT(T11)=\"*\",RIGHT(T11)=\"*\"),\"ff\",IF(CG11>CG24,\"t\",IF(CG11<CG24,\"u\",\"g\"))))","v":""},{"$f":"IF(OR(ISERROR(FIND(\"-\",U11)),AG11<='export html'!$AR$7),\"\",IF(AND(LEFT(U11)=\"*\",RIGHT(U11)=\"*\"),\"ff\",IF(CH11>CH24,\"t\",IF(CH11<CH24,\"u\",\"g\"))))","v":""},{"$f":"IF(OR(ISERROR(FIND(\"-\",V11)),AH11<='export html'!$AR$7),\"\",IF(AND(LEFT(V11)=\"*\",RIGHT(V11)=\"*\"),\"ff\",IF(CI11>CI24,\"t\",IF(CI11<CI24,\"u\",\"g\"))))","v":"u"},null,{"$f":"IF(OR(ISERROR(FIND(\"-\",X11)),AJ11<='export html'!$AR$7),\"\",IF(AND(LEFT(X11)=\"*\",RIGHT(X11)=\"*\"),\"ff\",IF(CK11>CK24,\"t\",IF(CK11<CK24,\"u\",\"g\"))))","v":"u"},{"$f":"IF(OR(ISERROR(FIND(\"-\",Y11)),AK11<='export html'!$AR$7),\"\",IF(AND(LEFT(Y11)=\"*\",RIGHT(Y11)=\"*\"),\"ff\",IF(CL11>CL24,\"t\",IF(CL11<CL24,\"u\",\"g\"))))","v":""},{"$f":"IF(OR(ISERROR(FIND(\"-\",Z11)),AL11<='export html'!$AR$7),\"\",IF(AND(LEFT(Z11)=\"*\",RIGHT(Z11)=\"*\"),\"ff\",IF(CM11>CM24,\"t\",IF(CM11<CM24,\"u\",\"g\"))))","v":""},{"$f":"IF(OR(ISERROR(FIND(\"-\",AA11)),AM11<='export html'!$AR$7),\"\",IF(AND(LEFT(AA11)=\"*\",RIGHT(AA11)=\"*\"),\"ff\",IF(CN11>CN24,\"t\",IF(CN11<CN24,\"u\",\"g\"))))","v":""},{"$f":"IF(OR(ISERROR(FIND(\"-\",AB11)),AN11<='export html'!$AR$7),\"\",IF(AND(LEFT(AB11)=\"*\",RIGHT(AB11)=\"*\"),\"ff\",IF(CO11>CO24,\"t\",IF(CO11<CO24,\"u\",\"g\"))))","v":""},7]
[null,null,null,null,null,null,null,null,null,null,null,null,null,null,null,null,null,null,null,null,null,null,null,null,null,null,null,null,null,null,null,null,null,null,null,null,null,null,null,null,null,null,null,null,null,null,null,null,null,null,null,null,null,null,null,null,null,null,null,null,null,null,null,null,null,null,null,8,{"$f":"IF(OR(ISERROR(FIND(\"-\",Q12)),AC12>'export html'!$AR$7),\"\",IF(AND(LEFT(Q12)=\"*\",RIGHT(Q12)=\"*\"),\"ff\",IF(BQ12>BQ25,\"t\",IF(BQ12<BQ25,\"u\",\"g\"))))","v":""},{"$f":"IF(OR(ISERROR(FIND(\"-\",R12)),AD12>'export html'!$AR$7),\"\",IF(AND(LEFT(R12)=\"*\",RIGHT(R12)=\"*\"),\"ff\",IF(BR12>BR25,\"t\",IF(BR12<BR25,\"u\",\"g\"))))","v":"t"},{"$f":"IF(OR(ISERROR(FIND(\"-\",S12)),AE12>'export html'!$AR$7),\"\",IF(AND(LEFT(S12)=\"*\",RIGHT(S12)=\"*\"),\"ff\",IF(BS12>BS25,\"t\",IF(BS12<BS25,\"u\",\"g\"))))","v":""},{"$f":"IF(OR(ISERROR(FIND(\"-\",T12)),AF12>'export html'!$AR$7),\"\",IF(AND(LEFT(T12)=\"*\",RIGHT(T12)=\"*\"),\"ff\",IF(BT12>BT25,\"t\",IF(BT12<BT25,\"u\",\"g\"))))","v":""},{"$f":"IF(OR(ISERROR(FIND(\"-\",U12)),AG12>'export html'!$AR$7),\"\",IF(AND(LEFT(U12)=\"*\",RIGHT(U12)=\"*\"),\"ff\",IF(BU12>BU25,\"t\",IF(BU12<BU25,\"u\",\"g\"))))","v":""},{"$f":"IF(OR(ISERROR(FIND(\"-\",V12)),AH12>'export html'!$AR$7),\"\",IF(AND(LEFT(V12)=\"*\",RIGHT(V12)=\"*\"),\"ff\",IF(BV12>BV25,\"t\",IF(BV12<BV25,\"u\",\"g\"))))","v":"t"},{"$f":"IF(OR(ISERROR(FIND(\"-\",W12)),AI12>'export html'!$AR$7),\"\",IF(AND(LEFT(W12)=\"*\",RIGHT(W12)=\"*\"),\"ff\",IF(BW12>BW25,\"t\",IF(BW12<BW25,\"u\",\"g\"))))","v":"t"},null,{"$f":"IF(OR(ISERROR(FIND(\"-\",Y12)),AK12>'export html'!$AR$7),\"\",IF(AND(LEFT(Y12)=\"*\",RIGHT(Y12)=\"*\"),\"ff\",IF(BY12>BY25,\"t\",IF(BY12<BY25,\"u\",\"g\"))))","v":"u"},{"$f":"IF(OR(ISERROR(FIND(\"-\",Z12)),AL12>'export html'!$AR$7),\"\",IF(AND(LEFT(Z12)=\"*\",RIGHT(Z12)=\"*\"),\"ff\",IF(BZ12>BZ25,\"t\",IF(BZ12<BZ25,\"u\",\"g\"))))","v":""},{"$f":"IF(OR(ISERROR(FIND(\"-\",AA12)),AM12>'export html'!$AR$7),\"\",IF(AND(LEFT(AA12)=\"*\",RIGHT(AA12)=\"*\"),\"ff\",IF(CA12>CA25,\"t\",IF(CA12<CA25,\"u\",\"g\"))))","v":""},{"$f":"IF(OR(ISERROR(FIND(\"-\",AB12)),AN12>'export html'!$AR$7),\"\",IF(AND(LEFT(AB12)=\"*\",RIGHT(AB12)=\"*\"),\"ff\",IF(CB12>CB25,\"t\",IF(CB12<CB25,\"u\",\"g\"))))","v":""},8,{"$f":"IF(OR(ISERROR(FIND(\"-\",Q12)),AC12<='export html'!$AR$7),\"\",IF(AND(LEFT(Q12)=\"*\",RIGHT(Q12)=\"*\"),\"ff\",IF(CD12>CD25,\"t\",IF(CD12<CD25,\"u\",\"g\"))))","v":""},{"$f":"IF(OR(ISERROR(FIND(\"-\",R12)),AD12<='export html'!$AR$7),\"\",IF(AND(LEFT(R12)=\"*\",RIGHT(R12)=\"*\"),\"ff\",IF(CE12>CE25,\"t\",IF(CE12<CE25,\"u\",\"g\"))))","v":""},{"$f":"IF(OR(ISERROR(FIND(\"-\",S12)),AE12<='export html'!$AR$7),\"\",IF(AND(LEFT(S12)=\"*\",RIGHT(S12)=\"*\"),\"ff\",IF(CF12>CF25,\"t\",IF(CF12<CF25,\"u\",\"g\"))))","v":"u"},{"$f":"IF(OR(ISERROR(FIND(\"-\",T12)),AF12<='export html'!$AR$7),\"\",IF(AND(LEFT(T12)=\"*\",RIGHT(T12)=\"*\"),\"ff\",IF(CG12>CG25,\"t\",IF(CG12<CG25,\"u\",\"g\"))))","v":""},{"$f":"IF(OR(ISERROR(FIND(\"-\",U12)),AG12<='export html'!$AR$7),\"\",IF(AND(LEFT(U12)=\"*\",RIGHT(U12)=\"*\"),\"ff\",IF(CH12>CH25,\"t\",IF(CH12<CH25,\"u\",\"g\"))))","v":""},{"$f":"IF(OR(ISERROR(FIND(\"-\",V12)),AH12<='export html'!$AR$7),\"\",IF(AND(LEFT(V12)=\"*\",RIGHT(V12)=\"*\"),\"ff\",IF(CI12>CI25,\"t\",IF(CI12<CI25,\"u\",\"g\"))))","v":""},{"$f":"IF(OR(ISERROR(FIND(\"-\",W12)),AI12<='export html'!$AR$7),\"\",IF(AND(LEFT(W12)=\"*\",RIGHT(W12)=\"*\"),\"ff\",IF(CJ12>CJ25,\"t\",IF(CJ12<CJ25,\"u\",\"g\"))))","v":""},null,{"$f":"IF(OR(ISERROR(FIND(\"-\",Y12)),AK12<='export html'!$AR$7),\"\",IF(AND(LEFT(Y12)=\"*\",RIGHT(Y12)=\"*\"),\"ff\",IF(CL12>CL25,\"t\",IF(CL12<CL25,\"u\",\"g\"))))","v":""},{"$f":"IF(OR(ISERROR(FIND(\"-\",Z12)),AL12<='export html'!$AR$7),\"\",IF(AND(LEFT(Z12)=\"*\",RIGHT(Z12)=\"*\"),\"ff\",IF(CM12>CM25,\"t\",IF(CM12<CM25,\"u\",\"g\"))))","v":"g"},{"$f":"IF(OR(ISERROR(FIND(\"-\",AA12)),AM12<='export html'!$AR$7),\"\",IF(AND(LEFT(AA12)=\"*\",RIGHT(AA12)=\"*\"),\"ff\",IF(CN12>CN25,\"t\",IF(CN12<CN25,\"u\",\"g\"))))","v":"u"},{"$f":"IF(OR(ISERROR(FIND(\"-\",AB12)),AN12<='export html'!$AR$7),\"\",IF(AND(LEFT(AB12)=\"*\",RIGHT(AB12)=\"*\"),\"ff\",IF(CO12>CO25,\"t\",IF(CO12<CO25,\"u\",\"g\"))))","v":"t"},8]
[null,null,null,null,null,null,null,null,null,null,null,null,null,null,null,null,null,null,null,null,null,null,null,null,null,null,null,null,null,null,null,null,null,null,null,null,null,null,null,null,null,null,null,null,null,null,null,null,null,null,null,null,null,null,null,null,null,null,null,null,null,null,null,null,null,null,null,9,{"$f":"IF(OR(ISERROR(FIND(\"-\",Q13)),AC13>'export html'!$AR$7),\"\",IF(AND(LEFT(Q13)=\"*\",RIGHT(Q13)=\"*\"),\"ff\",IF(BQ13>BQ26,\"t\",IF(BQ13<BQ26,\"u\",\"g\"))))","v":""},{"$f":"IF(OR(ISERROR(FIND(\"-\",R13)),AD13>'export html'!$AR$7),\"\",IF(AND(LEFT(R13)=\"*\",RIGHT(R13)=\"*\"),\"ff\",IF(BR13>BR26,\"t\",IF(BR13<BR26,\"u\",\"g\"))))","v":""},{"$f":"IF(OR(ISERROR(FIND(\"-\",S13)),AE13>'export html'!$AR$7),\"\",IF(AND(LEFT(S13)=\"*\",RIGHT(S13)=\"*\"),\"ff\",IF(BS13>BS26,\"t\",IF(BS13<BS26,\"u\",\"g\"))))","v":"t"},{"$f":"IF(OR(ISERROR(FIND(\"-\",T13)),AF13>'export html'!$AR$7),\"\",IF(AND(LEFT(T13)=\"*\",RIGHT(T13)=\"*\"),\"ff\",IF(BT13>BT26,\"t\",IF(BT13<BT26,\"u\",\"g\"))))","v":""},{"$f":"IF(OR(ISERROR(FIND(\"-\",U13)),AG13>'export html'!$AR$7),\"\",IF(AND(LEFT(U13)=\"*\",RIGHT(U13)=\"*\"),\"ff\",IF(BU13>BU26,\"t\",IF(BU13<BU26,\"u\",\"g\"))))","v":"u"},{"$f":"IF(OR(ISERROR(FIND(\"-\",V13)),AH13>'export html'!$AR$7),\"\",IF(AND(LEFT(V13)=\"*\",RIGHT(V13)=\"*\"),\"ff\",IF(BV13>BV26,\"t\",IF(BV13<BV26,\"u\",\"g\"))))","v":""},{"$f":"IF(OR(ISERROR(FIND(\"-\",W13)),AI13>'export html'!$AR$7),\"\",IF(AND(LEFT(W13)=\"*\",RIGHT(W13)=\"*\"),\"ff\",IF(BW13>BW26,\"t\",IF(BW13<BW26,\"u\",\"g\"))))","v":""},{"$f":"IF(OR(ISERROR(FIND(\"-\",X13)),AJ13>'export html'!$AR$7),\"\",IF(AND(LEFT(X13)=\"*\",RIGHT(X13)=\"*\"),\"ff\",IF(BX13>BX26,\"t\",IF(BX13<BX26,\"u\",\"g\"))))","v":""},null,{"$f":"IF(OR(ISERROR(FIND(\"-\",Z13)),AL13>'export html'!$AR$7),\"\",IF(AND(LEFT(Z13)=\"*\",RIGHT(Z13)=\"*\"),\"ff\",IF(BZ13>BZ26,\"t\",IF(BZ13<BZ26,\"u\",\"g\"))))","v":""},{"$f":"IF(OR(ISERROR(FIND(\"-\",AA13)),AM13>'export html'!$AR$7),\"\",IF(AND(LEFT(AA13)=\"*\",RIGHT(AA13)=\"*\"),\"ff\",IF(CA13>CA26,\"t\",IF(CA13<CA26,\"u\",\"g\"))))","v":"t"},{"$f":"IF(OR(ISERROR(FIND(\"-\",AB13)),AN13>'export html'!$AR$7),\"\",IF(AND(LEFT(AB13)=\"*\",RIGHT(AB13)=\"*\"),\"ff\",IF(CB13>CB26,\"t\",IF(CB13<CB26,\"u\",\"g\"))))","v":"g"},9,{"$f":"IF(OR(ISERROR(FIND(\"-\",Q13)),AC13<='export html'!$AR$7),\"\",IF(AND(LEFT(Q13)=\"*\",RIGHT(Q13)=\"*\"),\"ff\",IF(CD13>CD26,\"t\",IF(CD13<CD26,\"u\",\"g\"))))","v":"u"},{"$f":"IF(OR(ISERROR(FIND(\"-\",R13)),AD13<='export html'!$AR$7),\"\",IF(AND(LEFT(R13)=\"*\",RIGHT(R13)=\"*\"),\"ff\",IF(CE13>CE26,\"t\",IF(CE13<CE26,\"u\",\"g\"))))","v":""},{"$f":"IF(OR(ISERROR(FIND(\"-\",S13)),AE13<='export html'!$AR$7),\"\",IF(AND(LEFT(S13)=\"*\",RIGHT(S13)=\"*\"),\"ff\",IF(CF13>CF26,\"t\",IF(CF13<CF26,\"u\",\"g\"))))","v":""},{"$f":"IF(OR(ISERROR(FIND(\"-\",T13)),AF13<='export html'!$AR$7),\"\",IF(AND(LEFT(T13)=\"*\",RIGHT(T13)=\"*\"),\"ff\",IF(CG13>CG26,\"t\",IF(CG13<CG26,\"u\",\"g\"))))","v":"t"},{"$f":"IF(OR(ISERROR(FIND(\"-\",U13)),AG13<='export html'!$AR$7),\"\",IF(AND(LEFT(U13)=\"*\",RIGHT(U13)=\"*\"),\"ff\",IF(CH13>CH26,\"t\",IF(CH13<CH26,\"u\",\"g\"))))","v":""},{"$f":"IF(OR(ISERROR(FIND(\"-\",V13)),AH13<='export html'!$AR$7),\"\",IF(AND(LEFT(V13)=\"*\",RIGHT(V13)=\"*\"),\"ff\",IF(CI13>CI26,\"t\",IF(CI13<CI26,\"u\",\"g\"))))","v":""},{"$f":"IF(OR(ISERROR(FIND(\"-\",W13)),AI13<='export html'!$AR$7),\"\",IF(AND(LEFT(W13)=\"*\",RIGHT(W13)=\"*\"),\"ff\",IF(CJ13>CJ26,\"t\",IF(CJ13<CJ26,\"u\",\"g\"))))","v":""},{"$f":"IF(OR(ISERROR(FIND(\"-\",X13)),AJ13<='export html'!$AR$7),\"\",IF(AND(LEFT(X13)=\"*\",RIGHT(X13)=\"*\"),\"ff\",IF(CK13>CK26,\"t\",IF(CK13<CK26,\"u\",\"g\"))))","v":"t"},null,{"$f":"IF(OR(ISERROR(FIND(\"-\",Z13)),AL13<='export html'!$AR$7),\"\",IF(AND(LEFT(Z13)=\"*\",RIGHT(Z13)=\"*\"),\"ff\",IF(CM13>CM26,\"t\",IF(CM13<CM26,\"u\",\"g\"))))","v":"u"},{"$f":"IF(OR(ISERROR(FIND(\"-\",AA13)),AM13<='export html'!$AR$7),\"\",IF(AND(LEFT(AA13)=\"*\",RIGHT(AA13)=\"*\"),\"ff\",IF(CN13>CN26,\"t\",IF(CN13<CN26,\"u\",\"g\"))))","v":""},{"$f":"IF(OR(ISERROR(FIND(\"-\",AB13)),AN13<='export html'!$AR$7),\"\",IF(AND(LEFT(AB13)=\"*\",RIGHT(AB13)=\"*\"),\"ff\",IF(CO13>CO26,\"t\",IF(CO13<CO26,\"u\",\"g\"))))","v":""},9]
[null,null,null,null,null,null,null,null,null,null,null,null,null,null,null,null,null,null,null,null,null,null,null,null,null,null,null,null,null,null,null,null,null,null,null,null,null,null,null,null,null,null,null,null,null,null,null,null,null,null,null,null,null,null,null,null,null,null,null,null,null,null,null,null,null,null,null,10,{"$f":"IF(OR(ISERROR(FIND(\"-\",Q14)),AC14>'export html'!$AR$7),\"\",IF(AND(LEFT(Q14)=\"*\",RIGHT(Q14)=\"*\"),\"ff\",IF(BQ14>BQ27,\"t\",IF(BQ14<BQ27,\"u\",\"g\"))))","v":""},{"$f":"IF(OR(ISERROR(FIND(\"-\",R14)),AD14>'export html'!$AR$7),\"\",IF(AND(LEFT(R14)=\"*\",RIGHT(R14)=\"*\"),\"ff\",IF(BR14>BR27,\"t\",IF(BR14<BR27,\"u\",\"g\"))))","v":"t"},{"$f":"IF(OR(ISERROR(FIND(\"-\",S14)),AE14>'export html'!$AR$7),\"\",IF(AND(LEFT(S14)=\"*\",RIGHT(S14)=\"*\"),\"ff\",IF(BS14>BS27,\"t\",IF(BS14<BS27,\"u\",\"g\"))))","v":""},{"$f":"IF(OR(ISERROR(FIND(\"-\",T14)),AF14>'export html'!$AR$7),\"\",IF(AND(LEFT(T14)=\"*\",RIGHT(T14)=\"*\"),\"ff\",IF(BT14>BT27,\"t\",IF(BT14<BT27,\"u\",\"g\"))))","v":""},{"$f":"IF(OR(ISERROR(FIND(\"-\",U14)),AG14>'export html'!$AR$7),\"\",IF(AND(LEFT(U14)=\"*\",RIGHT(U14)=\"*\"),\"ff\",IF(BU14>BU27,\"t\",IF(BU14<BU27,\"u\",\"g\"))))","v":""},{"$f":"IF(OR(ISERROR(FIND(\"-\",V14)),AH14>'export html'!$AR$7),\"\",IF(AND(LEFT(V14)=\"*\",RIGHT(V14)=\"*\"),\"ff\",IF(BV14>BV27,\"t\",IF(BV14<BV27,\"u\",\"g\"))))","v":""},{"$f":"IF(OR(ISERROR(FIND(\"-\",W14)),AI14>'export html'!$AR$7),\"\",IF(AND(LEFT(W14)=\"*\",RIGHT(W14)=\"*\"),\"ff\",IF(BW14>BW27,\"t\",IF(BW14<BW27,\"u\",\"g\"))))","v":"t"},{"$f":"IF(OR(ISERROR(FIND(\"-\",X14)),AJ14>'export html'!$AR$7),\"\",IF(AND(LEFT(X14)=\"*\",RIGHT(X14)=\"*\"),\"ff\",IF(BX14>BX27,\"t\",IF(BX14<BX27,\"u\",\"g\"))))","v":"t"},{"$f":"IF(OR(ISERROR(FIND(\"-\",Y14)),AK14>'export html'!$AR$7),\"\",IF(AND(LEFT(Y14)=\"*\",RIGHT(Y14)=\"*\"),\"ff\",IF(BY14>BY27,\"t\",IF(BY14<BY27,\"u\",\"g\"))))","v":"t"},null,{"$f":"IF(OR(ISERROR(FIND(\"-\",AA14)),AM14>'export html'!$AR$7),\"\",IF(AND(LEFT(AA14)=\"*\",RIGHT(AA14)=\"*\"),\"ff\",IF(CA14>CA27,\"t\",IF(CA14<CA27,\"u\",\"g\"))))","v":""},{"$f":"IF(OR(ISERROR(FIND(\"-\",AB14)),AN14>'export html'!$AR$7),\"\",IF(AND(LEFT(AB14)=\"*\",RIGHT(AB14)=\"*\"),\"ff\",IF(CB14>CB27,\"t\",IF(CB14<CB27,\"u\",\"g\"))))","v":""},10,{"$f":"IF(OR(ISERROR(FIND(\"-\",Q14)),AC14<='export html'!$AR$7),\"\",IF(AND(LEFT(Q14)=\"*\",RIGHT(Q14)=\"*\"),\"ff\",IF(CD14>CD27,\"t\",IF(CD14<CD27,\"u\",\"g\"))))","v":"u"},{"$f":"IF(OR(ISERROR(FIND(\"-\",R14)),AD14<='export html'!$AR$7),\"\",IF(AND(LEFT(R14)=\"*\",RIGHT(R14)=\"*\"),\"ff\",IF(CE14>CE27,\"t\",IF(CE14<CE27,\"u\",\"g\"))))","v":""},{"$f":"IF(OR(ISERROR(FIND(\"-\",S14)),AE14<='export html'!$AR$7),\"\",IF(AND(LEFT(S14)=\"*\",RIGHT(S14)=\"*\"),\"ff\",IF(CF14>CF27,\"t\",IF(CF14<CF27,\"u\",\"g\"))))","v":""},{"$f":"IF(OR(ISERROR(FIND(\"-\",T14)),AF14<='export html'!$AR$7),\"\",IF(AND(LEFT(T14)=\"*\",RIGHT(T14)=\"*\"),\"ff\",IF(CG14>CG27,\"t\",IF(CG14<CG27,\"u\",\"g\"))))","v":""},{"$f":"IF(OR(ISERROR(FIND(\"-\",U14)),AG14<='export html'!$AR$7),\"\",IF(AND(LEFT(U14)=\"*\",RIGHT(U14)=\"*\"),\"ff\",IF(CH14>CH27,\"t\",IF(CH14<CH27,\"u\",\"g\"))))","v":""},{"$f":"IF(OR(ISERROR(FIND(\"-\",V14)),AH14<='export html'!$AR$7),\"\",IF(AND(LEFT(V14)=\"*\",RIGHT(V14)=\"*\"),\"ff\",IF(CI14>CI27,\"t\",IF(CI14<CI27,\"u\",\"g\"))))","v":"t"},{"$f":"IF(OR(ISERROR(FIND(\"-\",W14)),AI14<='export html'!$AR$7),\"\",IF(AND(LEFT(W14)=\"*\",RIGHT(W14)=\"*\"),\"ff\",IF(CJ14>CJ27,\"t\",IF(CJ14<CJ27,\"u\",\"g\"))))","v":""},{"$f":"IF(OR(ISERROR(FIND(\"-\",X14)),AJ14<='export html'!$AR$7),\"\",IF(AND(LEFT(X14)=\"*\",RIGHT(X14)=\"*\"),\"ff\",IF(CK14>CK27,\"t\",IF(CK14<CK27,\"u\",\"g\"))))","v":""},{"$f":"IF(OR(ISERROR(FIND(\"-\",Y14)),AK14<='export html'!$AR$7),\"\",IF(AND(LEFT(Y14)=\"*\",RIGHT(Y14)=\"*\"),\"ff\",IF(CL14>CL27,\"t\",IF(CL14<CL27,\"u\",\"g\"))))","v":""},null,{"$f":"IF(OR(ISERROR(FIND(\"-\",AA14)),AM14<='export html'!$AR$7),\"\",IF(AND(LEFT(AA14)=\"*\",RIGHT(AA14)=\"*\"),\"ff\",IF(CN14>CN27,\"t\",IF(CN14<CN27,\"u\",\"g\"))))","v":"g"},{"$f":"IF(OR(ISERROR(FIND(\"-\",AB14)),AN14<='export html'!$AR$7),\"\",IF(AND(LEFT(AB14)=\"*\",RIGHT(AB14)=\"*\"),\"ff\",IF(CO14>CO27,\"t\",IF(CO14<CO27,\"u\",\"g\"))))","v":"t"},10]
[null,null,null,null,null,null,null,null,null,null,null,null,null,null,null,null,null,null,null,null,null,null,null,null,null,null,null,null,null,null,null,null,null,null,null,null,null,null,null,null,null,null,null,null,null,null,null,null,null,null,null,null,null,null,null,null,null,null,null,null,null,null,null,null,null,null,null,11,{"$f":"IF(OR(ISERROR(FIND(\"-\",Q15)),AC15>'export html'!$AR$7),\"\",IF(AND(LEFT(Q15)=\"*\",RIGHT(Q15)=\"*\"),\"ff\",IF(BQ15>BQ28,\"t\",IF(BQ15<BQ28,\"u\",\"g\"))))","v":""},{"$f":"IF(OR(ISERROR(FIND(\"-\",R15)),AD15>'export html'!$AR$7),\"\",IF(AND(LEFT(R15)=\"*\",RIGHT(R15)=\"*\"),\"ff\",IF(BR15>BR28,\"t\",IF(BR15<BR28,\"u\",\"g\"))))","v":""},{"$f":"IF(OR(ISERROR(FIND(\"-\",S15)),AE15>'export html'!$AR$7),\"\",IF(AND(LEFT(S15)=\"*\",RIGHT(S15)=\"*\"),\"ff\",IF(BS15>BS28,\"t\",IF(BS15<BS28,\"u\",\"g\"))))","v":""},{"$f":"IF(OR(ISERROR(FIND(\"-\",T15)),AF15>'export html'!$AR$7),\"\",IF(AND(LEFT(T15)=\"*\",RIGHT(T15)=\"*\"),\"ff\",IF(BT15>BT28,\"t\",IF(BT15<BT28,\"u\",\"g\"))))","v":""},{"$f":"IF(OR(ISERROR(FIND(\"-\",U15)),AG15>'export html'!$AR$7),\"\",IF(AND(LEFT(U15)=\"*\",RIGHT(U15)=\"*\"),\"ff\",IF(BU15>BU28,\"t\",IF(BU15<BU28,\"u\",\"g\"))))","v":""},{"$f":"IF(OR(ISERROR(FIND(\"-\",V15)),AH15>'export html'!$AR$7),\"\",IF(AND(LEFT(V15)=\"*\",RIGHT(V15)=\"*\"),\"ff\",IF(BV15>BV28,\"t\",IF(BV15<BV28,\"u\",\"g\"))))","v":"u"},{"$f":"IF(OR(ISERROR(FIND(\"-\",W15)),AI15>'export html'!$AR$7),\"\",IF(AND(LEFT(W15)=\"*\",RIGHT(W15)=\"*\"),\"ff\",IF(BW15>BW28,\"t\",IF(BW15<BW28,\"u\",\"g\"))))","v":""},{"$f":"IF(OR(ISERROR(FIND(\"-\",X15)),AJ15>'export html'!$AR$7),\"\",IF(AND(LEFT(X15)=\"*\",RIGHT(X15)=\"*\"),\"ff\",IF(BX15>BX28,\"t\",IF(BX15<BX28,\"u\",\"g\"))))","v":"g"},{"$f":"IF(OR(ISERROR(FIND(\"-\",Y15)),AK15>'export html'!$AR$7),\"\",IF(AND(LEFT(Y15)=\"*\",RIGHT(Y15)=\"*\"),\"ff\",IF(BY15>BY28,\"t\",IF(BY15<BY28,\"u\",\"g\"))))","v":""},{"$f":"IF(OR(ISERROR(FIND(\"-\",Z15)),AL15>'export html'!$AR$7),\"\",IF(AND(LEFT(Z15)=\"*\",RIGHT(Z15)=\"*\"),\"ff\",IF(BZ15>BZ28,\"t\",IF(BZ15<BZ28,\"u\",\"g\"))))","v":"u"},null,{"$f":"IF(OR(ISERROR(FIND(\"-\",AB15)),AN15>'export html'!$AR$7),\"\",IF(AND(LEFT(AB15)=\"*\",RIGHT(AB15)=\"*\"),\"ff\",IF(CB15>CB28,\"t\",IF(CB15<CB28,\"u\",\"g\"))))","v":"u"},11,{"$f":"IF(OR(ISERROR(FIND(\"-\",Q15)),AC15<='export html'!$AR$7),\"\",IF(AND(LEFT(Q15)=\"*\",RIGHT(Q15)=\"*\"),\"ff\",IF(CD15>CD28,\"t\",IF(CD15<CD28,\"u\",\"g\"))))","v":""},{"$f":"IF(OR(ISERROR(FIND(\"-\",R15)),AD15<='export html'!$AR$7),\"\",IF(AND(LEFT(R15)=\"*\",RIGHT(R15)=\"*\"),\"ff\",IF(CE15>CE28,\"t\",IF(CE15<CE28,\"u\",\"g\"))))","v":""},{"$f":"IF(OR(ISERROR(FIND(\"-\",S15)),AE15<='export html'!$AR$7),\"\",IF(AND(LEFT(S15)=\"*\",RIGHT(S15)=\"*\"),\"ff\",IF(CF15>CF28,\"t\",IF(CF15<CF28,\"u\",\"g\"))))","v":""},{"$f":"IF(OR(ISERROR(FIND(\"-\",T15)),AF15<='export html'!$AR$7),\"\",IF(AND(LEFT(T15)=\"*\",RIGHT(T15)=\"*\"),\"ff\",IF(CG15>CG28,\"t\",IF(CG15<CG28,\"u\",\"g\"))))","v":"g"},{"$f":"IF(OR(ISERROR(FIND(\"-\",U15)),AG15<='export html'!$AR$7),\"\",IF(AND(LEFT(U15)=\"*\",RIGHT(U15)=\"*\"),\"ff\",IF(CH15>CH28,\"t\",IF(CH15<CH28,\"u\",\"g\"))))","v":"u"},{"$f":"IF(OR(ISERROR(FIND(\"-\",V15)),AH15<='export html'!$AR$7),\"\",IF(AND(LEFT(V15)=\"*\",RIGHT(V15)=\"*\"),\"ff\",IF(CI15>CI28,\"t\",IF(CI15<CI28,\"u\",\"g\"))))","v":""},{"$f":"IF(OR(ISERROR(FIND(\"-\",W15)),AI15<='export html'!$AR$7),\"\",IF(AND(LEFT(W15)=\"*\",RIGHT(W15)=\"*\"),\"ff\",IF(CJ15>CJ28,\"t\",IF(CJ15<CJ28,\"u\",\"g\"))))","v":"g"},{"$f":"IF(OR(ISERROR(FIND(\"-\",X15)),AJ15<='export html'!$AR$7),\"\",IF(AND(LEFT(X15)=\"*\",RIGHT(X15)=\"*\"),\"ff\",IF(CK15>CK28,\"t\",IF(CK15<CK28,\"u\",\"g\"))))","v":""},{"$f":"IF(OR(ISERROR(FIND(\"-\",Y15)),AK15<='export html'!$AR$7),\"\",IF(AND(LEFT(Y15)=\"*\",RIGHT(Y15)=\"*\"),\"ff\",IF(CL15>CL28,\"t\",IF(CL15<CL28,\"u\",\"g\"))))","v":""},{"$f":"IF(OR(ISERROR(FIND(\"-\",Z15)),AL15<='export html'!$AR$7),\"\",IF(AND(LEFT(Z15)=\"*\",RIGHT(Z15)=\"*\"),\"ff\",IF(CM15>CM28,\"t\",IF(CM15<CM28,\"u\",\"g\"))))","v":""},null,{"$f":"IF(OR(ISERROR(FIND(\"-\",AB15)),AN15<='export html'!$AR$7),\"\",IF(AND(LEFT(AB15)=\"*\",RIGHT(AB15)=\"*\"),\"ff\",IF(CO15>CO28,\"t\",IF(CO15<CO28,\"u\",\"g\"))))","v":""},11]
[null,null,null,null,null,null,null,null,null,null,null,null,null,null,null,null,null,null,null,null,null,null,null,null,null,null,null,null,null,null,null,null,null,null,null,null,null,null,null,null,null,null,null,null,null,null,null,null,null,null,null,null,null,null,null,null,null,null,null,null,null,null,null,null,null,null,null,12,{"$f":"IF(OR(ISERROR(FIND(\"-\",Q16)),AC16>'export html'!$AR$7),\"\",IF(AND(LEFT(Q16)=\"*\",RIGHT(Q16)=\"*\"),\"ff\",IF(BQ16>BQ29,\"t\",IF(BQ16<BQ29,\"u\",\"g\"))))","v":""},{"$f":"IF(OR(ISERROR(FIND(\"-\",R16)),AD16>'export html'!$AR$7),\"\",IF(AND(LEFT(R16)=\"*\",RIGHT(R16)=\"*\"),\"ff\",IF(BR16>BR29,\"t\",IF(BR16<BR29,\"u\",\"g\"))))","v":"t"},{"$f":"IF(OR(ISERROR(FIND(\"-\",S16)),AE16>'export html'!$AR$7),\"\",IF(AND(LEFT(S16)=\"*\",RIGHT(S16)=\"*\"),\"ff\",IF(BS16>BS29,\"t\",IF(BS16<BS29,\"u\",\"g\"))))","v":""},{"$f":"IF(OR(ISERROR(FIND(\"-\",T16)),AF16>'export html'!$AR$7),\"\",IF(AND(LEFT(T16)=\"*\",RIGHT(T16)=\"*\"),\"ff\",IF(BT16>BT29,\"t\",IF(BT16<BT29,\"u\",\"g\"))))","v":""},{"$f":"IF(OR(ISERROR(FIND(\"-\",U16)),AG16>'export html'!$AR$7),\"\",IF(AND(LEFT(U16)=\"*\",RIGHT(U16)=\"*\"),\"ff\",IF(BU16>BU29,\"t\",IF(BU16<BU29,\"u\",\"g\"))))","v":""},{"$f":"IF(OR(ISERROR(FIND(\"-\",V16)),AH16>'export html'!$AR$7),\"\",IF(AND(LEFT(V16)=\"*\",RIGHT(V16)=\"*\"),\"ff\",IF(BV16>BV29,\"t\",IF(BV16<BV29,\"u\",\"g\"))))","v":"t"},{"$f":"IF(OR(ISERROR(FIND(\"-\",W16)),AI16>'export html'!$AR$7),\"\",IF(AND(LEFT(W16)=\"*\",RIGHT(W16)=\"*\"),\"ff\",IF(BW16>BW29,\"t\",IF(BW16<BW29,\"u\",\"g\"))))","v":"t"},{"$f":"IF(OR(ISERROR(FIND(\"-\",X16)),AJ16>'export html'!$AR$7),\"\",IF(AND(LEFT(X16)=\"*\",RIGHT(X16)=\"*\"),\"ff\",IF(BX16>BX29,\"t\",IF(BX16<BX29,\"u\",\"g\"))))","v":"t"},{"$f":"IF(OR(ISERROR(FIND(\"-\",Y16)),AK16>'export html'!$AR$7),\"\",IF(AND(LEFT(Y16)=\"*\",RIGHT(Y16)=\"*\"),\"ff\",IF(BY16>BY29,\"t\",IF(BY16<BY29,\"u\",\"g\"))))","v":""},{"$f":"IF(OR(ISERROR(FIND(\"-\",Z16)),AL16>'export html'!$AR$7),\"\",IF(AND(LEFT(Z16)=\"*\",RIGHT(Z16)=\"*\"),\"ff\",IF(BZ16>BZ29,\"t\",IF(BZ16<BZ29,\"u\",\"g\"))))","v":"g"},{"$f":"IF(OR(ISERROR(FIND(\"-\",AA16)),AM16>'export html'!$AR$7),\"\",IF(AND(LEFT(AA16)=\"*\",RIGHT(AA16)=\"*\"),\"ff\",IF(CA16>CA29,\"t\",IF(CA16<CA29,\"u\",\"g\"))))","v":""},null,12,{"$f":"IF(OR(ISERROR(FIND(\"-\",Q16)),AC16<='export html'!$AR$7),\"\",IF(AND(LEFT(Q16)=\"*\",RIGHT(Q16)=\"*\"),\"ff\",IF(CD16>CD29,\"t\",IF(CD16<CD29,\"u\",\"g\"))))","v":"t"},{"$f":"IF(OR(ISERROR(FIND(\"-\",R16)),AD16<='export html'!$AR$7),\"\",IF(AND(LEFT(R16)=\"*\",RIGHT(R16)=\"*\"),\"ff\",IF(CE16>CE29,\"t\",IF(CE16<CE29,\"u\",\"g\"))))","v":""},{"$f":"IF(OR(ISERROR(FIND(\"-\",S16)),AE16<='export html'!$AR$7),\"\",IF(AND(LEFT(S16)=\"*\",RIGHT(S16)=\"*\"),\"ff\",IF(CF16>CF29,\"t\",IF(CF16<CF29,\"u\",\"g\"))))","v":""},{"$f":"IF(OR(ISERROR(FIND(\"-\",T16)),AF16<='export html'!$AR$7),\"\",IF(AND(LEFT(T16)=\"*\",RIGHT(T16)=\"*\"),\"ff\",IF(CG16>CG29,\"t\",IF(CG16<CG29,\"u\",\"g\"))))","v":""},{"$f":"IF(OR(ISERROR(FIND(\"-\",U16)),AG16<='export html'!$AR$7),\"\",IF(AND(LEFT(U16)=\"*\",RIGHT(U16)=\"*\"),\"ff\",IF(CH16>CH29,\"t\",IF(CH16<CH29,\"u\",\"g\"))))","v":"u"},{"$f":"IF(OR(ISERROR(FIND(\"-\",V16)),AH16<='export html'!$AR$7),\"\",IF(AND(LEFT(V16)=\"*\",RIGHT(V16)=\"*\"),\"ff\",IF(CI16>CI29,\"t\",IF(CI16<CI29,\"u\",\"g\"))))","v":""},{"$f":"IF(OR(ISERROR(FIND(\"-\",W16)),AI16<='export html'!$AR$7),\"\",IF(AND(LEFT(W16)=\"*\",RIGHT(W16)=\"*\"),\"ff\",IF(CJ16>CJ29,\"t\",IF(CJ16<CJ29,\"u\",\"g\"))))","v":""},{"$f":"IF(OR(ISERROR(FIND(\"-\",X16)),AJ16<='export html'!$AR$7),\"\",IF(AND(LEFT(X16)=\"*\",RIGHT(X16)=\"*\"),\"ff\",IF(CK16>CK29,\"t\",IF(CK16<CK29,\"u\",\"g\"))))","v":""},{"$f":"IF(OR(ISERROR(FIND(\"-\",Y16)),AK16<='export html'!$AR$7),\"\",IF(AND(LEFT(Y16)=\"*\",RIGHT(Y16)=\"*\"),\"ff\",IF(CL16>CL29,\"t\",IF(CL16<CL29,\"u\",\"g\"))))","v":"g"},{"$f":"IF(OR(ISERROR(FIND(\"-\",Z16)),AL16<='export html'!$AR$7),\"\",IF(AND(LEFT(Z16)=\"*\",RIGHT(Z16)=\"*\"),\"ff\",IF(CM16>CM29,\"t\",IF(CM16<CM29,\"u\",\"g\"))))","v":""},{"$f":"IF(OR(ISERROR(FIND(\"-\",AA16)),AM16<='export html'!$AR$7),\"\",IF(AND(LEFT(AA16)=\"*\",RIGHT(AA16)=\"*\"),\"ff\",IF(CN16>CN29,\"t\",IF(CN16<CN29,\"u\",\"g\"))))","v":""},null,12]
[null,null,null,null,null,null,null,null,null,null,null,null,null,null,null,null,null,null,null,null,null,null,null,null,null,null,null,null,null,null,null,null,null,null,null,null,null,null,null,null,null,null,null,null,null,null,null,null,null,null,null,null,null,null,null,null,null,null,null,null,null,null,null,null,null,null,null,null,1,2,3,4,5,6,7,8,9,10,11,12,null,1,2,3,4,5,6,7,8,9,10,11,12]

{"sheet":"kalender","index":1,"n_rows":39,"n_cols":7,"rows_kept":39,"cut":false,"hidden":false,"merged":[]}
[]
[null,"Spd.","Datum","Thuisploeg",null,"Uitploeg","Uitslag"]
["Competitie",{"$f":"IF(LEN('export html'!BF3),'export html'!BF3,\"\")","v":1},{"$f":"IF(LEN('export html'!BE3),'export html'!BE3,\"\")","v":"2023-09-03"},{"$f":"IF(LEN('export html'!BI3),'export html'!BI3,\"\")","v":"Pouma United"},{"$f":"IF(LEN('export html'!BI3),\"-\",\"\")","v":"-"},{"$f":"IF(LEN('export html'!BJ3),'export html'!BJ3,\"\")","v":"Lucyvo"},{"$f":"IF(LEN('export html'!BH3),'export html'!BH3,\"\")","v":"3-2"}]
[null,{"$f":"IF(LEN('export html'!BF4),'export html'!BF4,\"\")","v":2},{"$f":"IF(LEN('export html'!BE4),'export html'!BE4,\"\")","v":"2023-09-10"},{"$f":"IF(LEN('export html'!BI4),'export html'!BI4,\"\")","v":"Lucyvo"},{"$f":"IF(LEN('export html'!BI4),\"-\",\"\")","v":"-"},{"$f":"IF(LEN('export html'!BJ4),'export html'!BJ4,\"\")","v":"Paradeske"},{"$f":"IF(LEN('export html'!BH4),'export html'!BH4,\"\")","v":"3-6"}]
[null,{"$f":"IF(LEN('export html'!BF5),'export html'!BF5,\"\")","v":3},{"$f":"IF(LEN('export html'!BE5),'export html'!BE5,\"\")","v":"2023-09-17"},{"$f":"IF(LEN('export html'!BI5),'export html'!BI5,\"\")","v":"De Vrede"},{"$f":"IF(LEN('export html'!BI5),\"-\",\"\")","v":"-"},{"$f":"IF(LEN('export html'!BJ5),'export html'!BJ5,\"\")","v":"Lucyvo"},{"$f":"IF(LEN('export html'!BH5),'export html'!BH5,\"\")","v":"4-1"}]
[null,{"$f":"IF(LEN('export html'!BF6),'export html'!BF6,\"\")","v":4},{"$f":"IF(LEN('export html'!BE6),'export html'!BE6,\"\")","v":"2023-09-24"},{"$f":"IF(LEN('export html'!BI6),'export html'!BI6,\"\")","v":"Lucyvo"},{"$f":"IF(LEN('export html'!BI6),\"-\",\"\")","v":"-"},{"$f":"IF(LEN('export html'!BJ6),'export html'!BJ6,\"\")","v":"Bariton"},{"$f":"IF(LEN('export html'!BH6),'export html'!BH6,\"\")","v":"2-1"}]
[null,{"$f":"IF(LEN('export html'!BF7),'export html'!BF7,\"\")","v":5},{"$f":"IF(LEN('export html'!BE7),'export html'!BE7,\"\")","v":"2023-10-01"},{"$f":"IF(LEN('export html'!BI7),'export html'!BI7,\"\")","v":"Racing Emblem"},{"$f":"IF(LEN('export html'!BI7),\"-\",\"\")","v":"-"},{"$f":"IF(LEN('export html'!BJ7),'export html'!BJ7,\"\")","v":"Lucyvo"},{"$f":"IF(LEN('export html'!BH7),'export html'!BH7,\"\")","v":"3-3"}]
[null,{"$f":"IF(LEN('export html'!BF8),'export html'!BF8,\"\")","v":6},{"$f":"IF(LEN('export html'!BE8),'export html'!BE8,\"\")","v":"2023-10-08"},{"$f":"IF(LEN('export html'!BI8),'export html'!BI8,\"\")","v":"Lucyvo"},{"$f":"IF(LEN('export html'!BI8),\"-\",\"\")","v":"-"},{"$f":"IF(LEN('export html'!BJ8),'export html'!BJ8,\"\")","v":"Jolika"},{"$f":"IF(LEN('export html'!BH8),'export html'!BH8,\"\")","v":"4-0"}]
[null,{"$f":"IF(LEN('export html'!BF9),'export html'!BF9,\"\")","v":7},{"$f":"IF(LEN('export html'!BE9),'export html'!BE9,\"\")","v":"2023-10-15"},{"$f":"IF(LEN('export html'!BI9),'export html'!BI9,\"\")","v":"Boerenbond"},{"$f":"IF(LEN('export html'!BI9),\"-\",\"\")","v":"-"},{"$f":"IF(LEN('export html'!BJ9),'export html'!BJ9,\"\")","v":"Lucyvo"},{"$f":"IF(LEN('export html'!BH9),'export html'!BH9,\"\")","v":"3-0"}]
[null,{"$f":"IF(LEN('export html'!BF10),'export html'!BF10,\"\")","v":9},{"$f":"IF(LEN('export html'!BE10),'export html'!BE10,\"\")","v":"2023-10-29"},{"$f":"IF(LEN('export html'!BI10),'export html'!BI10,\"\")","v":"Goka"},{"$f":"IF(LEN('export html'!BI10),\"-\",\"\")","v":"-"},{"$f":"IF(LEN('export html'!BJ10),'export html'!BJ10,\"\")","v":"Lucyvo"},{"$f":"IF(LEN('export html'!BH10),'export html'!BH10,\"\")","v":"4-2"}]
[null,{"$f":"IF(LEN('export html'!BF11),'export html'!BF11,\"\")","v":10},{"$f":"IF(LEN('export html'!BE11),'export html'!BE11,\"\")","v":"2023-11-05"},{"$f":"IF(LEN('export html'!BI11),'export html'!BI11,\"\")","v":"Lucyvo"},{"$f":"IF(LEN('export html'!BI11),\"-\",\"\")","v":"-"},{"$f":"IF(LEN('export html'!BJ11),'export html'!BJ11,\"\")","v":"Hombeek"},{"$f":"IF(LEN('export html'!BH11),'export html'!BH11,\"\")","v":"2-1"}]
[null,{"$f":"IF(LEN('export html'!BF12),'export html'!BF12,\"\")","v":11},{"$f":"IF(LEN('export html'!BE12),'export html'!BE12,\"\")","v":"2023-11-12"},{"$f":"IF(LEN('export html'!BI12),'export html'!BI12,\"\")","v":"Hoje"},{"$f":"IF(LEN('export html'!BI12),\"-\",\"\")","v":"-"},{"$f":"IF(LEN('export html'!BJ12),'export html'!BJ12,\"\")","v":"Lucyvo"},{"$f":"IF(LEN('export html'!BH12),'export html'!BH12,\"\")","v":"3-2"}]
[null,{"$f":"IF(LEN('export html'!BF13),'export html'!BF13,\"\")","v":12},{"$f":"IF(LEN('export html'!BE13),'export html'!BE13,\"\")","v":"2023-11-19"},{"$f":"IF(LEN('export html'!BI13),'export html'!BI13,\"\")","v":"Antverpia 98"},{"$f":"IF(LEN('export html'!BI13),\"-\",\"\")","v":"-"},{"$f":"IF(LEN('export html'!BJ13),'export html'!BJ13,\"\")","v":"Lucyvo"},{"$f":"IF(LEN('export html'!BH13),'export html'!BH13,\"\")","v":"5-5"}]
[null,{"$f":"IF(LEN('export html'!BF14),'export html'!BF14,\"\")","v":14},{"$f":"IF(LEN('export html'!BE14),'export html'!BE14,\"\")","v":"2023-12-03"},{"$f":"IF(LEN('export html'!BI14),'export html'!BI14,\"\")","v":"Lucyvo"},{"$f":"IF(LEN('export html'!BI14),\"-\",\"\")","v":"-"},{"$f":"IF(LEN('export html'!BJ14),'export html'!BJ14,\"\")","v":"Pouma United"},{"$f":"IF(LEN('export html'!BH14),'export html'!BH14,\"\")","v":"4-4"}]
[null,{"$f":"IF(LEN('export html'!BF15),'export html'!BF15,\"\")","v":15},{"$f":"IF(LEN('export html'!BE15),'export html'!BE15,\"\")","v":"2024-01-14"},{"$f":"IF(LEN('export html'!BI15),'export html'!BI15,\"\")","v":"Paradeske"},{"$f":"IF(LEN('export html'!BI15),\"-\",\"\")","v":"-"},{"$f":"IF(LEN('export html'!BJ15),'export html'!BJ15,\"\")","v":"Lucyvo"},{"$f":"IF(LEN('export html'!BH15),'export html'!BH15,\"\")","v":"4-1"}]
[null,{"$f":"IF(LEN('export html'!BF16),'export html'!BF16,\"\")","v":17},{"$f":"IF(LEN('export html'!BE16),'export html'!BE16,\"\")","v":"2024-01-28"},{"$f":"IF(LEN('export html'!BI16),'export html'!BI16,\"\")","v":"Bariton"},{"$f":"IF(LEN('export html'!BI16),\"-\",\"\")","v":"-"},{"$f":"IF(LEN('export html'!BJ16),'export html'!BJ16,\"\")","v":"Lucyvo"},{"$f":"IF(LEN('export html'!BH16),'export html'!BH16,\"\")","v":"8-1"}]
[null,{"$f":"IF(LEN('export html'!BF17),'export html'!BF17,\"\")","v":18},{"$f":"IF(LEN('export html'!BE17),'export html'!BE17,\"\")","v":"2024-02-04"},{"$f":"IF(LEN('export html'!BI17),'export html'!BI17,\"\")","v":"Lucyvo"},{"$f":"IF(LEN('export html'!BI17),\"-\",\"\")","v":"-"},{"$f":"IF(LEN('export html'!BJ17),'export html'!BJ17,\"\")","v":"Racing Emblem"},{"$f":"IF(LEN('export html'!BH17),'export html'!BH17,\"\")","v":"3-5"}]
[null,{"$f":"IF(LEN('export html'!BF18),'export html'!BF18,\"\")","v":16},{"$f":"IF(LEN('export html'!BE18),'export html'!BE18,\"\")","v":"2024-02-11"},{"$f":"IF(LEN('export html'!BI18),'export html'!BI18,\"\")","v":"Lucyvo"},{"$f":"IF(LEN('export html'!BI18),\"-\",\"\")","v":"-"},{"$f":"IF(LEN('export html'!BJ18),'export html'!BJ18,\"\")","v":"De Vrede"},{"$f":"IF(LEN('export html'!BH18),'export html'!BH18,\"\")","v":"6-5"}]
[null,{"$f":"IF(LEN('export html'!BF19),'export html'!BF19,\"\")","v":19},{"$f":"IF(LEN('export html'!BE19),'export html'!BE19,\"\")","v":"2024-02-18"},{"$f":"IF(LEN('export html'!BI19),'export html'!BI19,\"\")","v":"Jolika"},{"$f":"IF(LEN('export html'!BI19),\"-\",\"\")","v":"-"},{"$f":"IF(LEN('export html'!BJ19),'export html'!BJ19,\"\")","v":"Lucyvo"},{"$f":"IF(LEN('export html'!BH19),'export html'!BH19,\"\")","v":"1-2"}]
[null,{"$f":"IF(LEN('export html'!BF20),'export html'!BF20,\"\")","v":20},{"$f":"IF(LEN('export html'!BE20),'export html'!BE20,\"\")","v":"2024-02-25"},{"$f":"IF(LEN('export html'!BI20),'export html'!BI20,\"\")","v":"Lucyvo"},{"$f":"IF(LEN('export html'!BI20),\"-\",\"\")","v":"-"},{"$f":"IF(LEN('export html'!BJ20),'export html'!BJ20,\"\")","v":"Boerenbond"},{"$f":"IF(LEN('export html'!BH20),'export html'!BH20,\"\")","v":"2-7"}]
[null,{"$f":"IF(LEN('export html'!BF21),'export html'!BF21,\"\")","v":22},{"$f":"IF(LEN('export html'!BE21),'export html'!BE21,\"\")","v":"2024-03-10"},{"$f":"IF(LEN('export html'!BI21),'export html'!BI21,\"\")","v":"Lucyvo"},{"$f":"IF(LEN('export html'!BI21),\"-\",\"\")","v":"-"},{"$f":"IF(LEN('export html'!BJ21),'export html'!BJ21,\"\")","v":"Goka"},{"$f":"IF(LEN('export html'!BH21),'export html'!BH21,\"\")","v":""}]
[null,{"$f":"IF(LEN('export html'!BF22),'export html'!BF22,\"\")","v":23},{"$f":"IF(LEN('export html'!BE22),'export html'!BE22,\"\")","v":"2024-03-17"},{"$f":"IF(LEN('export html'!BI22),'export html'!BI22,\"\")","v":"Hombeek"},{"$f":"IF(LEN('export html'!BI22),\"-\",\"\")","v":"-"},{"$f":"IF(LEN('export html'!BJ22),'export html'!BJ22,\"\")","v":"Lucyvo"},{"$f":"IF(LEN('export html'!BH22),'export html'!BH22,\"\")","v":""}]
[null,{"$f":"IF(LEN('export html'!BF23),'export html'!BF23,\"\")","v":24},{"$f":"IF(LEN('export html'!BE23),'export html'!BE23,\"\")","v":"2024-03-24"},{"$f":"IF(LEN('export html'!BI23),'export html'!BI23,\"\")","v":"Lucyvo"},{"$f":"IF(LEN('export html'!BI23),\"-\",\"\")","v":"-"},{"$f":"IF(LEN('export html'!BJ23),'export html'!BJ23,\"\")","v":"Hoje"},{"$f":"IF(LEN('export html'!BH23),'export html'!BH23,\"\")","v":""}]
[null,{"$f":"IF(LEN('export html'!BF24),'export html'!BF24,\"\")","v":25},{"$f":"IF(LEN('export html'!BE24),'export html'!BE24,\"\")","v":"2024-04-07"},{"$f":"IF(LEN('export html'!BI24),'export html'!BI24,\"\")","v":"Lucyvo"},{"$f":"IF(LEN('export html'!BI24),\"-\",\"\")","v":"-"},{"$f":"IF(LEN('export html'!BJ24),'export html'!BJ24,\"\")","v":"Antverpia 98"},{"$f":"IF(LEN('export html'!BH24),'export html'!BH24,\"\")","v":""}]
[null,{"$f":"IF(LEN('export html'!BF25),'export html'!BF25,\"\")","v":""},{"$f":"IF(LEN('export html'!BE25),'export html'!BE25,\"\")","v":""},{"$f":"IF(LEN('export html'!BI25),'export html'!BI25,\"\")","v":""},{"$f":"IF(LEN('export html'!BI25),\"-\",\"\")","v":""},{"$f":"IF(LEN('export html'!BJ25),'export html'!BJ25,\"\")","v":""},{"$f":"IF(LEN('export html'!BH25),'export html'!BH25,\"\")","v":""}]
[null,{"$f":"IF(LEN('export html'!BF26),'export html'!BF26,\"\")","v":""},{"$f":"IF(LEN('export html'!BE26),'export html'!BE26,\"\")","v":""},{"$f":"IF(LEN('export html'!BI26),'export html'!BI26,\"\")","v":""},{"$f":"IF(LEN('export html'!BI26),\"-\",\"\")","v":""},{"$f":"IF(LEN('export html'!BJ26),'export html'!BJ26,\"\")","v":""},{"$f":"IF(LEN('export html'!BH26),'export html'!BH26,\"\")","v":""}]
[null,{"$f":"IF(LEN('export html'!BF27),'export html'!BF27,\"\")","v":""},{"$f":"IF(LEN('export html'!BE27),'export html'!BE27,\"\")","v":""},{"$f":"IF(LEN('export html'!BI27),'export html'!BI27,\"\")","v":""},{"$f":"IF(LEN('export html'!BI27),\"-\",\"\")","v":""},{"$f":"IF(LEN('export html'!BJ27),'export html'!BJ27,\"\")","v":""},{"$f":"IF(LEN('export html'!BH27),'export html'!BH27,\"\")","v":""}]
[null,{"$f":"IF(LEN('export html'!BF28),'export html'!BF28,\"\")","v":""},{"$f":"IF(LEN('export html'!BE28),'export html'!BE28,\"\")","v":""},{"$f":"IF(LEN('export html'!BI28),'export html'!BI28,\"\")","v":""},{"$f":"IF(LEN('export html'!BI28),\"-\",\"\")","v":""},{"$f":"IF(LEN('export html'!BJ28),'export html'!BJ28,\"\")","v":""},{"$f":"IF(LEN('export html'!BH28),'export html'!BH28,\"\")","v":""}]
[null,{"$f":"IF(LEN('export html'!BF29),'export html'!BF29,\"\")","v":""},{"$f":"IF(LEN('export html'!BE29),'export html'!BE29,\"\")","v":""},{"$f":"IF(LEN('export html'!BI29),'export html'!BI29,\"\")","v":""},{"$f":"IF(LEN('export html'!BI29),\"-\",\"\")","v":""},{"$f":"IF(LEN('export html'!BJ29),'export html'!BJ29,\"\")","v":""},{"$f":"IF(LEN('export html'!BH29),'export html'!BH29,\"\")","v":""}]
[null,{"$f":"IF(LEN('export html'!BF30),'export html'!BF30,\"\")","v":""},{"$f":"IF(LEN('export html'!BE30),'export html'!BE30,\"\")","v":""},{"$f":"IF(LEN('export html'!BI30),'export html'!BI30,\"\")","v":""},{"$f":"IF(LEN('export html'!BI30),\"-\",\"\")","v":""},{"$f":"IF(LEN('export html'!BJ30),'export html'!BJ30,\"\")","v":""}]
[]
[]
[]
["Oefenmatchen",1,null,null,"-"]
[null,2,null,null,"-"]
[null,3,null,null,"-"]
[null,4,null,null,"-"]
[]
["Beker",1,null,null,"-"]

{"sheet":"export html","index":2,"n_rows":27,"n_cols":62,"rows_kept":27,"cut":false,"hidden":true,"merged":[]}
[{"$f":"MAX(1,COUNTA(A3:A20))","v":5},null,null,null,"hulp: thuis","hulp: uit","hulp: uitslag",null,{"$f":"MAX(1,COUNT(I3:I9))","v":5},null,null,null,"hulp: thuis","hulp: uit","hulp: uitslag",null,null,null,null,{"$f":"MAX(1,COUNT(T3:T20))","v":5},null,"Recentste duels op ","uitslag",null,null,5,null,null,null,null,null,{"$f":"ROWS(_xlfn.ANCHORARRAY( AF3) )","v":5},null,"Hulp: # goals",null,{"$f":"MAX(1,COUNTA(AJ3:AJ20))","v":1},null,null,null,null,null,{"$f":"RANK(spelersstatistieken!X5,INDIRECT(\"spelersstatistieken!$\" & $AR$8 & \"$5:$\" & $AR$8 & \"$\" & 5+$AR$6-1))+ROW()/10^4","v":10.0001},null,null,null,null,{"$f":"MAX(1,COUNTA(AU3:AU40))","v":1},null,null,null,null,null,null,null,null,null,{"$f":"MAX(1,COUNT(BE3:BE30))","v":22},null,null,null,"hulp: thuis","hulp: uit"]
["Datum","Speeldag",{"$f":"\"Matchen van \" & IF('rooster en stand'!$J$29=0,\"speeldag \" & 'rooster en stand'!$F$29,TEXT('rooster en stand'!$J$29,\"dd/mm/jjjj\"))","v":"Matchen van speeldag 20"},"Uitslag",null,null,null,null,"Datum","Speeldag",{"$f":"\"Matchen van \" & IF('rooster en stand'!$J$29=0,\"speeldag \" & 'rooster en stand'!$F$29+1,TEXT('rooster en stand'!$J$29+'rooster en stand'!$K$29,\"dd/mm/jjjj\"))","v":"Matchen van speeldag 21"},"Uitslag / Plaatsen",null,null,null,null,null,null,null,"Datum","Speeldag",{"$f":"V1 & TEXT('rooster en stand'!$F$19,\"dd/mm/yyyy\")","v":"Recentste duels op 27/02/2024"},null,null,null,"Top-5","Assists",null,null,null,null,"Top-5","Goals",null,null,"Ronde","Datum","Uur","Match","Uitslag",null,{"$f":"RANK(spelersstatistieken!X6,INDIRECT(\"spelersstatistieken!$\" & $AR$8 & \"$5:$\" & $AR$8 & \"$\" & 5+$AR$6-1))+ROW()/10^4","v":10.0002},null,1,"berekening stand",null,"Jaar",{"$f":"\"Uit het verleden...\" & IF(COUNTA(#REF!)>0,\" (\" & AU1 & \"x)\",\"\")","v":"Uit het verleden... (1x)"},"Uitslag","Datum","Speeldag",null,null,null,null,null,"Datum","Speeldag","Kalender","Uitslag"]
["2024-02-25",20,"Hombeek - Goka",{"$f":"IF(G3=0,\"\",G3)","v":"4-1"},"Hombeek","Goka","4-1",null,"2024-03-03",21,"Antverpia 98 - Hombeek",{"$f":"IF(O3=0,\"nr. \" & MATCH($M3,'rooster en stand'!$D$5:$D$16,0) & \" - nr. \" & MATCH($N3,'rooster en stand'!$D$5:$D$16,0),O3)","v":"nr. 5 - nr. 4"},"Antverpia 98","Hombeek",null,null,null,null,null,"2024-02-25",20,"Lucyvo - Boerenbond","2-7",null,{"$f":"_xlfn.SEQUENCE(Z1)","v":1},{"$f":"_xlfn.ANCHORARRAY(spelersstatistieken!AG101)","v":"Stijn Hofmans"},11,null,null,null,{"$f":"_xlfn.SEQUENCE(AF1)","v":1},{"$f":"_xlfn.ANCHORARRAY(spelersstatistieken!AG51)","v":"Stijn Hofmans"},12,null,null,"Ronde 1",null,null,null,null,null,{"$f":"RANK(spelersstatistieken!X7,INDIRECT(\"spelersstatistieken!$\" & $AR$8 & \"$5:$\" & $AR$8 & \"$\" & 5+$AR$6-1))+ROW()/10^4","v":10.000299999999999},null,"00:00:00","VO kleurtje speeldag",null,null,"Geen wedstrijden voor LUCYVO",null,null,null,null,null,null,null,null,"2023-09-03",1,"Pouma United - Lucyvo","3-2","Pouma United","Lucyvo"]
["2024-02-25",20,"Lucyvo - Boerenbond",{"$f":"IF(G4=0,\"\",G4)","v":"2-7"},"Lucyvo","Boerenbond","2-7",null,"2024-03-03",21,"Bariton - De Vrede",{"$f":"IF(O4=0,\"nr. \" & MATCH($M4,'rooster en stand'!$D$5:$D$16,0) & \" - nr. \" & MATCH($N4,'rooster en stand'!$D$5:$D$16,0),O4)","v":"nr. 8 - nr. 6"},"Bariton","De Vrede",null,null,null,null,null,"2024-02-18",19,"Jolika - Lucyvo","1-2",null,2,"Steven De Groof",5,null,null,null,2,"Glenn De Vinster",11,null,null,null,null,null,null,null,null,{"$f":"RANK(spelersstatistieken!X8,INDIRECT(\"spelersstatistieken!$\" & $AR$8 & \"$5:$\" & $AR$8 & \"$\" & 5+$AR$6-1))+ROW()/10^4","v":10.000400000000001},null,{"$f":"COUNTA( 'rooster en stand'!BC5:BC16 )","v":12},"aantal ploegen",null,null,null,null,null,null,null,null,null,null,null,"2023-09-10",2,"Lucyvo - Paradeske","3-6","Lucyvo","Paradeske"]
["2024-02-25",20,"Paradeske - Bariton","","Paradeske","Bariton",null,null,"2024-03-03",21,"Goka - Hoje",{"$f":"IF(O5=0,\"nr. \" & MATCH($M5,'rooster en stand'!$D$5:$D$16,0) & \" - nr. \" & MATCH($N5,'rooster en stand'!$D$5:$D$16,0),O5)","v":"nr. 7 - nr. 1"},"Goka","Hoje",null,null,null,null,null,"2024-02-11",16,"Lucyvo - De Vrede","6-5",null,3,"Glenn De Vinster",5,null,null,null,3,"Maarten De Groof",6,null,null,null,null,null,null,null,null,{"$f":"RANK(spelersstatistieken!X9,INDIRECT(\"spelersstatistieken!$\" & $AR$8 & \"$5:$\" & $AR$8 & \"$\" & 5+$AR$6-1))+ROW()/10^4","v":10.000500000000001},null,{"$f":"2 * ( AR4 - 1 )","v":22},"aantal matchen / ploeg",null,null,null,null,null,null,null,null,null,null,null,"2023-09-17",3,"De Vrede - Lucyvo","4-1","De Vrede","Lucyvo"]
["2024-02-25",20,"Pouma United - Racing Emblem","2-2","Pouma United","Racing Emblem","2-2",null,"2024-03-03",21,"Jolika - Pouma United",{"$f":"IF(O6=0,\"nr. \" & MATCH($M6,'rooster en stand'!$D$5:$D$16,0) & \" - nr. \" & MATCH($N6,'rooster en stand'!$D$5:$D$16,0),O6)","v":"nr. 12 - nr. 2"},"Jolika","Pouma United",null,null,null,null,null,"2024-02-04",18,"Lucyvo - Racing Emblem","3-5",null,4,"Stijn Verdickt",4,null,null,null,4,"Jason Vermeylen",6,null,null,null,null,null,null,null,null,{"$f":"RANK(spelersstatistieken!X10,INDIRECT(\"spelersstatistieken!$\" & $AR$8 & \"$5:$\" & $AR$8 & \"$\" & 5+$AR$6-1))+ROW()/10^4","v":10.0006},null,25,"aantal spelers",null,null,null,null,null,null,null,null,null,null,null,"2023-09-24",4,"Lucyvo - Bariton","2-1","Lucyvo","Bariton"]
["2024-02-25",20,"De Vrede - Antverpia 98","5-0","De Vrede","Antverpia 98","5-0",null,"2024-03-03",21,"Racing Emblem - Paradeske",{"$f":"IF(O7=0,\"nr. \" & MATCH($M7,'rooster en stand'!$D$5:$D$16,0) & \" - nr. \" & MATCH($N7,'rooster en stand'!$D$5:$D$16,0),O7)","v":"nr. 11 - nr. 10"},"Racing Emblem","Paradeske",null,null,null,null,null,"2024-01-28",17,"Bariton - Lucyvo","8-1",null,5,"Ive Celis",3,null,null,null,5,"Steven De Groof",4,null,null,null,null,null,null,null,null,{"$f":"RANK(spelersstatistieken!X11,INDIRECT(\"spelersstatistieken!$\" & $AR$8 & \"$5:$\" & $AR$8 & \"$\" & 5+$AR$6-1))+ROW()/10^4","v":10.0007},null,{"$f":"MatchenPerPloeg / 2 + ( ISODD( AR4 ))","v":11},"speeldagen in heenronde",null,null,null,null,null,null,null,null,null,null,null,"2023-10-01",5,"Racing Emblem - Lucyvo","3-3","Racing Emblem","Lucyvo"]
[null,null,null,"",null,null,null,null,null,null,null,null,null,null,null,null,null,null,null,null,null,null,null,null,null,null,null,null,null,null,null,null,null,null,null,null,null,null,null,null,null,{"$f":"RANK(spelersstatistieken!X12,INDIRECT(\"spelersstatistieken!$\" & $AR$8 & \"$5:$\" & $AR$8 & \"$\" & 5+$AR$6-1))+ROW()/10^4","v":3.0007999999999999},null,{"$f":"SUBSTITUTE( SUBSTITUTE( ADDRESS( 1, 1 + MatchenPerPloeg + 1 ), 1, \"\" ), \"$\", \"\" )","v":"X"},"Kolom van de goal totalen",null,null,null,null,null,null,null,null,null,null,null,"2023-10-08",6,"Lucyvo - Jolika","4-0","Lucyvo","Jolika"]
[null,null,null,null,null,null,null,null,null,null,null,null,null,null,null,null,null,null,null,null,null,null,null,null,null,null,null,null,null,null,null,null,null,null,null,null,null,null,null,null,null,{"$f":"RANK(spelersstatistieken!X13,INDIRECT(\"spelersstatistieken!$\" & $AR$8 & \"$5:$\" & $AR$8 & \"$\" & 5+$AR$6-1))+ROW()/10^4","v":5.0008999999999997},null,null,null,null,null,null,null,null,null,null,null,null,null,null,"2023-10-15",7,"Boerenbond - Lucyvo","3-0","Boerenbond","Lucyvo"]
[null,null,null,null,null,null,null,null,null,null,null,null,null,null,null,null,null,null,null,null,null,null,null,null,null,null,null,null,null,null,null,null,null,null,null,null,null,null,null,null,null,{"$f":"RANK(spelersstatistieken!X14,INDIRECT(\"spelersstatistieken!$\" & $AR$8 & \"$5:$\" & $AR$8 & \"$\" & 5+$AR$6-1))+ROW()/10^4","v":10.000999999999999},null,null,null,null,null,null,null,null,null,null,null,null,null,null,"2023-10-29",9,"Goka - Lucyvo","4-2","Goka","Lucyvo"]
[null,null,null,null,null,null,null,null,null,null,null,null,null,null,null,null,null,null,null,null,null,null,null,null,null,null,null,null,null,null,null,null,null,null,null,null,null,null,null,null,null,{"$f":"RANK(spelersstatistieken!X16,INDIRECT(\"spelersstatistieken!$\" & $AR$8 & \"$5:$\" & $AR$8 & \"$\" & 5+$AR$6-1))+ROW()/10^4","v":10.001099999999999},null,null,null,null,null,null,null,null,null,null,null,null,null,null,"2023-11-05",10,"Lucyvo - Hombeek","2-1","Lucyvo","Hombeek"]
[null,null,null,null,null,null,null,null,null,null,null,null,null,null,null,null,null,null,null,null,null,null,null,null,null,null,null,null,null,null,null,null,null,null,null,null,null,null,null,null,null,{"$f":"RANK(spelersstatistieken!X17,INDIRECT(\"spelersstatistieken!$\" & $AR$8 & \"$5:$\" & $AR$8 & \"$\" & 5+$AR$6-1))+ROW()/10^4","v":10.001200000000001},null,null,null,null,null,null,null,null,null,null,null,null,null,null,"2023-11-12",11,"Hoje - Lucyvo","3-2","Hoje","Lucyvo"]
[null,null,null,null,null,null,null,null,null,null,null,null,null,null,null,null,null,null,null,null,null,null,null,null,null,null,null,null,null,null,null,null,null,null,null,null,null,null,null,null,null,{"$f":"RANK(spelersstatistieken!X18,INDIRECT(\"spelersstatistieken!$\" & $AR$8 & \"$5:$\" & $AR$8 & \"$\" & 5+$AR$6-1))+ROW()/10^4","v":8.0013000000000005},null,null,null,null,null,null,null,null,null,null,null,null,null,null,"2023-11-19",12,"Antverpia 98 - Lucyvo","5-5","Antverpia 98","Lucyvo"]
[null,null,null,null,null,null,null,null,null,null,null,null,null,null,null,null,null,null,null,null,null,null,null,null,null,null,null,null,null,null,null,null,null,null,null,null,null,null,null,null,null,{"$f":"RANK(spelersstatistieken!X19,INDIRECT(\"spelersstatistieken!$\" & $AR$8 & \"$5:$\" & $AR$8 & \"$\" & 5+$AR$6-1))+ROW()/10^4","v":1.0014000000000001},null,null,null,null,null,null,null,null,null,null,null,null,null,null,"2023-12-03",14,"Lucyvo - Pouma United","4-4","Lucyvo","Pouma United"]
[null,null,null,null,null,null,null,null,null,null,null,null,null,null,null,null,null,null,null,null,null,null,null,null,null,null,null,null,null,null,null,null,null,null,null,null,null,null,null,null,null,{"$f":"RANK(spelersstatistieken!X20,INDIRECT(\"spelersstatistieken!$\" & $AR$8 & \"$5:$\" & $AR$8 & \"$\" & 5+$AR$6-1))+ROW()/10^4","v":10.0015},null,null,null,null,null,null,null,null,null,null,null,null,null,null,"2024-01-14",15,"Paradeske - Lucyvo","4-1","Paradeske","Lucyvo"]
[null,null,null,null,null,null,null,null,null,null,null,null,null,null,null,null,null,null,null,null,null,null,null,null,null,null,null,null,null,null,null,null,null,null,null,null,null,null,null,null,null,{"$f":"RANK(spelersstatistieken!X21,INDIRECT(\"spelersstatistieken!$\" & $AR$8 & \"$5:$\" & $AR$8 & \"$\" & 5+$AR$6-1))+ROW()/10^4","v":10.0016},null,null,null,null,null,null,null,null,null,null,null,null,null,null,"2024-01-28",17,"Bariton - Lucyvo","8-1","Bariton","Lucyvo"]
[null,null,null,null,null,null,null,null,null,null,null,null,null,null,null,null,null,null,null,null,null,null,null,null,null,null,null,null,null,null,null,null,null,null,null,null,null,null,null,null,null,{"$f":"RANK(spelersstatistieken!X22,INDIRECT(\"spelersstatistieken!$\" & $AR$8 & \"$5:$\" & $AR$8 & \"$\" & 5+$AR$6-1))+ROW()/10^4","v":10.0017},null,null,null,null,null,null,null,null,null,null,null,null,null,null,"2024-02-04",18,"Lucyvo - Racing Emblem","3-5","Lucyvo","Racing Emblem"]
[null,null,null,null,null,null,null,null,null,null,null,null,null,null,null,null,null,null,null,null,null,null,null,null,null,null,null,null,null,null,null,null,null,null,null,null,null,null,null,null,null,{"$f":"RANK(spelersstatistieken!X23,INDIRECT(\"spelersstatistieken!$\" & $AR$8 & \"$5:$\" & $AR$8 & \"$\" & 5+$AR$6-1))+ROW()/10^4","v":10.001799999999999},null,null,null,null,null,null,null,null,null,null,null,null,null,null,"2024-02-11",16,"Lucyvo - De Vrede","6-5","Lucyvo","De Vrede"]
[null,null,null,null,null,null,null,null,null,null,null,null,null,null,null,null,null,null,null,null,null,null,null,null,null,null,null,null,null,null,null,null,null,null,null,null,null,null,null,null,null,{"$f":"RANK(spelersstatistieken!X24,INDIRECT(\"spelersstatistieken!$\" & $AR$8 & \"$5:$\" & $AR$8 & \"$\" & 5+$AR$6-1))+ROW()/10^4","v":6.0019},null,null,null,null,null,null,null,null,null,null,null,null,null,null,"2024-02-18",19,"Jolika - Lucyvo","1-2","Jolika","Lucyvo"]
[null,null,null,null,null,null,null,null,null,null,null,null,null,null,null,null,null,null,null,null,null,null,null,null,null,null,null,null,null,null,null,null,null,null,null,null,null,null,null,null,null,{"$f":"RANK(spelersstatistieken!X25,INDIRECT(\"spelersstatistieken!$\" & $AR$8 & \"$5:$\" & $AR$8 & \"$\" & 5+$AR$6-1))+ROW()/10^4","v":6.0019999999999998},null,null,null,null,null,null,null,null,null,null,null,null,null,null,"2024-02-25",20,"Lucyvo - Boerenbond","2-7","Lucyvo","Boerenbond"]
[null,null,null,null,null,null,null,null,null,null,null,null,null,null,null,null,null,null,null,null,null,null,null,null,null,null,null,null,null,null,null,null,null,null,null,null,null,null,null,null,null,{"$f":"RANK(spelersstatistieken!X26,INDIRECT(\"spelersstatistieken!$\" & $AR$8 & \"$5:$\" & $AR$8 & \"$\" & 5+$AR$6-1))+ROW()/10^4","v":8.0021000000000004},null,null,null,null,null,null,null,null,null,null,null,null,null,null,"2024-03-10",22,"Lucyvo - Goka",null,"Lucyvo","Goka"]
[null,null,null,null,null,null,null,null,null,null,null,null,null,null,null,null,null,null,null,null,null,null,null,null,null,null,null,null,null,null,null,null,null,null,null,null,null,null,null,null,null,{"$f":"RANK(spelersstatistieken!X27,INDIRECT(\"spelersstatistieken!$\" & $AR$8 & \"$5:$\" & $AR$8 & \"$\" & 5+$AR$6-1))+ROW()/10^4","v":10.0022},null,null,null,null,null,null,null,null,null,null,null,null,null,null,"2024-03-17",23,"Hombeek - Lucyvo",null,"Hombeek","Lucyvo"]
[null,null,null,null,null,null,null,null,null,null,null,null,null,null,null,null,null,null,null,null,null,null,null,null,null,null,null,null,null,null,null,"#IF(OR($AE3#0;$AG3#\"\");\"(Niemand)\";OFFSET(spelersstatistieken!$A$4;MATCH(SMALL(coeffsspelers;AE3);coeffsspelers;0);0))","#IF($AE3#0;\"\";IF(AH3#0;\"\";AH3))","#OFFSET(spelersstatistieken!$A$4;MATCH(SMALL(coeffsspelers;AE3);coeffsspelers;0);MatchenPerPloeg+1)",null,null,null,null,null,null,null,{"$f":"RANK(spelersstatistieken!X28,INDIRECT(\"spelersstatistieken!$\" & $AR$8 & \"$5:$\" & $AR$8 & \"$\" & 5+$AR$6-1))+ROW()/10^4","v":3.0023},null,null,null,null,null,null,null,null,null,null,null,null,null,null,"2024-03-24",24,"Lucyvo - Hoje",null,"Lucyvo","Hoje"]
[null,null,null,null,null,null,null,null,null,null,null,null,null,null,null,null,null,null,null,null,null,null,null,null,null,null,null,null,null,null,null,"#IF(OR($AE4#0;$AG4#\"\");\"\";OFFSET(spelersstatistieken!$A$4;MATCH(SMALL(coeffsspelers;AE4);coeffsspelers;0);0))","#IF($AE4#0;\"\";IF(AH4#0;\"\";AH4))","#OFFSET(spelersstatistieken!$A$4;MATCH(SMALL(coeffsspelers;AE4);coeffsspelers;0);MatchenPerPloeg+1)",null,null,null,null,null,null,null,{"$f":"RANK(spelersstatistieken!X29,INDIRECT(\"spelersstatistieken!$\" & $AR$8 & \"$5:$\" & $AR$8 & \"$\" & 5+$AR$6-1))+ROW()/10^4","v":10.0024},null,null,null,null,null,null,null,null,null,null,null,null,null,null,"2024-04-07",25,"Lucyvo - Antverpia 98",null,"Lucyvo","Antverpia 98"]
[null,null,null,null,null,null,null,null,null,null,null,null,null,null,null,null,null,null,null,null,null,null,null,null,null,null,null,null,null,null,null,"#IF(OR($AE5#0;$AG5#\"\");\"\";OFFSET(spelersstatistieken!$A$4;MATCH(SMALL(coeffsspelers;AE5);coeffsspelers;0);0))","#IF($AE5#0;\"\";IF(AH5#0;\"\";AH5))","#OFFSET(spelersstatistieken!$A$4;MATCH(SMALL(coeffsspelers;AE5);coeffsspelers;0);MatchenPerPloeg+1)",null,null,null,null,null,null,null,{"$f":"RANK(spelersstatistieken!X30,INDIRECT(\"spelersstatistieken!$\" & $AR$8 & \"$5:$\" & $AR$8 & \"$\" & 5+$AR$6-1))+ROW()/10^4","v":10.0025}]
[null,null,null,null,null,null,null,null,null,null,null,null,null,null,null,null,null,null,null,null,null,null,null,null,null,null,null,null,null,null,null,"#IF(OR($AE6#0;$AG6#\"\");\"\";OFFSET(spelersstatistieken!$A$4;MATCH(SMALL(coeffsspelers;AE6);coeffsspelers;0);0))","#IF($AE6#0;\"\";IF(AH6#0;\"\";AH6))","#OFFSET(spelersstatistieken!$A$4;MATCH(SMALL(coeffsspelers;AE6);coeffsspelers;0);MatchenPerPloeg+1)"]
[null,null,null,null,null,null,null,null,null,null,null,null,null,null,null,null,null,null,null,null,null,null,null,null,null,null,null,null,null,null,null,"#IF(OR($AE7#0;$AG7#\"\");\"\";OFFSET(spelersstatistieken!$A$4;MATCH(SMALL(coeffsspelers;AE7);coeffsspelers;0);0))","#IF($AE7#0;\"\";IF(AH7#0;\"\";AH7))","#OFFSET(spelersstatistieken!$A$4;MATCH(SMALL(coeffsspelers;AE7);coeffsspelers;0);MatchenPerPloeg+1)"]

{"sheet":"spelersstatistieken","index":3,"n_rows":329,"n_cols":123,"rows_kept":329,"cut":false,"hidden":false,"merged":[[0,30,3,30],[0,29,3,29],[0,23,3,23],[0,24,3,24],[0,25,3,25],[0,26,3,26],[0,27,3,27],[0,28,3,28]]}
[null,{"$f":"IF(kalender!$D3='rooster en stand'!$C$3,kalender!$F3&\" (T)\",kalender!$D3&\" (U)\")","v":"Pouma United (U)"},{"$f":"IF(kalender!$D4='rooster en stand'!$C$3,kalender!$F4&\" (T)\",kalender!$D4&\" (U)\")","v":"Paradeske (T)"},{"$f":"IF(kalender!$D5='rooster en stand'!$C$3,kalender!$F5&\" (T)\",kalender!$D5&\" (U)\")","v":"De Vrede (U)"},{"$f":"IF(kalender!$D6='rooster en stand'!$C$3,kalender!$F6&\" (T)\",kalender!$D6&\" (U)\")","v":"Bariton (T)"},{"$f":"IF(kalender!$D7='rooster en stand'!$C$3,kalender!$F7&\" (T)\",kalender!$D7&\" (U)\")","v":"Racing Emblem (U)"},{"$f":"IF(kalender!$D8='rooster en stand'!$C$3,kalender!$F8&\" (T)\",kalender!$D8&\" (U)\")","v":"Jolika (T)"},{"$f":"IF(kalender!$D9='rooster en stand'!$C$3,kalender!$F9&\" (T)\",kalender!$D9&\" (U)\")","v":"Boerenbond (U)"},{"$f":"IF(kalender!$D10='rooster en stand'!$C$3,kalender!$F10&\" (T)\",kalender!$D10&\" (U)\")","v":"Goka (U)"},{"$f":"IF(kalender!$D11='rooster en stand'!$C$3,kalender!$F11&\" (T)\",kalender!$D11&\" (U)\")","v":"Hombeek (T)"},{"$f":"IF(kalender!$D12='rooster en stand'!$C$3,kalender!$F12&\" (T)\",kalender!$D12&\" (U)\")","v":"Hoje (U)"},{"$f":"IF(kalender!$D13='rooster en stand'!$C$3,kalender!$F13&\" (T)\",kalender!$D13&\" (U)\")","v":"Antverpia 98 (U)"},{"$f":"IF(kalender!$D14='rooster en stand'!$C$3,kalender!$F14&\" (T)\",kalender!$D14&\" (U)\")","v":"Pouma United (T)"},{"$f":"IF(kalender!$D15='rooster en stand'!$C$3,kalender!$F15&\" (T)\",kalender!$D15&\" (U)\")","v":"Paradeske (U)"},{"$f":"IF(kalender!$D16='rooster en stand'!$C$3,kalender!$F16&\" (T)\",kalender!$D16&\" (U)\")","v":"Bariton (U)"},{"$f":"IF(kalender!$D17='rooster en stand'!$C$3,kalender!$F17&\" (T)\",kalender!$D17&\" (U)\")","v":"Racing Emblem (T)"},{"$f":"IF(kalender!$D18='rooster en stand'!$C$3,kalender!$F18&\" (T)\",kalender!$D18&\" (U)\")","v":"De Vrede (T)"},{"$f":"IF(kalender!$D19='rooster en stand'!$C$3,kalender!$F19&\" (T)\",kalender!$D19&\" (U)\")","v":"Jolika (U)"},{"$f":"IF(kalender!$D20='rooster en stand'!$C$3,kalender!$F20&\" (T)\",kalender!$D20&\" (U)\")","v":"Boerenbond (T)"},{"$f":"IF(kalender!$D21='rooster en stand'!$C$3,kalender!$F21&\" (T)\",kalender!$D21&\" (U)\")","v":"Goka (T)"},{"$f":"IF(kalender!$D22='rooster en stand'!$C$3,kalender!$F22&\" (T)\",kalender!$D22&\" (U)\")","v":"Hombeek (U)"},{"$f":"IF(kalender!$D23='rooster en stand'!$C$3,kalender!$F23&\" (T)\",kalender!$D23&\" (U)\")","v":"Hoje (T)"},{"$f":"IF(kalender!$D24='rooster en stand'!$C$3,kalender!$F24&\" (T)\",kalender!$D24&\" (U)\")","v":"Antverpia 98 (T)"},"Totaal # goals","# matchen","Gem. # goals","Afwezig","Blessure","Schorsing","Niet gespeeld totaal","Keeper",null,null,null,{"$f":"IFERROR( _xlfn.XMATCH( AJ2, B4:W4, 0 ), 0 )","v":18},{"$f":"\"Hint: \" & MAX(B4:W4)","v":"Hint: 20"},null,{"$f":"B1","v":"Pouma United (U)"},"Paradeske (T)","De Vrede (U)","Bariton (T)","Racing Emblem (U)","Jolika (T)","Boerenbond (U)","Goka (U)","Hombeek (T)","Hoje (U)","Antverpia 98 (U)","Pouma United (T)","Paradeske (U)","Bariton (U)","Racing Emblem (T)","De Vrede (T)","Jolika (U)","Boerenbond (T)","Goka (T)","Hombeek (U)","Hoje (T)","Antverpia 98 (T)"]
["Uitslag",{"$f":"kalender!$G3","v":"3-2"},{"$f":"kalender!$G4","v":"3-6"},{"$f":"kalender!$G5","v":"4-1"},{"$f":"kalender!$G6","v":"2-1"},{"$f":"kalender!$G7","v":"3-3"},{"$f":"kalender!$G8","v":"4-0"},{"$f":"kalender!$G9","v":"3-0"},{"$f":"kalender!$G10","v":"4-2"},{"$f":"kalender!$G11","v":"2-1"},{"$f":"kalender!$G12","v":"3-2"},{"$f":"kalender!$G13","v":"5-5"},{"$f":"kalender!$G14","v":"4-4"},{"$f":"kalender!$G15","v":"4-1"},{"$f":"kalender!$G16","v":"8-1"},{"$f":"kalender!$G17","v":"3-5"},{"$f":"kalender!$G18","v":"6-5"},{"$f":"kalender!$G19","v":"1-2"},{"$f":"kalender!$G20","v":"2-7"},{"$f":"kalender!$G21","v":""},{"$f":"kalender!$G22","v":""},{"$f":"kalender!$G23","v":""},{"$f":"kalender!$G24","v":""},null,null,null,null,null,null,null,null,null,null,null,null,20,null,null,null,null,null,null,null,null,null,null,null,null,null,null,null,null,null,null,null,null,null,null,null,null,"P","coeff","coeff aflopend",null,"P","coeff","coeff aflopend",null,"aantal","coeff","coeff aflopend",null,null,null,null,null,null,{"$f":"MAX( 1, BW5:BW29, CD5:CD29 )","v":22},null,null,null,null,null,null,null,null,null,null,null,null,null,null,null,null,{"$f":"MAX( 1, CP5:CP29, CU5:CU29 )","v":16},null,null,null,null,null,null,null,null,null,null,null,null,null,null,null,null,null,null,null,null,null,null,null,null,null,{"$f":"_xlfn.TAKE( _xlfn.SCAN( \"\", _xlfn._xlws.SORT( _xlfn.UNIQUE( _xlfn.TOCOL(_xlfn.ANCHORARRAY( DF5), 2 ))), _xlfn.LAMBDA(_xlpm.a,_xlpm.v, IF( COUNTIF( $CQ$5:$CQ$31, _xlpm.v ) > 0, _xlpm.a, _xlpm.a & \" / \" & _xlpm.v ))), -1 )","v":" / Beirinckx Wout / Celis Ive / Coolsaet Joy / De Groof Maarten / De Groof Steven / De Vinster Glenn / Elst Pieter / Gielis Bernd / Hofmans Stijn / Langenaeker Maarten / Lenaerts Jordy / Van de Vondel Rob / Van Dessel Dieter / Verdickt Stijn / Verlooy Kaïn / Vermeylen Jason"}]
["Aanwezigen",{"$f":"IF(COUNTBLANK(B5:B29)='export html'!$AR$6,\"\",'export html'!$AR$6-COUNTIF(B5:B29,\"a\")-COUNTIF(B5:B29,\"b\")-COUNTIF(B5:B29,\"s\"))","v":16},{"$f":"IF(COUNTBLANK(C5:C29)='export html'!$AR$6,\"\",'export html'!$AR$6-COUNTIF(C5:C29,\"a\")-COUNTIF(C5:C29,\"b\")-COUNTIF(C5:C29,\"s\"))","v":15},{"$f":"IF(COUNTBLANK(D5:D29)='export html'!$AR$6,\"\",'export html'!$AR$6-COUNTIF(D5:D29,\"a\")-COUNTIF(D5:D29,\"b\")-COUNTIF(D5:D29,\"s\"))","v":15},{"$f":"IF(COUNTBLANK(E5:E29)='export html'!$AR$6,\"\",'export html'!$AR$6-COUNTIF(E5:E29,\"a\")-COUNTIF(E5:E29,\"b\")-COUNTIF(E5:E29,\"s\"))","v":15},{"$f":"IF(COUNTBLANK(F5:F29)='export html'!$AR$6,\"\",'export html'!$AR$6-COUNTIF(F5:F29,\"a\")-COUNTIF(F5:F29,\"b\")-COUNTIF(F5:F29,\"s\"))","v":16},{"$f":"IF(COUNTBLANK(G5:G29)='export html'!$AR$6,\"\",'export html'!$AR$6-COUNTIF(G5:G29,\"a\")-COUNTIF(G5:G29,\"b\")-COUNTIF(G5:G29,\"s\"))","v":16},{"$f":"IF(COUNTBLANK(H5:H29)='export html'!$AR$6,\"\",'export html'!$AR$6-COUNTIF(H5:H29,\"a\")-COUNTIF(H5:H29,\"b\")-COUNTIF(H5:H29,\"s\"))","v":13},{"$f":"IF(COUNTBLANK(I5:I29)='export html'!$AR$6,\"\",'export html'!$AR$6-COUNTIF(I5:I29,\"a\")-COUNTIF(I5:I29,\"b\")-COUNTIF(I5:I29,\"s\"))","v":12},{"$f":"IF(COUNTBLANK(J5:J29)='export html'!$AR$6,\"\",'export html'!$AR$6-COUNTIF(J5:J29,\"a\")-COUNTIF(J5:J29,\"b\")-COUNTIF(J5:J29,\"s\"))","v":15},{"$f":"IF(COUNTBLANK(K5:K29)='export html'!$AR$6,\"\",'export html'!$AR$6-COUNTIF(K5:K29,\"a\")-COUNTIF(K5:K29,\"b\")-COUNTIF(K5:K29,\"s\"))","v":15},{"$f":"IF(COUNTBLANK(L5:L29)='export html'!$AR$6,\"\",'export html'!$AR$6-COUNTIF(L5:L29,\"a\")-COUNTIF(L5:L29,\"b\")-COUNTIF(L5:L29,\"s\"))","v":16},{"$f":"IF(COUNTBLANK(M5:M29)='export html'!$AR$6,\"\",'export html'!$AR$6-COUNTIF(M5:M29,\"a\")-COUNTIF(M5:M29,\"b\")-COUNTIF(M5:M29,\"s\"))","v":16},{"$f":"IF(COUNTBLANK(N5:N29)='export html'!$AR$6,\"\",'export html'!$AR$6-COUNTIF(N5:N29,\"a\")-COUNTIF(N5:N29,\"b\")-COUNTIF(N5:N29,\"s\"))","v":13},{"$f":"IF(COUNTBLANK(O5:O29)='export html'!$AR$6,\"\",'export html'!$AR$6-COUNTIF(O5:O29,\"a\")-COUNTIF(O5:O29,\"b\")-COUNTIF(O5:O29,\"s\"))","v":15},{"$f":"IF(COUNTBLANK(P5:P29)='export html'!$AR$6,\"\",'export html'!$AR$6-COUNTIF(P5:P29,\"a\")-COUNTIF(P5:P29,\"b\")-COUNTIF(P5:P29,\"s\"))","v":15},{"$f":"IF(COUNTBLANK(Q5:Q29)='export html'!$AR$6,\"\",'export html'!$AR$6-COUNTIF(Q5:Q29,\"a\")-COUNTIF(Q5:Q29,\"b\")-COUNTIF(Q5:Q29,\"s\"))","v":15},{"$f":"IF(COUNTBLANK(R5:R29)='export html'!$AR$6,\"\",'export html'!$AR$6-COUNTIF(R5:R29,\"a\")-COUNTIF(R5:R29,\"b\")-COUNTIF(R5:R29,\"s\"))","v":13},{"$f":"IF(COUNTBLANK(S5:S29)='export html'!$AR$6,\"\",'export html'!$AR$6-COUNTIF(S5:S29,\"a\")-COUNTIF(S5:S29,\"b\")-COUNTIF(S5:S29,\"s\"))","v":15},{"$f":"IF(COUNTBLANK(T5:T29)='export html'!$AR$6,\"\",'export html'!$AR$6-COUNTIF(T5:T29,\"a\")-COUNTIF(T5:T29,\"b\")-COUNTIF(T5:T29,\"s\"))","v":""},{"$f":"IF(COUNTBLANK(U5:U29)='export html'!$AR$6,\"\",'export html'!$AR$6-COUNTIF(U5:U29,\"a\")-COUNTIF(U5:U29,\"b\")-COUNTIF(U5:U29,\"s\"))","v":""},{"$f":"IF(COUNTBLANK(V5:V29)='export html'!$AR$6,\"\",'export html'!$AR$6-COUNTIF(V5:V29,\"a\")-COUNTIF(V5:V29,\"b\")-COUNTIF(V5:V29,\"s\"))","v":""},{"$f":"IF(COUNTBLANK(W5:W29)='export html'!$AR$6,\"\",'export html'!$AR$6-COUNTIF(W5:W29,\"a\")-COUNTIF(W5:W29,\"b\")-COUNTIF(W5:W29,\"s\"))","v":""},null,null,null,null,null,null,null,null,null,"Match van de Man",null,null,null,null,null,null,null,null,null,null,null,null,null,null,null,null,null,null,null,null,null,null,null,null,null,null,null,"DEZE WEEK",null,null,null,"SEIZOEN",null,null,null,"WEEKOVERWINNINGEN",null,null,null,null,null,null,null,null,null,null,null,null,null,null,null,null,null,null,null,null,null,null,null,null,null,null,null,null,null,null,null,null,null,null,null,null,null,null,null,null,null,null,null,null,null,null,null,null,null,null,null,{"$f":"_xlfn.TEXTJOIN( \"|\",TRUE, _xlfn.DROP( _xlfn.TEXTSPLIT( DQ2, , \" / \" ), 1 ))","v":"Beirinckx Wout|Celis Ive|Coolsaet Joy|De Groof Maarten|De Groof Steven|De Vinster Glenn|Elst Pieter|Gielis Bernd|Hofmans Stijn|Langenaeker Maarten|Lenaerts Jordy|Van de Vondel Rob|Van Dessel Dieter|Verdickt Stijn|Verlooy Kaïn|Vermeylen Jason"}]
["Speeldag",{"$f":"IF(COUNTBLANK(B5:B29)='export html'!$AR$6,\"\",kalender!$B3)","v":1},{"$f":"IF(COUNTBLANK(C5:C29)='export html'!$AR$6,\"\",kalender!$B4)","v":2},{"$f":"IF(COUNTBLANK(D5:D29)='export html'!$AR$6,\"\",kalender!$B5)","v":3},{"$f":"IF(COUNTBLANK(E5:E29)='export html'!$AR$6,\"\",kalender!$B6)","v":4},{"$f":"IF(COUNTBLANK(F5:F29)='export html'!$AR$6,\"\",kalender!$B7)","v":5},{"$f":"IF(COUNTBLANK(G5:G29)='export html'!$AR$6,\"\",kalender!$B8)","v":6},{"$f":"IF(COUNTBLANK(H5:H29)='export html'!$AR$6,\"\",kalender!$B9)","v":7},{"$f":"IF(COUNTBLANK(I5:I29)='export html'!$AR$6,\"\",kalender!$B10)","v":9},{"$f":"IF(COUNTBLANK(J5:J29)='export html'!$AR$6,\"\",kalender!$B11)","v":10},{"$f":"IF(COUNTBLANK(K5:K29)='export html'!$AR$6,\"\",kalender!$B12)","v":11},{"$f":"IF(COUNTBLANK(L5:L29)='export html'!$AR$6,\"\",kalender!$B13)","v":12},{"$f":"IF(COUNTBLANK(M5:M29)='export html'!$AR$6,\"\",kalender!$B14)","v":14},{"$f":"IF(COUNTBLANK(N5:N29)='export html'!$AR$6,\"\",kalender!$B15)","v":15},{"$f":"IF(COUNTBLANK(O5:O29)='export html'!$AR$6,\"\",kalender!$B16)","v":17},{"$f":"IF(COUNTBLANK(P5:P29)='export html'!$AR$6,\"\",kalender!$B17)","v":18},{"$f":"IF(COUNTBLANK(Q5:Q29)='export html'!$AR$6,\"\",kalender!$B18)","v":16},{"$f":"IF(COUNTBLANK(R5:R29)='export html'!$AR$6,\"\",kalender!$B19)","v":19},{"$f":"IF(COUNTBLANK(S5:S29)='export html'!$AR$6,\"\",kalender!$B20)","v":20},{"$f":"IF(COUNTBLANK(T5:T29)='export html'!$AR$6,\"\",kalender!$B21)","v":""},{"$f":"IF(COUNTBLANK(U5:U29)='export html'!$AR$6,\"\",kalender!$B22)","v":""},{"$f":"IF(COUNTBLANK(V5:V29)='export html'!$AR$6,\"\",kalender!$B23)","v":""},{"$f":"IF(COUNTBLANK(W5:W29)='export html'!$AR$6,\"\",kalender!$B24)","v":""},null,null,null,null,null,null,null,null,null,"Speler","Totaal","Plaats",{"$f":"INDEX( B1:W1, 1, MATCH( AJ2, B4:W4, 0 ))","v":"Boerenbond (T)"},"Plaats",null,null,null,null,null,null,null,null,null,null,null,null,null,null,null,null,null,null,null,null,null,null,null,null,null,null,null,null,null,null,null,null,null,null,null,null,null,null,{"$f":"\"Match tegen \" & AJ4","v":"Match tegen Boerenbond (T)"},"Punten -\nGEWOGEN","Punten -\nONGEWOGEN",null,null,null,null,"Seizoenstotaal","Punten -\nGEWOGEN","Punten -\nONGEWOGEN","Matchen",null,null,"HULP 1","HULP 2","HULP 3","HULP 4",null,null,"Weekoverwinningen","Aantal","Matchen",null,null,"Podiumplaatsen","Goud","Zilver","Brons","Totaal","Goud = 3\nZilver = 2\nBrons = 1",null,null,"Ook op het podium:",null,null,"",null,null,"Speler","Plaats 1","Plaats 2","Plaats 3","Totaal","Gewogen som"]
["Beirinckx Jurgen","p","p","p","p","p","p","ng","ng","p","ng",1,"ng","ng","ng","p","p","ng","p",null,null,null,null,{"$f":"SUM( B53:W53 )","v":0},{"$f":"COUNTIF( B5:W5, \"k\" ) + SUM( B5:W5 )","v":1},{"$f":"IFERROR( X5 / COUNT($B$4:$W$4), \"\" )","v":0},{"$f":"COUNTIF( B5:W5, \"a\" )","v":0},{"$f":"COUNTIF( B5:W5, \"b\" )","v":0},{"$f":"COUNTIF( B5:W5, \"s\" )","v":0},{"$f":"COUNTIF( B5:W5, \"ng\" ) + COUNTIF( B5:W5, \"na\" ) + COUNTIF( B5:W5, \"p\" ) + COUNTIF( B5:W5, \"t\" )","v":17},{"$f":"COUNTIF(B5:W5,\"k\")","v":0},null,{"$f":"A5","v":"Beirinckx Jurgen"},{"$f":"IF(SUM(AL5:BG5)=0,\"\",SUM(AL5:BG5))","v":1.1111111111111112},{"$f":"IF(AH5=\"\",\"\",RANK(AH5,AH$5:AH$32))","v":22},{"$f":"_xlfn.LET( _xlpm.i, INDEX($AL5:$BG5,1,MAX(1,MATCH($AJ$2,$B$4:$W$4,0))), IF( _xlpm.i = \"\", \"\", _xlpm.i ))","v":0},{"$f":"IF(AJ5=\"\",\"\",RANK(AJ5,AJ$5:AJ$32))","v":12},{"$f":"B303","v":0},{"$f":"C303","v":0},{"$f":"D303","v":0},{"$f":"E303","v":0},{"$f":"F303","v":0},{"$f":"G303","v":0},{"$f":"H303","v":0},{"$f":"I303","v":0},{"$f":"J303","v":0},{"$f":"K303","v":0},{"$f":"L303","v":0},{"$f":"M303","v":0},{"$f":"N303","v":0},{"$f":"O303","v":1.1111111111111112},{"$f":"P303","v":0},{"$f":"Q303","v":0},{"$f":"R303","v":0},{"$f":"S303","v":0},{"$f":"T303","v":0},{"$f":"U303","v":0},{"$f":"V303","v":0},{"$f":"W303","v":0},null,{"$f":"INDEX($AL5:$BG5,1,MAX(1,MATCH($AJ$2,$B$4:$W$4,0)))","v":0},{"$f":"BI5-BU5/100","v":-0.01},{"$f":"LARGE(BJ$5:BJ$31,BU5)","v":15.184117647058825},null,{"$f":"SUM(AL5:BG5)","v":1.1111111111111112},{"$f":"BM5-BU5/100","v":1.1011111111111112},{"$f":"LARGE(BN$5:BN$31,BU5)","v":187.43627646862942},null,{"$f":"COUNTIF( $AL$36:$BG$36, \"*\" & AG5 & \"*\" )","v":0},{"$f":"1000*BQ5+BM5-BU5/100","v":1.1011111111111112},{"$f":"LARGE(BR$5:BR$31,BU5)","v":5145.6807598937012},null,{"$f":"_xlfn.SEQUENCE(27)","v":1},null,{"$f":"IF(BY5=\"\",\"\",BU5)","v":1},{"$f":"_xlfn.XLOOKUP( CK5, $DR$5:$DR$30, $DS$5:$DS$30, \"\" )","v":"Glenn De Vinster"},{"$f":"IF(INDEX($BI$5:$BI$31,MATCH(BK5,$BJ$5:$BJ$31,0))=0,\"\",INDEX($BI$5:$BI$31,MATCH(BK5,$BJ$5:$BJ$31,0)))","v":15.294117647058824},{"$f":"IF( CK5 = \"\", \"\", _xlfn.XLOOKUP( CK5, $A$253:$A$279, INDEX( $B$253:$W$279, , $AI$1 ), \"\" ))","v":13},null,null,null,{"$f":"IF(CF5=\"\",\"\",BU5)","v":1},{"$f":"_xlfn.XLOOKUP( CL5, $DR$5:$DR$30, $DS$5:$DS$30, \"\" )","v":"Stijn Hofmans"},{"$f":"IF(INDEX($BM$5:$BM$31,MATCH(BO5,$BN$5:$BN$31,0))=0,\"\",INDEX($BM$5:$BM$31,MATCH(BO5,$BN$5:$BN$31,0)))","v":187.58627646862942},{"$f":"IF( CL5 = \"\", \"\", _xlfn.XLOOKUP( CL5, $A$253:$A$279, $X$253:$X$279, \"\" ))","v":150},{"$f":"_xlfn.LET( _xlpm.m, INDEX($Y$5:$Y$31,MATCH(CL5,$AG$5:$AG$31,0)),\nIF(CF5=\"\",\"\",\"(\" & IF( _xlpm.m = \"\", 0, _xlpm.m ) & \")\"))","v":"(15)"},{"$f":"IFERROR(IF(CF5=\"\",\"\",ABS(CF5/CH5)),0)","v":12.505751764575296},null,{"$f":"IF(BY5=\"\",\"\",INDEX($AG$5:$AG$32,MATCH(BK5,$BJ$5:$BJ$31,0)))","v":"De Vinster Glenn"},{"$f":"IF(CF5=\"\",\"\",INDEX($AG$5:$AG$31,MATCH(BO5,$BN$5:$BN$31,0)))","v":"Hofmans Stijn"},{"$f":"IF(CR5=\"\",\"\",INDEX($AG$5:$AG$31,MATCH(BS5,$BR$5:$BR$31,0)))","v":"De Vinster Glenn"},{"$f":"_xlfn.TAKE( _xlfn.SORTBY( DJ5:DO20,_xlfn.ANCHORARRAY( DO5), -1 ), , 1 )","v":"De Vinster Glenn"},null,{"$f":"IF(CR5=\"\",\"\",BU5)","v":1},{"$f":"_xlfn.XLOOKUP( CM5, $DR$5:$DR$30, $DS$5:$DS$30, \"\" )","v":"Glenn De Vinster"},{"$f":"IF(INDEX($BQ$5:$BQ$31,MATCH(BS5,$BR$5:$BR$31,0))=0,\"\",INDEX($BQ$5:$BQ$31,MATCH(BS5,$BR$5:$BR$31,0)))","v":5},{"$f":"IF(CR5=\"\",\"\",\"(\" & INDEX($Y$5:$Y$31,MATCH(CM5,$AG$5:$AG$31,0)) & \")\")","v":"(10)"},null,{"$f":"_xlfn.SEQUENCE( ROWS(_xlfn.ANCHORARRAY( DJ5) ))","v":1},{"$f":"_xlfn.XLOOKUP(_xlfn.ANCHORARRAY( CN5), $DR$5:$DR$30, $DS$5:$DS$30, \"\" )","v":"Glenn De Vinster"},{"$f":"_xlfn.DROP( _xlfn.SORTBY( DJ5:DO20,_xlfn.ANCHORARRAY( DO5), -1 ), , 1 )","v":5},1,0,6,17,null,null,{"$f":"_xlfn.LET( _xlpm.n, _xlfn.TOCOL( AL36:BG38, 1 ),\n_xlfn._xlws.FILTER( _xlpm.n, _xlpm.n <> \"\", \"Niets weer te geven.\" ))","v":"De Groof Steven"},null,{"$f":"_xlfn.LET(\n     _xlpm.a,_xlfn.ANCHORARRAY( DD5),\n     _xlpm.b, (LEN(_xlpm.a) - LEN(SUBSTITUTE(_xlpm.a, \" / \",)))/LEN( \" / \" ) +1,\n     _xlpm.c, _xlfn.SEQUENCE( , MAX(_xlpm.b)),\n     IFERROR( _xlfn.TEXTSPLIT( _xlfn.TEXTAFTER( \" / \" & _xlpm.a & \" / \",\" / \", _xlpm.c ), \" / \"), NA() ))","v":"De Groof Steven"},{"$error":"#N/A"},{"$error":"#N/A"},null,{"$f":"_xlfn.UNIQUE( _xlfn.TOCOL(_xlfn.ANCHORARRAY( DF5), 2 ))","v":"De Groof Steven"},{"$f":"COUNTIF( $AL$36:$BG$36, \"*\" &_xlfn.ANCHORARRAY( DJ5) & \"*\" )","v":2},{"$f":"COUNTIF( $AL$37:$BG$37, \"*\" &_xlfn.ANCHORARRAY( DJ5) & \"*\" )","v":1},{"$f":"COUNTIF( $AL$38:$BG$38, \"*\" &_xlfn.ANCHORARRAY( DJ5) & \"*\" )","v":3},{"$f":"_xlfn.ANCHORARRAY(DK5) +_xlfn.ANCHORARRAY( DL5) +_xlfn.ANCHORARRAY( DM5)","v":6},{"$f":"3 *_xlfn.ANCHORARRAY( DK5) + 2 *_xlfn.ANCHORARRAY( DL5) + 1 *_xlfn.ANCHORARRAY( DM5)","v":11},null,null,{"$f":"A5","v":"Beirinckx Jurgen"},"Jurgen Beirinckx"]
["Beirinckx Sven","a","a","a","a","a","a","a","a","a","a","a","a","a","a","a","a","a","a",null,null,null,null,0,0,0,18,0,0,0,{"$f":"COUNTIF(B6:W6,\"k\")","v":0},null,"Beirinckx Sven",{"$f":"IF(SUM(AL6:BG6)=0,\"\",SUM(AL6:BG6))","v":""},"",{"$f":"_xlfn.LET( _xlpm.i, INDEX($AL6:$BG6,1,MAX(1,MATCH($AJ$2,$B$4:$W$4,0))), IF( _xlpm.i = \"\", \"\", _xlpm.i ))","v":0},12,0,0,0,0,0,0,0,0,0,0,0,0,0,0,0,0,0,0,0,0,0,0,null,{"$f":"INDEX($AL6:$BG6,1,MAX(1,MATCH($AJ$2,$B$4:$W$4,0)))","v":0},{"$f":"BI6-BU6/100","v":-0.02},12.821176470588236,null,0,{"$f":"BM6-BU6/100","v":-0.02},183.18878676878674,null,0,{"$f":"1000*BQ6+BM6-BU6/100","v":-0.02},3187.4362764686293,null,2,null,{"$f":"IF(BY6=\"\",\"\",BU6)","v":2},"Pieter Elst",12.941176470588236,{"$f":"IF( CK6 = \"\", \"\", _xlfn.XLOOKUP( CK6, $A$253:$A$279, INDEX( $B$253:$W$279, , $AI$1 ), \"\" ))","v":11},null,null,null,{"$f":"IF(CF6=\"\",\"\",BU6)","v":2},"Maarten De Groof",{"$f":"IF(INDEX($BM$5:$BM$31,MATCH(BO6,$BN$5:$BN$31,0))=0,\"\",INDEX($BM$5:$BM$31,MATCH(BO6,$BN$5:$BN$31,0)))","v":183.26878676878675},141,"(15)",12.217919117919116,null,{"$f":"IF(BY6=\"\",\"\",INDEX($AG$5:$AG$32,MATCH(BK6,$BJ$5:$BJ$31,0)))","v":"Elst Pieter"},"De Groof Maarten","Hofmans Stijn","De Groof Maarten",null,2,"Stijn Hofmans",3,"(15)",null,2,"Maarten De Groof",2,3,4,9,16,null,null,"Hofmans Stijn",null,"Hofmans Stijn",{"$error":"#N/A"},{"$error":"#N/A"},null,"Hofmans Stijn",3,2,1,6,14,null,null,{"$f":"A6","v":"Beirinckx Sven"},"Sven Beirinckx"]
["Beirinckx Wout",1,1,1,1,1,1,1,"k",1,"t","t","p",1,"k","k","k","k","k",null,null,null,null,0,15,0,0,0,0,3,6,null,"Beirinckx Wout",88.614454173277693,10,{"$f":"_xlfn.LET( _xlpm.i, INDEX($AL7:$BG7,1,MAX(1,MATCH($AJ$2,$B$4:$W$4,0))), IF( _xlpm.i = \"\", \"\", _xlpm.i ))","v":5.882352941176471},9,0,0,2.8571428571428572,7.5,1.8181818181818181,1.25,7.6923076923076925,18.333333333333332,1.4285714285714286,0,0,0,6.1538461538461542,13.333333333333334,4,13.75,4.615384615384615,5.882352941176471,0,0,0,0,null,{"$f":"INDEX($AL7:$BG7,1,MAX(1,MATCH($AJ$2,$B$4:$W$4,0)))","v":5.882352941176471},{"$f":"BI7-BU7/100","v":5.8523529411764708},12.711176470588235,null,88.614454173277693,{"$f":"BM7-BU7/100","v":88.584454173277692},151.87540113481293,null,1,{"$f":"1000*BQ7+BM7-BU7/100","v":1088.5844541732777},3129.9474176150643,null,3,null,3,"Kaïn Verlooy",12.941176470588236,{"$f":"IF( CK7 = \"\", \"\", _xlfn.XLOOKUP( CK7, $A$253:$A$279, INDEX( $B$253:$W$279, , $AI$1 ), \"\" ))","v":11},null,null,null,3,"Kaïn Verlooy",{"$f":"IF(INDEX($BM$5:$BM$31,MATCH(BO7,$BN$5:$BN$31,0))=0,\"\",INDEX($BM$5:$BM$31,MATCH(BO7,$BN$5:$BN$31,0)))","v":152.10540113481292},115,"(14)",10.864671509629494,null,"Verlooy Kaïn","Verlooy Kaïn","Celis Ive","Hofmans Stijn",null,3,"Ive Celis",3,"(12)",null,3,"Stijn Hofmans",3,2,1,6,14,null,null,"De Groof Maarten",null,"De Groof Maarten",{"$error":"#N/A"},{"$error":"#N/A"},null,"De Groof Maarten",2,3,4,9,16,null,null,"Beirinckx Wout","Wout Beirinckx"]
["Boes Dieuwer",1,"a",1,"a",1,"a",1,1,"a","a","a",1,"a",1,1,1,1,"a",null,null,null,null,0,10,0,8,0,0,0,0,null,"Boes Dieuwer",18.188034188034187,18,{"$f":"_xlfn.LET( _xlpm.i, INDEX($AL8:$BG8,1,MAX(1,MATCH($AJ$2,$B$4:$W$4,0))), IF( _xlpm.i = \"\", \"\", _xlpm.i ))","v":0},12,0,0,0,0,0,0,1.5384615384615385,3.3333333333333335,0,0,0,2.6666666666666665,0,7.7777777777777777,1.3333333333333333,0,1.5384615384615385,0,0,0,0,0,null,{"$f":"INDEX($AL8:$BG8,1,MAX(1,MATCH($AJ$2,$B$4:$W$4,0)))","v":0},{"$f":"BI8-BU8/100","v":-0.04},11.714705882352941,null,18.188034188034187,18.148034188034188,145.68075989370107,null,0,18.148034188034188,2183.1887867687869,null,4,null,4,"Ive Celis",11.764705882352942,{"$f":"IF( CK8 = \"\", \"\", _xlfn.XLOOKUP( CK8, $A$253:$A$279, INDEX( $B$253:$W$279, , $AI$1 ), \"\" ))","v":10},null,null,null,{"$f":"IF(CF8=\"\",\"\",BU8)","v":4},"Glenn De Vinster",{"$f":"IF(INDEX($BM$5:$BM$31,MATCH(BO8,$BN$5:$BN$31,0))=0,\"\",INDEX($BM$5:$BM$31,MATCH(BO8,$BN$5:$BN$31,0)))","v":145.79075989370108},109,"(10)",14.579075989370107,null,"Celis Ive","De Vinster Glenn","De Groof Maarten","Celis Ive",null,4,"Maarten De Groof",2,"(15)",null,4,"Ive Celis",3,1,1,5,12,null,null,"De Groof Maarten / Vermeylen Jason",null,"De Groof Maarten","Vermeylen Jason",{"$error":"#N/A"},null,"Vermeylen Jason",2,1,1,4,9,null,null,"Boes Dieuwer","Dieuwer Boes"]
["Celis Ive","a","a","a",1,1,1,1,1,"a",1,"b","a",1,1,1,1,1,1,null,null,null,null,0,12,0,5,1,0,0,0,null,"Celis Ive",129.99741761506468,7,{"$f":"_xlfn.LET( _xlpm.i, INDEX($AL9:$BG9,1,MAX(1,MATCH($AJ$2,$B$4:$W$4,0))), IF( _xlpm.i = \"\", \"\", _xlpm.i ))","v":11.764705882352942},4,0,0,0,8.75,11.818181818181818,8.75,15.384615384615385,6.666666666666667,0,12,0,0,9.2307692307692299,18.888888888888889,18.666666666666668,5,3.0769230769230771,11.764705882352942,0,0,0,0,null,{"$f":"INDEX($AL9:$BG9,1,MAX(1,MATCH($AJ$2,$B$4:$W$4,0)))","v":11.764705882352942},11.714705882352941,11.634705882352941,null,129.99741761506468,129.94741761506467,144.00082747318041,null,3,3129.9474176150643,2144.0008274731804,null,5,null,5,"Bernd Gielis",11.764705882352942,{"$f":"IF( CK9 = \"\", \"\", _xlfn.XLOOKUP( CK9, $A$253:$A$279, INDEX( $B$253:$W$279, , $AI$1 ), \"\" ))","v":10},null,null,null,5,"Steven De Groof",144.09082747318041,106,"(16)",9.0056767170737757,null,"Gielis Bernd","De Groof Steven","De Groof Steven","De Groof Steven",null,5,"Steven De Groof",2,"(16)",null,5,"Steven De Groof",2,1,3,6,11,null,null,"Hofmans Stijn",null,"Hofmans Stijn",{"$error":"#N/A"},{"$error":"#N/A"},null,"Celis Ive",3,1,1,5,12,null,null,"Celis Ive","Ive Celis"]
["Coolsaet Joy","a",1,"a",1,"a",1,1,1,1,1,1,1,1,1,1,1,"a",1,null,null,null,null,0,14,0,4,0,0,0,0,null,"Coolsaet Joy",70.04212454212454,14,{"$f":"_xlfn.LET( _xlpm.i, INDEX($AL10:$BG10,1,MAX(1,MATCH($AJ$2,$B$4:$W$4,0))), IF( _xlpm.i = \"\", \"\", _xlpm.i ))","v":0},12,0,5.333333333333333,0,0,0,0,12.307692307692308,3.3333333333333335,4.2857142857142856,17.333333333333332,7.5,12,4.615384615384615,3.3333333333333335,0,0,0,0,0,0,0,0,null,{"$f":"INDEX($AL10:$BG10,1,MAX(1,MATCH($AJ$2,$B$4:$W$4,0)))","v":0},-0.06,8.1452941176470581,null,70.04212454212454,69.982124542124538,131.87121225180047,null,1,1069.9821245421247,2078.0792640692644,null,6,null,6,"Steven De Groof",8.235294117647058,{"$f":"IF( CK10 = \"\", \"\", _xlfn.XLOOKUP( CK10, $A$253:$A$279, INDEX( $B$253:$W$279, , $AI$1 ), \"\" ))","v":7},null,null,null,6,"Maarten Langenaeker",132.03121225180047,106,"(15)",8.8020808167866971,null,"De Groof Steven","Langenaeker Maarten","Vermeylen Jason","Verlooy Kaïn",null,6,"Jason Vermeylen",2,"(6)",null,6,"Kaïn Verlooy",1,3,2,6,11,null,null,"Vermeylen Jason",null,"Vermeylen Jason",{"$error":"#N/A"},{"$error":"#N/A"},null,"Beirinckx Wout",1,0,1,2,4,null,null,"Coolsaet Joy","Joy Coolsaet"]
["De Clerck Tom","a","a","a","a","a","a","a","a","a","a","a","a","a","a","a","a","a","a",null,null,null,null,0,0,0,18,0,0,0,0,null,"De Clerck Tom","","",{"$f":"_xlfn.LET( _xlpm.i, INDEX($AL11:$BG11,1,MAX(1,MATCH($AJ$2,$B$4:$W$4,0))), IF( _xlpm.i = \"\", \"\", _xlpm.i ))","v":0},12,0,0,0,0,0,0,0,0,0,0,0,0,0,0,0,0,0,0,0,0,0,0,null,{"$f":"INDEX($AL11:$BG11,1,MAX(1,MATCH($AJ$2,$B$4:$W$4,0)))","v":0},-7.0000000000000007E-2,8.0852941176470576,null,0,-7.0000000000000007E-2,129.94741761506467,null,0,-7.0000000000000007E-2,1151.8754011348128,null,7,null,7,"Stijn Hofmans",8.235294117647058,{"$f":"IF( CK11 = \"\", \"\", _xlfn.XLOOKUP( CK11, $A$253:$A$279, INDEX( $B$253:$W$279, , $AI$1 ), \"\" ))","v":7},null,null,null,7,"Ive Celis",129.99741761506468,103,"(12)",10.833118134588723,null,"Hofmans Stijn","Celis Ive","Verlooy Kaïn","Vermeylen Jason",null,7,"Kaïn Verlooy",1,"(14)",null,7,"Jason Vermeylen",2,1,1,4,9,null,null,"Celis Ive",null,"Celis Ive",{"$error":"#N/A"},{"$error":"#N/A"},null,"De Vinster Glenn",5,1,0,6,17,null,null,"De Clerck Tom","Tom De Clerck"]
["De Groof Maarten",1,1,1,1,1,"ng",1,1,1,1,1,1,1,1,1,1,"b","ng",null,null,null,null,6,15,0.33333333333333331,0,1,0,2,0,null,"De Groof Maarten",183.26878676878675,2,{"$f":"_xlfn.LET( _xlpm.i, INDEX($AL12:$BG12,1,MAX(1,MATCH($AJ$2,$B$4:$W$4,0))), IF( _xlpm.i = \"\", \"\", _xlpm.i ))","v":0},12,6.666666666666667,10.666666666666666,20,18.75,12.727272727272727,0,12.307692307692308,8.3333333333333339,8.5714285714285712,9.3333333333333339,5,6.666666666666667,15.384615384615385,17.777777777777779,17.333333333333332,13.75,0,0,0,0,0,0,null,{"$f":"INDEX($AL12:$BG12,1,MAX(1,MATCH($AJ$2,$B$4:$W$4,0)))","v":0},{"$f":"BI12-BU12/100","v":-0.08},6.8988235294117644,null,183.26878676878675,183.18878676878674,102.50669036845505,null,2,{"$f":"1000*BQ12+BM12-BU12/100","v":2183.1887867687869},1131.8712122518004,null,8,null,8,"Maarten Langenaeker",7.0588235294117645,{"$f":"IF( CK12 = \"\", \"\", _xlfn.XLOOKUP( CK12, $A$253:$A$279, INDEX( $B$253:$W$279, , $AI$1 ), \"\" ))","v":6},null,null,null,8,"Rob Van de Vondel",102.70669036845506,77,"(11)",9.3369718516777329,null,"Langenaeker Maarten","Van de Vondel Rob","Langenaeker Maarten","Langenaeker Maarten",null,8,"Maarten Langenaeker",1,"(15)",null,8,"Maarten Langenaeker",1,1,2,4,7,null,null,"Beirinckx Wout / De Vinster Glenn",null,"Beirinckx Wout","De Vinster Glenn",{"$error":"#N/A"},null,"Langenaeker Maarten",1,1,2,4,7,null,null,"De Groof Maarten","Maarten De Groof"]
["De Groof Steven",1,1,1,1,1,1,1,1,1,1,"ng","as",1,1,1,1,1,1,null,null,null,null,4,16,0.22222222222222221,0,0,0,1,0,null,"De Groof Steven",144.09082747318041,5,{"$f":"_xlfn.LET( _xlpm.i, INDEX($AL13:$BG13,1,MAX(1,MATCH($AJ$2,$B$4:$W$4,0))), IF( _xlpm.i = \"\", \"\", _xlpm.i ))","v":8.235294117647058},6,24,8,11.428571428571429,0,3.6363636363636362,2.5,4.615384615384615,11.666666666666666,0,10.666666666666666,0,0,16.923076923076923,4.4444444444444446,10.666666666666666,15,12.307692307692308,8.235294117647058,0,0,0,0,null,{"$f":"INDEX($AL13:$BG13,1,MAX(1,MATCH($AJ$2,$B$4:$W$4,0)))","v":8.235294117647058},{"$f":"BI13-BU13/100","v":8.1452941176470581},5.8523529411764708,null,144.09082747318041,{"$f":"BM13-BU13/100","v":144.00082747318041},96.013826761473823,null,2,{"$f":"1000*BQ13+BM13-BU13/100","v":2144.0008274731804},1088.5844541732777,null,9,null,9,"Wout Beirinckx",5.882352941176471,{"$f":"IF( CK13 = \"\", \"\", _xlfn.XLOOKUP( CK13, $A$253:$A$279, INDEX( $B$253:$W$279, , $AI$1 ), \"\" ))","v":5},null,null,null,9,"Bernd Gielis",96.143826761473818,73,"(12)",8.0119855634561521,null,"Beirinckx Wout","Gielis Bernd","Beirinckx Wout","Coolsaet Joy",null,9,"Wout Beirinckx",1,"(15)",null,9,"Joy Coolsaet",1,1,1,3,6,null,null,"Langenaeker Maarten",null,"Langenaeker Maarten",{"$error":"#N/A"},{"$error":"#N/A"},null,"Coolsaet Joy",1,1,1,3,6,null,null,"De Groof Steven","Steven De Groof"]
["De Swert Erlend",1,1,1,"a",1,1,"a","a","a",1,1,1,"a",1,"a","b","b","a",null,null,null,null,0,9,0,7,2,0,0,0,null,"De Swert Erlend",13.78968253968254,19,{"$f":"_xlfn.LET( _xlpm.i, INDEX($AL14:$BG14,1,MAX(1,MATCH($AJ$2,$B$4:$W$4,0))), IF( _xlpm.i = \"\", \"\", _xlpm.i ))","v":0},12,0,1.3333333333333333,1.4285714285714286,0,0,0,0,0,0,2.6666666666666665,1.25,2.6666666666666665,0,4.4444444444444446,0,0,0,0,0,0,0,0,null,{"$f":"INDEX($AL14:$BG14,1,MAX(1,MATCH($AJ$2,$B$4:$W$4,0)))","v":0},{"$f":"BI14-BU14/100","v":-0.1},{"$f":"LARGE(BJ$5:BJ$31,BU14)","v":4.4958823529411767},null,{"$f":"SUM(AL14:BG14)","v":13.78968253968254},{"$f":"BM14-BU14/100","v":13.68968253968254},{"$f":"LARGE(BN$5:BN$31,BU14)","v":88.584454173277692},null,0,{"$f":"1000*BQ14+BM14-BU14/100","v":13.68968253968254},{"$f":"LARGE(BR$5:BR$31,BU14)","v":1069.9821245421247},null,10,null,{"$f":"IF(BY14=\"\",\"\",BU14)","v":10},"Dieter Van Dessel",4.7058823529411766,{"$f":"IF( CK14 = \"\", \"\", _xlfn.XLOOKUP( CK14, $A$253:$A$279, INDEX( $B$253:$W$279, , $AI$1 ), \"\" ))","v":4},null,null,null,10,"Wout Beirinckx",88.614454173277693,66,"(15)",5.9076302782185133,null,"Van Dessel Dieter","Beirinckx Wout","Coolsaet Joy","Elst Pieter",null,10,"Joy Coolsaet",1,"(14)",null,10,"Pieter Elst",0,3,0,3,6,null,null,"Coolsaet Joy",null,"Coolsaet Joy",{"$error":"#N/A"},{"$error":"#N/A"},null,"Verlooy Kaïn",1,3,2,6,11,null,null,"De Swert Erlend","Erlend De Swert"]
["De Vinster Glenn","na","na","na","na","na","na","na",1,1,1,1,1,"a",1,1,1,1,1,null,null,null,null,11,10,0.61111111111111116,1,0,0,7,{"$f":"COUNTIF(B15:W15,\"k\")","v":0},null,{"$f":"A15","v":"De Vinster Glenn"},{"$f":"IF(SUM(AL15:BG15)=0,\"\",SUM(AL15:BG15))","v":145.79075989370108},{"$f":"IF(AH15=\"\",\"\",RANK(AH15,AH$5:AH$32))","v":4},{"$f":"_xlfn.LET( _xlpm.i, INDEX($AL15:$BG15,1,MAX(1,MATCH($AJ$2,$B$4:$W$4,0))), IF( _xlpm.i = \"\", \"\", _xlpm.i ))","v":15.294117647058824},{"$f":"IF(AJ15=\"\",\"\",RANK(AJ15,AJ$5:AJ$32))","v":1},0,0,0,0,0,0,0,18.333333333333332,18.571428571428573,9.3333333333333339,23.75,22.666666666666668,0,4.4444444444444446,6.666666666666667,17.5,9.2307692307692299,15.294117647058824,0,0,0,0,null,{"$f":"INDEX($AL15:$BG15,1,MAX(1,MATCH($AJ$2,$B$4:$W$4,0)))","v":15.294117647058824},15.184117647058825,0.9764705882352942,null,145.79075989370108,145.68075989370107,87.759674116732938,null,5,5145.6807598937012,102.50669036845505,null,11,null,{"$f":"IF(BY15=\"\",\"\",BU15)","v":11},"Rob Van de Vondel",1.1764705882352942,{"$f":"IF( CK15 = \"\", \"\", _xlfn.XLOOKUP( CK15, $A$253:$A$279, INDEX( $B$253:$W$279, , $AI$1 ), \"\" ))","v":1},null,null,null,11,"Dieter Van Dessel",87.969674116732932,65,"(15)",5.8646449411155288,null,"Van de Vondel Rob","Van Dessel Dieter","","Beirinckx Wout",null,"","","","",null,11,"Wout Beirinckx",1,0,1,2,4,null,null,"De Vinster Glenn",null,"De Vinster Glenn",{"$error":"#N/A"},{"$error":"#N/A"},null,"Van de Vondel Rob",0,1,1,2,3,null,null,"De Vinster Glenn","Glenn De Vinster"]
["Elst Pieter",1,1,1,1,1,"a","a","a","a",1,"b",1,"a","a",1,1,1,1,null,null,null,null,0,11,0,6,1,0,0,0,null,"Elst Pieter",76.588778868190644,13,{"$f":"_xlfn.LET( _xlpm.i, INDEX($AL16:$BG16,1,MAX(1,MATCH($AJ$2,$B$4:$W$4,0))), IF( _xlpm.i = \"\", \"\", _xlpm.i ))","v":12.941176470588236},2,0,8,4.2857142857142856,16.25,2.7272727272727271,0,0,0,0,1.3333333333333333,0,5.333333333333333,0,0,5.333333333333333,5,15.384615384615385,12.941176470588236,0,0,0,0,null,{"$f":"INDEX($AL16:$BG16,1,MAX(1,MATCH($AJ$2,$B$4:$W$4,0)))","v":12.941176470588236},12.821176470588236,-0.01,null,76.588778868190644,76.46877886819064,78.079264069264084,null,0,76.46877886819064,96.013826761473823,null,12,null,"","","",{"$f":"IF( CK16 = \"\", \"\", _xlfn.XLOOKUP( CK16, $A$253:$A$279, INDEX( $B$253:$W$279, , $AI$1 ), \"\" ))","v":""},null,null,null,12,"Jason Vermeylen",78.319264069264079,62,"(6)",13.05321067821068,null,"","Vermeylen Jason","","Van de Vondel Rob",null,"","","","",null,12,"Rob Van de Vondel",0,1,1,2,3,null,null,"De Vinster Glenn / Hofmans Stijn",null,"De Vinster Glenn","Hofmans Stijn",{"$error":"#N/A"},null,"Elst Pieter",0,3,0,3,6,null,null,"Elst Pieter","Pieter Elst"]
["Gielis Bernd",1,1,1,1,"a",1,"a","a",1,1,1,"b","b","b",1,1,1,1,null,null,null,null,0,12,0,3,3,0,0,0,null,"Gielis Bernd",96.143826761473818,{"$f":"IF(AH17=\"\",\"\",RANK(AH17,AH$5:AH$32))","v":9},{"$f":"_xlfn.LET( _xlpm.i, INDEX($AL17:$BG17,1,MAX(1,MATCH($AJ$2,$B$4:$W$4,0))), IF( _xlpm.i = \"\", \"\", _xlpm.i ))","v":11.764705882352942},{"$f":"IF(AJ17=\"\",\"\",RANK(AJ17,AJ$5:AJ$32))","v":4},16,5.333333333333333,2.8571428571428572,5,0,8.75,0,0,5.7142857142857144,6.666666666666667,5,0,0,0,8,8.75,12.307692307692308,11.764705882352942,0,0,0,0,null,{"$f":"INDEX($AL17:$BG17,1,MAX(1,MATCH($AJ$2,$B$4:$W$4,0)))","v":11.764705882352942},11.634705882352941,-0.02,null,96.143826761473818,96.013826761473823,76.46877886819064,null,0,96.013826761473823,87.759674116732938,null,13,null,"","","",{"$f":"IF( CK17 = \"\", \"\", _xlfn.XLOOKUP( CK17, $A$253:$A$279, INDEX( $B$253:$W$279, , $AI$1 ), \"\" ))","v":""},null,null,null,13,"Pieter Elst",76.588778868190644,59,"(11)",6.9626162607446043,null,"","Elst Pieter","","Gielis Bernd",null,"","","","",null,13,"Bernd Gielis",0,0,3,3,3,null,null,"De Groof Steven",null,"De Groof Steven",{"$error":"#N/A"},{"$error":"#N/A"},null,"Lenaerts Jordy",0,1,0,1,2,null,null,"Gielis Bernd","Bernd Gielis"]
["Gielis Wim",1,"b","b",1,1,"a",1,1,1,"a",1,1,1,1,1,1,1,1,null,null,null,null,1,14,5.5555555555555552E-2,2,2,0,0,0,null,"Gielis Wim",20.760989010989007,17,{"$f":"_xlfn.LET( _xlpm.i, INDEX($AL18:$BG18,1,MAX(1,MATCH($AJ$2,$B$4:$W$4,0))), IF( _xlpm.i = \"\", \"\", _xlpm.i ))","v":0},12,0,0,0,1.25,0,0,1.5384615384615385,1.6666666666666667,2.8571428571428572,0,7.5,1.3333333333333333,4.615384615384615,0,0,0,0,0,0,0,0,0,null,{"$f":"INDEX($AL18:$BG18,1,MAX(1,MATCH($AJ$2,$B$4:$W$4,0)))","v":0},-0.14000000000000001,-0.04,null,20.760989010989007,20.620989010989007,69.982124542124538,null,0,20.620989010989007,76.46877886819064,null,14,null,"","","",{"$f":"IF( CK18 = \"\", \"\", _xlfn.XLOOKUP( CK18, $A$253:$A$279, INDEX( $B$253:$W$279, , $AI$1 ), \"\" ))","v":""},null,null,null,14,"Joy Coolsaet",70.04212454212454,51,"(14)",5.0030088958660386,null,"","Coolsaet Joy","","Lenaerts Jordy",null,"","","","",null,14,"Jordy Lenaerts",0,1,0,1,2,null,null,"Celis Ive",null,"Celis Ive",{"$error":"#N/A"},{"$error":"#N/A"},null,"Gielis Bernd",0,0,3,3,3,null,null,"Gielis Wim","Wim Gielis"]
["Hofmans Stijn",1,1,1,"b",1,1,"a",1,1,"a",1,1,1,1,1,1,1,1,null,null,null,null,12,15,0.66666666666666663,2,1,0,0,0,null,"Hofmans Stijn",187.58627646862942,1,{"$f":"_xlfn.LET( _xlpm.i, INDEX($AL19:$BG19,1,MAX(1,MATCH($AJ$2,$B$4:$W$4,0))), IF( _xlpm.i = \"\", \"\", _xlpm.i ))","v":8.235294117647058},6,13.333333333333334,17.333333333333332,7.1428571428571432,0,29.09090909090909,18.75,0,15,7.1428571428571432,0,8.75,22.666666666666668,1.5384615384615385,3.3333333333333335,12,12.5,10.76923076923077,8.235294117647058,0,0,0,0,null,{"$f":"INDEX($AL19:$BG19,1,MAX(1,MATCH($AJ$2,$B$4:$W$4,0)))","v":8.235294117647058},8.0852941176470576,-0.06,null,187.58627646862942,187.43627646862942,43.376153846153848,null,3,3187.4362764686293,43.376153846153848,null,15,null,"","","",{"$f":"IF( CK19 = \"\", \"\", _xlfn.XLOOKUP( CK19, $A$253:$A$279, INDEX( $B$253:$W$279, , $AI$1 ), \"\" ))","v":""},null,null,null,15,"Stijn Verdickt",43.596153846153847,32,"(11)",3.9632867132867133,null,"","Verdickt Stijn","","Van Dessel Dieter",null,"","","","",null,15,"Dieter Van Dessel",0,0,2,2,2,null,null,"Celis Ive",null,"Celis Ive",{"$error":"#N/A"},{"$error":"#N/A"},null,"Van Dessel Dieter",0,0,2,2,2,null,null,"Hofmans Stijn","Stijn Hofmans"]
["Langenaeker Maarten","k","k","k","k","k","k","k","a","k","k","k",1,1,1,"a","a",1,1,null,null,null,null,0,15,0,3,0,0,0,10,null,"Langenaeker Maarten",132.03121225180047,6,{"$f":"_xlfn.LET( _xlpm.i, INDEX($AL20:$BG20,1,MAX(1,MATCH($AJ$2,$B$4:$W$4,0))), IF( _xlpm.i = \"\", \"\", _xlpm.i ))","v":7.0588235294117645},8,1.3333333333333333,9.3333333333333339,4.2857142857142856,6.25,22.727272727272727,12.5,12.307692307692308,0,20,4,7.5,5.333333333333333,9.2307692307692299,5.5555555555555554,0,0,4.615384615384615,7.0588235294117645,0,0,0,0,null,{"$f":"INDEX($AL20:$BG20,1,MAX(1,MATCH($AJ$2,$B$4:$W$4,0)))","v":7.0588235294117645},6.8988235294117644,-7.0000000000000007E-2,null,132.03121225180047,131.87121225180047,24.46186813186813,null,1,1131.8712122518004,24.46186813186813,null,16,null,"","","",{"$f":"IF( CK20 = \"\", \"\", _xlfn.XLOOKUP( CK20, $A$253:$A$279, INDEX( $B$253:$W$279, , $AI$1 ), \"\" ))","v":""},null,null,null,16,"Jordy Lenaerts",24.631868131868131,17,"(7)",3.5188383045525904,null,"","Lenaerts Jordy","","Verdickt Stijn",null,"","","","",null,16,"Stijn Verdickt",0,0,2,2,2,null,null,"De Vinster Glenn",null,"De Vinster Glenn",{"$error":"#N/A"},{"$error":"#N/A"},null,"Verdickt Stijn",0,0,2,2,2,null,null,"Langenaeker Maarten","Maarten Langenaeker"]
["Lenaerts Jordy","a","a","a","a",1,"a",1,"a",1,1,1,1,"a","a",1,"a","a","a",null,null,null,null,0,7,0,11,0,0,0,0,null,"Lenaerts Jordy",24.631868131868131,16,{"$f":"_xlfn.LET( _xlpm.i, INDEX($AL21:$BG21,1,MAX(1,MATCH($AJ$2,$B$4:$W$4,0))), IF( _xlpm.i = \"\", \"\", _xlpm.i ))","v":0},12,0,0,0,0,0,0,13.846153846153847,0,4.2857142857142856,4,2.5,0,0,0,0,0,0,0,0,0,0,0,null,{"$f":"INDEX($AL21:$BG21,1,MAX(1,MATCH($AJ$2,$B$4:$W$4,0)))","v":0},{"$f":"BI21-BU21/100","v":-0.17},{"$f":"LARGE(BJ$5:BJ$31,BU21)","v":-0.08},null,24.631868131868131,{"$f":"BM21-BU21/100","v":24.46186813186813},{"$f":"LARGE(BN$5:BN$31,BU21)","v":20.620989010989007},null,0,{"$f":"1000*BQ21+BM21-BU21/100","v":24.46186813186813},{"$f":"LARGE(BR$5:BR$31,BU21)","v":20.620989010989007},null,17,null,"","","",{"$f":"IF( CK21 = \"\", \"\", _xlfn.XLOOKUP( CK21, $A$253:$A$279, INDEX( $B$253:$W$279, , $AI$1 ), \"\" ))","v":""},null,null,null,17,"Wim Gielis",20.760989010989007,15,"(14)",1.4829277864992148,null,"","Gielis Wim","",null,null,"","","","",null,null,null,null,null,null,null,null,null,null,"Verlooy Kaïn",null,"Verlooy Kaïn",{"$error":"#N/A"},{"$error":"#N/A"},null,null,null,null,null,null,null,null,null,"Lenaerts Jordy","Jordy Lenaerts"]
["Op De Beeck Maarten","b","b","b","b","b","b","b","b","b","b","b","b","b","b","b","b","b","b",null,null,null,null,0,0,0,0,18,0,0,{"$f":"COUNTIF(B22:W22,\"k\")","v":0},null,{"$f":"A22","v":"Op De Beeck Maarten"},{"$f":"IF(SUM(AL22:BG22)=0,\"\",SUM(AL22:BG22))","v":""},"",{"$f":"_xlfn.LET( _xlpm.i, INDEX($AL22:$BG22,1,MAX(1,MATCH($AJ$2,$B$4:$W$4,0))), IF( _xlpm.i = \"\", \"\", _xlpm.i ))","v":0},12,0,0,0,0,0,0,0,0,0,0,0,0,0,0,0,0,0,0,0,0,0,0,null,{"$f":"INDEX($AL22:$BG22,1,MAX(1,MATCH($AJ$2,$B$4:$W$4,0)))","v":0},{"$f":"BI22-BU22/100","v":-0.18},-0.1,null,0,{"$f":"BM22-BU22/100","v":-0.18},18.148034188034188,null,0,{"$f":"1000*BQ22+BM22-BU22/100","v":-0.18},18.148034188034188,null,18,null,"","","",{"$f":"IF( CK22 = \"\", \"\", _xlfn.XLOOKUP( CK22, $A$253:$A$279, INDEX( $B$253:$W$279, , $AI$1 ), \"\" ))","v":""},null,null,null,18,"Dieuwer Boes",18.188034188034187,14,"(10)",1.8188034188034188,null,"","Boes Dieuwer","",null,null,"","","","",null,null,null,null,null,null,null,null,null,null,"De Vinster Glenn",null,"De Vinster Glenn",{"$error":"#N/A"},{"$error":"#N/A"},null,null,null,null,null,null,null,null,null,"Op De Beeck Maarten","Maarten Op De Beeck"]
["Stevens Siebe",1,"b","b","b","b","b","b","b","b","b","b","b","b","b","b","b","b","b",null,null,null,null,0,1,0,0,17,0,0,0,null,"Stevens Siebe",1.3333333333333333,20,{"$f":"_xlfn.LET( _xlpm.i, INDEX($AL23:$BG23,1,MAX(1,MATCH($AJ$2,$B$4:$W$4,0))), IF( _xlpm.i = \"\", \"\", _xlpm.i ))","v":0},12,1.3333333333333333,0,0,0,0,0,0,0,0,0,0,0,0,0,0,0,0,0,0,0,0,0,null,{"$f":"INDEX($AL23:$BG23,1,MAX(1,MATCH($AJ$2,$B$4:$W$4,0)))","v":0},{"$f":"BI23-BU23/100","v":-0.19},-0.14000000000000001,null,1.3333333333333333,{"$f":"BM23-BU23/100","v":1.1433333333333333},13.68968253968254,null,0,{"$f":"1000*BQ23+BM23-BU23/100","v":1.1433333333333333},13.68968253968254,null,19,null,"","","",{"$f":"IF( CK23 = \"\", \"\", _xlfn.XLOOKUP( CK23, $A$253:$A$279, INDEX( $B$253:$W$279, , $AI$1 ), \"\" ))","v":""},null,null,null,19,"Erlend De Swert",13.78968253968254,11,"(9)",1.5321869488536155,null,"","De Swert Erlend","",null,null,"","","","",null,null,null,null,null,null,null,null,null,null,"Van de Vondel Rob",null,"Van de Vondel Rob",{"$error":"#N/A"},{"$error":"#N/A"},null,null,null,null,null,null,null,null,null,"Stevens Siebe","Siebe Stevens"]
["Van de Vondel Rob",1,1,1,1,1,1,1,1,1,"b","ng",1,1,"b","b","b","b","b",null,null,null,null,2,11,0.1111111111111111,0,6,0,1,0,null,"Van de Vondel Rob",102.70669036845506,8,{"$f":"_xlfn.LET( _xlpm.i, INDEX($AL24:$BG24,1,MAX(1,MATCH($AJ$2,$B$4:$W$4,0))), IF( _xlpm.i = \"\", \"\", _xlpm.i ))","v":1.1764705882352942},11,21.333333333333332,8,7.1428571428571432,5,10,3.75,9.2307692307692299,8.3333333333333339,15.714285714285714,0,0,5.333333333333333,7.6923076923076925,0,0,0,0,1.1764705882352942,0,0,0,0,null,{"$f":"INDEX($AL24:$BG24,1,MAX(1,MATCH($AJ$2,$B$4:$W$4,0)))","v":1.1764705882352942},{"$f":"BI24-BU24/100","v":0.9764705882352942},-0.17,null,102.70669036845506,{"$f":"BM24-BU24/100","v":102.50669036845505},1.1433333333333333,null,0,{"$f":"1000*BQ24+BM24-BU24/100","v":102.50669036845505},1.1433333333333333,null,20,null,"","","",{"$f":"IF( CK24 = \"\", \"\", _xlfn.XLOOKUP( CK24, $A$253:$A$279, INDEX( $B$253:$W$279, , $AI$1 ), \"\" ))","v":""},null,null,null,20,"Siebe Stevens",1.3333333333333333,1,"(1)",1.3333333333333333,null,"","Stevens Siebe","",null,null,"","","","",null,null,null,null,null,null,null,null,null,null,"Vermeylen Jason",null,"Vermeylen Jason",{"$error":"#N/A"},{"$error":"#N/A"},null,null,null,null,null,null,null,null,null,"Van de Vondel Rob","Rob Van de Vondel"]
["Van Dessel Dieter",1,"a",1,1,1,1,1,"a",1,1,1,1,1,1,"a",1,1,1,null,null,null,null,2,15,0.1111111111111111,3,0,0,0,0,null,"Van Dessel Dieter",87.969674116732932,11,{"$f":"_xlfn.LET( _xlpm.i, INDEX($AL25:$BG25,1,MAX(1,MATCH($AJ$2,$B$4:$W$4,0))), IF( _xlpm.i = \"\", \"\", _xlpm.i ))","v":4.7058823529411766},10,9.3333333333333339,0,7.1428571428571432,2.5,0.90909090909090906,7.5,9.2307692307692299,0,2.8571428571428572,10.666666666666666,6.25,10.666666666666666,4.615384615384615,1.1111111111111112,0,1.25,9.2307692307692299,4.7058823529411766,0,0,0,0,null,{"$f":"INDEX($AL25:$BG25,1,MAX(1,MATCH($AJ$2,$B$4:$W$4,0)))","v":4.7058823529411766},{"$f":"BI25-BU25/100","v":4.4958823529411767},-0.18,null,87.969674116732932,{"$f":"BM25-BU25/100","v":87.759674116732938},1.1011111111111112,null,0,{"$f":"1000*BQ25+BM25-BU25/100","v":87.759674116732938},1.1011111111111112,null,21,null,"","","",{"$f":"IF( CK25 = \"\", \"\", _xlfn.XLOOKUP( CK25, $A$253:$A$279, INDEX( $B$253:$W$279, , $AI$1 ), \"\" ))","v":""},null,null,null,21,"Jurgen Beirinckx",1.1111111111111112,1,"(1)",1.1111111111111112,null,"","Beirinckx Jurgen","",null,null,"","","","",null,null,null,null,null,null,null,null,null,null,"Verlooy Kaïn",null,"Verlooy Kaïn",{"$error":"#N/A"},{"$error":"#N/A"},null,null,null,null,null,null,null,null,null,"Van Dessel Dieter","Dieter Van Dessel"]
["Verdickt Stijn","b",1,"a","a","a",1,"a","a",1,1,1,1,1,1,1,1,"a",1,null,null,null,null,1,11,5.5555555555555552E-2,6,1,0,0,0,null,"Verdickt Stijn",43.596153846153847,15,{"$f":"_xlfn.LET( _xlpm.i, INDEX($AL26:$BG26,1,MAX(1,MATCH($AJ$2,$B$4:$W$4,0))), IF( _xlpm.i = \"\", \"\", _xlpm.i ))","v":0},12,0,2.6666666666666665,0,0,0,1.25,0,0,0,5.333333333333333,11.25,2.6666666666666665,13.846153846153847,0,5.333333333333333,1.25,0,0,0,0,0,0,null,{"$f":"INDEX($AL26:$BG26,1,MAX(1,MATCH($AJ$2,$B$4:$W$4,0)))","v":0},-0.22,-0.19,null,43.596153846153847,43.376153846153848,1.0633333333333332,null,0,43.376153846153848,1.0633333333333332,null,22,null,"","","",{"$f":"IF( CK26 = \"\", \"\", _xlfn.XLOOKUP( CK26, $A$253:$A$279, INDEX( $B$253:$W$279, , $AI$1 ), \"\" ))","v":""},null,null,null,22,"Geert Beirinckx",1.3333333333333333,1,"(0)",0,null,"","Beirinckx Geert","",null,null,"","","","",null,null,null,null,null,null,null,null,null,null,"Elst Pieter",null,"Elst Pieter",{"$error":"#N/A"},{"$error":"#N/A"},null,null,null,null,null,null,null,null,null,"Verdickt Stijn","Stijn Verdickt"]
["Verlooy Kaïn","b",1,1,1,"a",1,"a",1,1,1,1,"a",1,1,1,1,1,1,null,null,null,null,0,14,0,3,1,0,0,0,null,"Verlooy Kaïn",152.10540113481292,3,{"$f":"_xlfn.LET( _xlpm.i, INDEX($AL27:$BG27,1,MAX(1,MATCH($AJ$2,$B$4:$W$4,0))), IF( _xlpm.i = \"\", \"\", _xlpm.i ))","v":12.941176470588236},2,5.333333333333333,9.3333333333333339,18.571428571428573,10,0,7.5,0,5,8.5714285714285712,6.666666666666667,13.75,0,6.1538461538461542,14.444444444444445,10.666666666666666,6.25,16.923076923076923,12.941176470588236,0,0,0,0,null,{"$f":"INDEX($AL27:$BG27,1,MAX(1,MATCH($AJ$2,$B$4:$W$4,0)))","v":12.941176470588236},12.711176470588235,-0.22,null,152.10540113481292,151.87540113481293,-0.02,null,1,1151.8754011348128,-0.02,null,23,null,"","","",{"$f":"IF( CK27 = \"\", \"\", _xlfn.XLOOKUP( CK27, $A$253:$A$279, INDEX( $B$253:$W$279, , $AI$1 ), \"\" ))","v":""},null,null,null,"","","","","","",null,"","","",null,null,"","","","",null,null,null,null,null,null,null,null,null,null,"Langenaeker Maarten",null,"Langenaeker Maarten",{"$error":"#N/A"},{"$error":"#N/A"},null,null,null,null,null,null,null,null,null,"Verlooy Kaïn","Kaïn Verlooy"]
["Vermeylen Jason",1,1,1,1,1,1,"a","a","a","a","a","a","a","a","a","a","a","a",null,null,null,null,6,6,0.33333333333333331,12,0,0,0,0,null,"Vermeylen Jason",78.319264069264079,12,{"$f":"_xlfn.LET( _xlpm.i, INDEX($AL28:$BG28,1,MAX(1,MATCH($AJ$2,$B$4:$W$4,0))), IF( _xlpm.i = \"\", \"\", _xlpm.i ))","v":0},12,1.3333333333333333,13.333333333333334,12.857142857142858,18.75,4.5454545454545459,27.5,0,0,0,0,0,0,0,0,0,0,0,0,0,0,0,0,null,{"$f":"INDEX($AL28:$BG28,1,MAX(1,MATCH($AJ$2,$B$4:$W$4,0)))","v":0},{"$f":"BI28-BU28/100","v":-0.24},-0.24,null,78.319264069264079,{"$f":"BM28-BU28/100","v":78.079264069264084},-7.0000000000000007E-2,null,2,{"$f":"1000*BQ28+BM28-BU28/100","v":2078.0792640692644},-7.0000000000000007E-2,null,24,null,"","","",{"$f":"IF( CK28 = \"\", \"\", _xlfn.XLOOKUP( CK28, $A$253:$A$279, INDEX( $B$253:$W$279, , $AI$1 ), \"\" ))","v":""},null,null,null,"","","","","","",null,"","","",null,null,"","","","",null,null,null,null,null,null,null,null,null,null,"Hofmans Stijn",null,"Hofmans Stijn",{"$error":"#N/A"},{"$error":"#N/A"},null,null,null,null,null,null,null,null,null,"Vermeylen Jason","Jason Vermeylen"]
["Wouters Wim","b","b","b","b","b","b","b","b","b","b","b","b","b","b","b","b","b","b",null,null,null,null,0,0,0,0,18,0,0,{"$f":"COUNTIF(B29:W29,\"k\")","v":0},null,{"$f":"A29","v":"Wouters Wim"},{"$f":"IF(SUM(AL29:BG29)=0,\"\",SUM(AL29:BG29))","v":""},"",{"$f":"_xlfn.LET( _xlpm.i, INDEX($AL29:$BG29,1,MAX(1,MATCH($AJ$2,$B$4:$W$4,0))), IF( _xlpm.i = \"\", \"\", _xlpm.i ))","v":0},12,0,0,0,0,0,0,0,0,0,0,0,0,0,0,0,0,0,0,0,0,0,0,null,{"$f":"INDEX($AL29:$BG29,1,MAX(1,MATCH($AJ$2,$B$4:$W$4,0)))","v":0},{"$f":"BI29-BU29/100","v":-0.25},-0.25,null,0,{"$f":"BM29-BU29/100","v":-0.25},-0.18,null,0,{"$f":"1000*BQ29+BM29-BU29/100","v":-0.25},-0.18,null,25,null,"","","",{"$f":"IF( CK29 = \"\", \"\", _xlfn.XLOOKUP( CK29, $A$253:$A$279, INDEX( $B$253:$W$279, , $AI$1 ), \"\" ))","v":""},null,null,null,"","","","","",{"$f":"IFERROR(IF(CF31=\"\",\"\",ABS(CF31/CH31)),0)","v":""},null,"","","",null,null,"","","","",null,null,null,null,null,null,null,null,null,null,"Lenaerts Jordy",null,"Lenaerts Jordy",{"$error":"#N/A"},{"$error":"#N/A"},null,null,null,null,null,null,null,null,null,"Wouters Wim","Wim Wouters"]
["own-goals/ff-goals",null,null,null,null,null,null,null,null,null,null,null,null,null,null,null,null,null,null,null,null,null,null,0,null,0,0,0,0,0,0,null,"own-goals/ff-goals",{"$f":"IF(SUM(AL30:BG30)=0,\"\",SUM(AL30:BG30))","v":""},"",{"$f":"_xlfn.LET( _xlpm.i, INDEX($AL30:$BG30,1,MAX(1,MATCH($AJ$2,$B$4:$W$4,0))), IF( _xlpm.i = \"\", \"\", _xlpm.i ))","v":0},12,0,0,0,0,0,0,0,0,0,0,0,0,0,0,0,0,0,0,0,0,0,0,null,{"$f":"INDEX($AL30:$BG30,1,MAX(1,MATCH($AJ$2,$B$4:$W$4,0)))","v":0},{"$f":"BI30-BU30/100","v":-0.26},-0.26,null,{"$f":"SUM(AL30:BG30)","v":0},{"$f":"BM30-BU30/100","v":-0.26},-0.25,null,0,{"$f":"1000*BQ30+BM30-BU30/100","v":-0.26},-0.25,null,26,null,null,"",null,null,null,null,null,{"$f":"IF(CF30=\"\",\"\",BU30)","v":""},"",{"$f":"IF(INDEX($BM$5:$BM$31,MATCH(BO30,$BN$5:$BN$31,0))=0,\"\",INDEX($BM$5:$BM$31,MATCH(BO30,$BN$5:$BN$31,0)))","v":""},"","",{"$f":"IFERROR(IF(CF32=\"\",\"\",ABS(CF32/CH32)),0)","v":""},null,"","","",null,null,"","","","",null,null,null,null,null,null,null,null,null,null,"Hofmans Stijn",null,"Hofmans Stijn",{"$error":"#N/A"},{"$error":"#N/A"},null,null,null,null,null,null,null,null,null,"Beirinckx Geert","Geert Beirinckx"]
[null,null,null,null,null,null,null,null,null,null,null,null,null,null,null,null,null,null,null,null,null,null,null,null,null,null,null,null,null,null,null,null,"Beirinckx Geert",1.3333333333333333,20,{"$f":"_xlfn.LET( _xlpm.i, INDEX($AL31:$BG31,1,MAX(1,MATCH($AJ$2,$B$4:$W$4,0))), IF( _xlpm.i = \"\", \"\", _xlpm.i ))","v":0},12,0,1.3333333333333333,0,0,0,0,0,0,0,0,0,0,0,0,0,0,0,0,0,0,0,0,null,{"$f":"INDEX($AL31:$BG31,1,MAX(1,MATCH($AJ$2,$B$4:$W$4,0)))","v":0},-0.27,-0.27,null,1.3333333333333333,1.0633333333333332,-0.26,null,0,1.0633333333333332,-0.26,null,27,null,null,"",null,null,null,null,null,"","","","","","",null,"","",null,null,null,null,null,null,null,null,null,null,null,null,null,null,null,null,null,"De Vinster Glenn",null,"De Vinster Glenn",{"$error":"#N/A"},{"$error":"#N/A"}]
["Legende:",null,null,null,null,null,null,null,null,null,null,null,null,null,null,null,null,null,null,null,null,null,null,null,null,null,null,null,null,null,null,null,null,null,null,null,null,null,null,null,null,null,null,null,null,null,null,null,null,null,null,null,null,null,null,null,null,null,null,null,null,null,null,null,null,null,null,null,null,null,null,null,null,null,null,null,null,null,null,null,null,null,null,null,null,null,null,null,null,null,null,null,null,null,null,null,null,null,null,null,null,null,null,null,null,null,null,"Celis Ive",null,"Celis Ive",{"$error":"#N/A"},{"$error":"#N/A"}]
[null,null,null,null,null,null,null,null,null,null,null,null,null,null,null,null,null,null,null,null,null,null,null,null,null,null,null,null,null,null,null,null,"Niet toegekend",{"$f":"IF(SUM(AL33:BG33)=0,\"\",SUM(AL33:BG33))","v":""},{"$f":"IF(AH33=\"\",\"\",RANK(AH33,AH$5:AH$33))","v":""},{"$f":"IF(INDEX($AL33:$BG33,1,MAX(1,COUNT($B$4:$W$4)))=0,\"\",INDEX($AL33:$BG33,1,MAX(1,COUNT($B$4:$W$4))))","v":""},{"$f":"IF(AJ33=\"\",\"\",RANK(AJ33,AJ$5:AJ$32))","v":""},null,null,null,null,null,null,null,null,null,null,null,null,null,null,null,null,null,null,null,null,null,null,null,null,null,null,null,null,null,null,null,null,null,null,null,null,null,null,null,null,null,null,null,null,null,null,null,null,null,null,null,null,null,null,null,null,null,null,null,null,null,null,null,null,null,null,null,null,null,null,"Verlooy Kaïn",null,"Verlooy Kaïn",{"$error":"#N/A"},{"$error":"#N/A"}]
["Uitleg en afkorting",null,null,null,null,null,null,null,null,null,null,null,null,null,null,null,null,null,null,null,null,null,null,null,null,null,null,null,null,null,null,null,"Som",null,null,null,null,{"$f":"SUM( AL5:AL33 )","v":100},{"$f":"SUM( AM5:AM33 )","v":99.999999999999986},100,100,99.999999999999986,100,100,100,100.00000000000001,100,100,100.00000000000001,100,100,100,100,99.999999999999986,100,0,0,0,0,null,null,null,null,null,null,null,null,null,null,null,null,null,null,null,null,null,null,null,null,null,null,null,null,null,null,null,null,null,null,null,null,null,null,null,null,null,null,null,null,null,null,null,null,null,null,null,null,"Coolsaet Joy",null,"Coolsaet Joy",{"$error":"#N/A"},{"$error":"#N/A"}]
["Thuiswedstrijd","T",null,"Aantal doelpunten","Getal (Goals)",null,null,null,null,null,null,null,null,null,null,null,null,null,null,null,null,null,null,null,null,null,null,null,null,null,null,null,"Aantal invullers",null,null,null,null,{"$f":"AL34 / 5","v":20},{"$f":"AM34 / 5","v":19.999999999999996},20,20,19.999999999999996,20,20,20,20.000000000000004,20,20,20.000000000000004,20,20,20,20,19.999999999999996,20,0,0,0,0,null,null,null,null,null,null,null,null,null,null,null,null,null,null,null,null,null,null,null,null,null,null,null,null,null,null,null,null,null,null,null,null,null,null,null,null,null,null,null,null,null,null,null,null,null,null,null,null,"De Groof Maarten",null,"De Groof Maarten",{"$error":"#N/A"},{"$error":"#N/A"}]
["Uitwedstrijd","U",null,"Aantal assists","Getal (Assists)",null,null,null,null,null,null,null,null,null,null,null,null,null,null,null,null,null,null,null,null,null,null,null,null,null,null,null,"Winnaar(s)",null,null,null,null,{"$f":"IF( AL$34 = 0, \"\", _xlfn.TEXTJOIN( \" / \",TRUE,  _xlfn._xlws.FILTER( $AG$5:$AG$32, AL$5:AL$32 = LARGE( _xlfn.UNIQUE( AL$5:AL$32 ), 1 ))))","v":"De Groof Steven"},{"$f":"IF( AM$34 = 0, \"\", _xlfn.TEXTJOIN( \" / \",TRUE,  _xlfn._xlws.FILTER( $AG$5:$AG$32, AM$5:AM$32 = LARGE( _xlfn.UNIQUE( AM$5:AM$32 ), 1 ))))","v":"Hofmans Stijn"},{"$f":"IF( AN$34 = 0, \"\", _xlfn.TEXTJOIN( \" / \",TRUE,  _xlfn._xlws.FILTER( $AG$5:$AG$32, AN$5:AN$32 = LARGE( _xlfn.UNIQUE( AN$5:AN$32 ), 1 ))))","v":"De Groof Maarten"},{"$f":"IF( AO$34 = 0, \"\", _xlfn.TEXTJOIN( \" / \",TRUE,  _xlfn._xlws.FILTER( $AG$5:$AG$32, AO$5:AO$32 = LARGE( _xlfn.UNIQUE( AO$5:AO$32 ), 1 ))))","v":"De Groof Maarten / Vermeylen Jason"},{"$f":"IF( AP$34 = 0, \"\", _xlfn.TEXTJOIN( \" / \",TRUE,  _xlfn._xlws.FILTER( $AG$5:$AG$32, AP$5:AP$32 = LARGE( _xlfn.UNIQUE( AP$5:AP$32 ), 1 ))))","v":"Hofmans Stijn"},{"$f":"IF( AQ$34 = 0, \"\", _xlfn.TEXTJOIN( \" / \",TRUE,  _xlfn._xlws.FILTER( $AG$5:$AG$32, AQ$5:AQ$32 = LARGE( _xlfn.UNIQUE( AQ$5:AQ$32 ), 1 ))))","v":"Vermeylen Jason"},{"$f":"IF( AR$34 = 0, \"\", _xlfn.TEXTJOIN( \" / \",TRUE,  _xlfn._xlws.FILTER( $AG$5:$AG$32, AR$5:AR$32 = LARGE( _xlfn.UNIQUE( AR$5:AR$32 ), 1 ))))","v":"Celis Ive"},{"$f":"IF( AS$34 = 0, \"\", _xlfn.TEXTJOIN( \" / \",TRUE,  _xlfn._xlws.FILTER( $AG$5:$AG$32, AS$5:AS$32 = LARGE( _xlfn.UNIQUE( AS$5:AS$32 ), 1 ))))","v":"Beirinckx Wout / De Vinster Glenn"},{"$f":"IF( AT$34 = 0, \"\", _xlfn.TEXTJOIN( \" / \",TRUE,  _xlfn._xlws.FILTER( $AG$5:$AG$32, AT$5:AT$32 = LARGE( _xlfn.UNIQUE( AT$5:AT$32 ), 1 ))))","v":"Langenaeker Maarten"},{"$f":"IF( AU$34 = 0, \"\", _xlfn.TEXTJOIN( \" / \",TRUE,  _xlfn._xlws.FILTER( $AG$5:$AG$32, AU$5:AU$32 = LARGE( _xlfn.UNIQUE( AU$5:AU$32 ), 1 ))))","v":"Coolsaet Joy"},{"$f":"IF( AV$34 = 0, \"\", _xlfn.TEXTJOIN( \" / \",TRUE,  _xlfn._xlws.FILTER( $AG$5:$AG$32, AV$5:AV$32 = LARGE( _xlfn.UNIQUE( AV$5:AV$32 ), 1 ))))","v":"De Vinster Glenn"},{"$f":"IF( AW$34 = 0, \"\", _xlfn.TEXTJOIN( \" / \",TRUE,  _xlfn._xlws.FILTER( $AG$5:$AG$32, AW$5:AW$32 = LARGE( _xlfn.UNIQUE( AW$5:AW$32 ), 1 ))))","v":"De Vinster Glenn / Hofmans Stijn"},{"$f":"IF( AX$34 = 0, \"\", _xlfn.TEXTJOIN( \" / \",TRUE,  _xlfn._xlws.FILTER( $AG$5:$AG$32, AX$5:AX$32 = LARGE( _xlfn.UNIQUE( AX$5:AX$32 ), 1 ))))","v":"De Groof Steven"},{"$f":"IF( AY$34 = 0, \"\", _xlfn.TEXTJOIN( \" / \",TRUE,  _xlfn._xlws.FILTER( $AG$5:$AG$32, AY$5:AY$32 = LARGE( _xlfn.UNIQUE( AY$5:AY$32 ), 1 ))))","v":"Celis Ive"},{"$f":"IF( AZ$34 = 0, \"\", _xlfn.TEXTJOIN( \" / \",TRUE,  _xlfn._xlws.FILTER( $AG$5:$AG$32, AZ$5:AZ$32 = LARGE( _xlfn.UNIQUE( AZ$5:AZ$32 ), 1 ))))","v":"Celis Ive"},{"$f":"IF( BA$34 = 0, \"\", _xlfn.TEXTJOIN( \" / \",TRUE,  _xlfn._xlws.FILTER( $AG$5:$AG$32, BA$5:BA$32 = LARGE( _xlfn.UNIQUE( BA$5:BA$32 ), 1 ))))","v":"De Vinster Glenn"},{"$f":"IF( BB$34 = 0, \"\", _xlfn.TEXTJOIN( \" / \",TRUE,  _xlfn._xlws.FILTER( $AG$5:$AG$32, BB$5:BB$32 = LARGE( _xlfn.UNIQUE( BB$5:BB$32 ), 1 ))))","v":"Verlooy Kaïn"},{"$f":"IF( BC$34 = 0, \"\", _xlfn.TEXTJOIN( \" / \",TRUE,  _xlfn._xlws.FILTER( $AG$5:$AG$32, BC$5:BC$32 = LARGE( _xlfn.UNIQUE( BC$5:BC$32 ), 1 ))))","v":"De Vinster Glenn"},{"$f":"IF( BD$34 = 0, \"\", _xlfn.TEXTJOIN( \" / \",TRUE,  _xlfn._xlws.FILTER( $AG$5:$AG$32, BD$5:BD$32 = LARGE( _xlfn.UNIQUE( BD$5:BD$32 ), 1 ))))","v":""},{"$f":"IF( BE$34 = 0, \"\", _xlfn.TEXTJOIN( \" / \",TRUE,  _xlfn._xlws.FILTER( $AG$5:$AG$32, BE$5:BE$32 = LARGE( _xlfn.UNIQUE( BE$5:BE$32 ), 1 ))))","v":""},{"$f":"IF( BF$34 = 0, \"\", _xlfn.TEXTJOIN( \" / \",TRUE,  _xlfn._xlws.FILTER( $AG$5:$AG$32, BF$5:BF$32 = LARGE( _xlfn.UNIQUE( BF$5:BF$32 ), 1 ))))","v":""},{"$f":"IF( BG$34 = 0, \"\", _xlfn.TEXTJOIN( \" / \",TRUE,  _xlfn._xlws.FILTER( $AG$5:$AG$32, BG$5:BG$32 = LARGE( _xlfn.UNIQUE( BG$5:BG$32 ), 1 ))))","v":""},null,null,null,null,null,null,null,null,null,null,null,null,null,null,null,null,null,null,null,null,null,null,null,null,null,null,null,null,null,null,null,null,null,null,null,null,null,null,null,null,null,null,null,null,null,null,null,null,"De Groof Maarten",null,"De Groof Maarten",{"$error":"#N/A"},{"$error":"#N/A"}]
["Aanwezige speler","1 (Aanwezigheden)",null,"Strafschopdoelpunt","onderlijnd (Goals)",null,null,null,null,null,null,null,null,null,null,null,null,null,null,null,null,null,null,null,null,null,null,null,null,null,null,null,"Plaats 2",null,null,null,null,{"$f":"IF( AL$34 = 0, \"\", _xlfn.TEXTJOIN( \" / \",TRUE,  _xlfn._xlws.FILTER( $AG$5:$AG$32, AL$5:AL$32 = LARGE( _xlfn.UNIQUE( AL$5:AL$32 ), 2 ))))","v":"Van de Vondel Rob"},{"$f":"IF( AM$34 = 0, \"\", _xlfn.TEXTJOIN( \" / \",TRUE,  _xlfn._xlws.FILTER( $AG$5:$AG$32, AM$5:AM$32 = LARGE( _xlfn.UNIQUE( AM$5:AM$32 ), 2 ))))","v":"Vermeylen Jason"},{"$f":"IF( AN$34 = 0, \"\", _xlfn.TEXTJOIN( \" / \",TRUE,  _xlfn._xlws.FILTER( $AG$5:$AG$32, AN$5:AN$32 = LARGE( _xlfn.UNIQUE( AN$5:AN$32 ), 2 ))))","v":"Verlooy Kaïn"},{"$f":"IF( AO$34 = 0, \"\", _xlfn.TEXTJOIN( \" / \",TRUE,  _xlfn._xlws.FILTER( $AG$5:$AG$32, AO$5:AO$32 = LARGE( _xlfn.UNIQUE( AO$5:AO$32 ), 2 ))))","v":"Elst Pieter"},{"$f":"IF( AP$34 = 0, \"\", _xlfn.TEXTJOIN( \" / \",TRUE,  _xlfn._xlws.FILTER( $AG$5:$AG$32, AP$5:AP$32 = LARGE( _xlfn.UNIQUE( AP$5:AP$32 ), 2 ))))","v":"Langenaeker Maarten"},{"$f":"IF( AQ$34 = 0, \"\", _xlfn.TEXTJOIN( \" / \",TRUE,  _xlfn._xlws.FILTER( $AG$5:$AG$32, AQ$5:AQ$32 = LARGE( _xlfn.UNIQUE( AQ$5:AQ$32 ), 2 ))))","v":"Hofmans Stijn"},{"$f":"IF( AR$34 = 0, \"\", _xlfn.TEXTJOIN( \" / \",TRUE,  _xlfn._xlws.FILTER( $AG$5:$AG$32, AR$5:AR$32 = LARGE( _xlfn.UNIQUE( AR$5:AR$32 ), 2 ))))","v":"Lenaerts Jordy"},{"$f":"IF( AS$34 = 0, \"\", _xlfn.TEXTJOIN( \" / \",TRUE,  _xlfn._xlws.FILTER( $AG$5:$AG$32, AS$5:AS$32 = LARGE( _xlfn.UNIQUE( AS$5:AS$32 ), 2 ))))","v":"Hofmans Stijn"},{"$f":"IF( AT$34 = 0, \"\", _xlfn.TEXTJOIN( \" / \",TRUE,  _xlfn._xlws.FILTER( $AG$5:$AG$32, AT$5:AT$32 = LARGE( _xlfn.UNIQUE( AT$5:AT$32 ), 2 ))))","v":"De Vinster Glenn"},{"$f":"IF( AU$34 = 0, \"\", _xlfn.TEXTJOIN( \" / \",TRUE,  _xlfn._xlws.FILTER( $AG$5:$AG$32, AU$5:AU$32 = LARGE( _xlfn.UNIQUE( AU$5:AU$32 ), 2 ))))","v":"Celis Ive"},{"$f":"IF( AV$34 = 0, \"\", _xlfn.TEXTJOIN( \" / \",TRUE,  _xlfn._xlws.FILTER( $AG$5:$AG$32, AV$5:AV$32 = LARGE( _xlfn.UNIQUE( AV$5:AV$32 ), 2 ))))","v":"Verlooy Kaïn"},{"$f":"IF( AW$34 = 0, \"\", _xlfn.TEXTJOIN( \" / \",TRUE,  _xlfn._xlws.FILTER( $AG$5:$AG$32, AW$5:AW$32 = LARGE( _xlfn.UNIQUE( AW$5:AW$32 ), 2 ))))","v":"Coolsaet Joy"},{"$f":"IF( AX$34 = 0, \"\", _xlfn.TEXTJOIN( \" / \",TRUE,  _xlfn._xlws.FILTER( $AG$5:$AG$32, AX$5:AX$32 = LARGE( _xlfn.UNIQUE( AX$5:AX$32 ), 2 ))))","v":"De Groof Maarten"},{"$f":"IF( AY$34 = 0, \"\", _xlfn.TEXTJOIN( \" / \",TRUE,  _xlfn._xlws.FILTER( $AG$5:$AG$32, AY$5:AY$32 = LARGE( _xlfn.UNIQUE( AY$5:AY$32 ), 2 ))))","v":"De Groof Maarten"},{"$f":"IF( AZ$34 = 0, \"\", _xlfn.TEXTJOIN( \" / \",TRUE,  _xlfn._xlws.FILTER( $AG$5:$AG$32, AZ$5:AZ$32 = LARGE( _xlfn.UNIQUE( AZ$5:AZ$32 ), 2 ))))","v":"De Groof Maarten"},{"$f":"IF( BA$34 = 0, \"\", _xlfn.TEXTJOIN( \" / \",TRUE,  _xlfn._xlws.FILTER( $AG$5:$AG$32, BA$5:BA$32 = LARGE( _xlfn.UNIQUE( BA$5:BA$32 ), 2 ))))","v":"De Groof Steven"},{"$f":"IF( BB$34 = 0, \"\", _xlfn.TEXTJOIN( \" / \",TRUE,  _xlfn._xlws.FILTER( $AG$5:$AG$32, BB$5:BB$32 = LARGE( _xlfn.UNIQUE( BB$5:BB$32 ), 2 ))))","v":"Elst Pieter"},{"$f":"IF( BC$34 = 0, \"\", _xlfn.TEXTJOIN( \" / \",TRUE,  _xlfn._xlws.FILTER( $AG$5:$AG$32, BC$5:BC$32 = LARGE( _xlfn.UNIQUE( BC$5:BC$32 ), 2 ))))","v":"Elst Pieter / Verlooy Kaïn"},{"$f":"IF( BD$34 = 0, \"\", _xlfn.TEXTJOIN( \" / \",TRUE,  _xlfn._xlws.FILTER( $AG$5:$AG$32, BD$5:BD$32 = LARGE( _xlfn.UNIQUE( BD$5:BD$32 ), 2 ))))","v":""},{"$f":"IF( BE$34 = 0, \"\", _xlfn.TEXTJOIN( \" / \",TRUE,  _xlfn._xlws.FILTER( $AG$5:$AG$32, BE$5:BE$32 = LARGE( _xlfn.UNIQUE( BE$5:BE$32 ), 2 ))))","v":""},{"$f":"IF( BF$34 = 0, \"\", _xlfn.TEXTJOIN( \" / \",TRUE,  _xlfn._xlws.FILTER( $AG$5:$AG$32, BF$5:BF$32 = LARGE( _xlfn.UNIQUE( BF$5:BF$32 ), 2 ))))","v":""},{"$f":"IF( BG$34 = 0, \"\", _xlfn.TEXTJOIN( \" / \",TRUE,  _xlfn._xlws.FILTER( $AG$5:$AG$32, BG$5:BG$32 = LARGE( _xlfn.UNIQUE( BG$5:BG$32 ), 2 ))))","v":""},null,null,null,null,null,null,null,null,null,null,null,null,null,null,null,null,null,null,null,null,null,null,null,null,null,null,null,null,null,null,null,null,null,null,null,null,null,null,null,null,null,null,null,null,null,null,null,null,"De Groof Maarten",null,"De Groof Maarten",{"$error":"#N/A"},{"$error":"#N/A"}]
["Afwezige speler/supporter","a",null,"Niet van toepassing","(blanco)",null,null,null,null,null,null,null,null,null,null,null,null,null,null,null,null,null,null,null,null,null,null,null,null,null,null,null,"Plaats 3",null,null,null,null,{"$f":"IF( AL$34 = 0, \"\", _xlfn.TEXTJOIN( \" / \",TRUE,  _xlfn._xlws.FILTER( $AG$5:$AG$32, AL$5:AL$32 = LARGE( _xlfn.UNIQUE( AL$5:AL$32 ), 3 ))))","v":"Gielis Bernd"},{"$f":"IF( AM$34 = 0, \"\", _xlfn.TEXTJOIN( \" / \",TRUE,  _xlfn._xlws.FILTER( $AG$5:$AG$32, AM$5:AM$32 = LARGE( _xlfn.UNIQUE( AM$5:AM$32 ), 3 ))))","v":"De Groof Maarten"},{"$f":"IF( AN$34 = 0, \"\", _xlfn.TEXTJOIN( \" / \",TRUE,  _xlfn._xlws.FILTER( $AG$5:$AG$32, AN$5:AN$32 = LARGE( _xlfn.UNIQUE( AN$5:AN$32 ), 3 ))))","v":"Vermeylen Jason"},{"$f":"IF( AO$34 = 0, \"\", _xlfn.TEXTJOIN( \" / \",TRUE,  _xlfn._xlws.FILTER( $AG$5:$AG$32, AO$5:AO$32 = LARGE( _xlfn.UNIQUE( AO$5:AO$32 ), 3 ))))","v":"Verlooy Kaïn"},{"$f":"IF( AP$34 = 0, \"\", _xlfn.TEXTJOIN( \" / \",TRUE,  _xlfn._xlws.FILTER( $AG$5:$AG$32, AP$5:AP$32 = LARGE( _xlfn.UNIQUE( AP$5:AP$32 ), 3 ))))","v":"De Groof Maarten"},{"$f":"IF( AQ$34 = 0, \"\", _xlfn.TEXTJOIN( \" / \",TRUE,  _xlfn._xlws.FILTER( $AG$5:$AG$32, AQ$5:AQ$32 = LARGE( _xlfn.UNIQUE( AQ$5:AQ$32 ), 3 ))))","v":"Langenaeker Maarten"},{"$f":"IF( AR$34 = 0, \"\", _xlfn.TEXTJOIN( \" / \",TRUE,  _xlfn._xlws.FILTER( $AG$5:$AG$32, AR$5:AR$32 = LARGE( _xlfn.UNIQUE( AR$5:AR$32 ), 3 ))))","v":"Coolsaet Joy / De Groof Maarten / Langenaeker Maarten"},{"$f":"IF( AS$34 = 0, \"\", _xlfn.TEXTJOIN( \" / \",TRUE,  _xlfn._xlws.FILTER( $AG$5:$AG$32, AS$5:AS$32 = LARGE( _xlfn.UNIQUE( AS$5:AS$32 ), 3 ))))","v":"De Groof Steven"},{"$f":"IF( AT$34 = 0, \"\", _xlfn.TEXTJOIN( \" / \",TRUE,  _xlfn._xlws.FILTER( $AG$5:$AG$32, AT$5:AT$32 = LARGE( _xlfn.UNIQUE( AT$5:AT$32 ), 3 ))))","v":"Van de Vondel Rob"},{"$f":"IF( AU$34 = 0, \"\", _xlfn.TEXTJOIN( \" / \",TRUE,  _xlfn._xlws.FILTER( $AG$5:$AG$32, AU$5:AU$32 = LARGE( _xlfn.UNIQUE( AU$5:AU$32 ), 3 ))))","v":"De Groof Steven / Van Dessel Dieter"},{"$f":"IF( AV$34 = 0, \"\", _xlfn.TEXTJOIN( \" / \",TRUE,  _xlfn._xlws.FILTER( $AG$5:$AG$32, AV$5:AV$32 = LARGE( _xlfn.UNIQUE( AV$5:AV$32 ), 3 ))))","v":"Verdickt Stijn"},{"$f":"IF( AW$34 = 0, \"\", _xlfn.TEXTJOIN( \" / \",TRUE,  _xlfn._xlws.FILTER( $AG$5:$AG$32, AW$5:AW$32 = LARGE( _xlfn.UNIQUE( AW$5:AW$32 ), 3 ))))","v":"Van Dessel Dieter"},{"$f":"IF( AX$34 = 0, \"\", _xlfn.TEXTJOIN( \" / \",TRUE,  _xlfn._xlws.FILTER( $AG$5:$AG$32, AX$5:AX$32 = LARGE( _xlfn.UNIQUE( AX$5:AX$32 ), 3 ))))","v":"Verdickt Stijn"},{"$f":"IF( AY$34 = 0, \"\", _xlfn.TEXTJOIN( \" / \",TRUE,  _xlfn._xlws.FILTER( $AG$5:$AG$32, AY$5:AY$32 = LARGE( _xlfn.UNIQUE( AY$5:AY$32 ), 3 ))))","v":"Verlooy Kaïn"},{"$f":"IF( AZ$34 = 0, \"\", _xlfn.TEXTJOIN( \" / \",TRUE,  _xlfn._xlws.FILTER( $AG$5:$AG$32, AZ$5:AZ$32 = LARGE( _xlfn.UNIQUE( AZ$5:AZ$32 ), 3 ))))","v":"Hofmans Stijn"},{"$f":"IF( BA$34 = 0, \"\", _xlfn.TEXTJOIN( \" / \",TRUE,  _xlfn._xlws.FILTER( $AG$5:$AG$32, BA$5:BA$32 = LARGE( _xlfn.UNIQUE( BA$5:BA$32 ), 3 ))))","v":"Beirinckx Wout / De Groof Maarten"},{"$f":"IF( BB$34 = 0, \"\", _xlfn.TEXTJOIN( \" / \",TRUE,  _xlfn._xlws.FILTER( $AG$5:$AG$32, BB$5:BB$32 = LARGE( _xlfn.UNIQUE( BB$5:BB$32 ), 3 ))))","v":"De Groof Steven / Gielis Bernd"},{"$f":"IF( BC$34 = 0, \"\", _xlfn.TEXTJOIN( \" / \",TRUE,  _xlfn._xlws.FILTER( $AG$5:$AG$32, BC$5:BC$32 = LARGE( _xlfn.UNIQUE( BC$5:BC$32 ), 3 ))))","v":"Celis Ive / Gielis Bernd"},{"$f":"IF( BD$34 = 0, \"\", _xlfn.TEXTJOIN( \" / \",TRUE,  _xlfn._xlws.FILTER( $AG$5:$AG$32, BD$5:BD$32 = LARGE( _xlfn.UNIQUE( BD$5:BD$32 ), 3 ))))","v":""},{"$f":"IF( BE$34 = 0, \"\", _xlfn.TEXTJOIN( \" / \",TRUE,  _xlfn._xlws.FILTER( $AG$5:$AG$32, BE$5:BE$32 = LARGE( _xlfn.UNIQUE( BE$5:BE$32 ), 3 ))))","v":""},{"$f":"IF( BF$34 = 0, \"\", _xlfn.TEXTJOIN( \" / \",TRUE,  _xlfn._xlws.FILTER( $AG$5:$AG$32, BF$5:BF$32 = LARGE( _xlfn.UNIQUE( BF$5:BF$32 ), 3 ))))","v":""},{"$f":"IF( BG$34 = 0, \"\", _xlfn.TEXTJOIN( \" / \",TRUE,  _xlfn._xlws.FILTER( $AG$5:$AG$32, BG$5:BG$32 = LARGE( _xlfn.UNIQUE( BG$5:BG$32 ), 3 ))))","v":""},null,null,null,null,null,null,null,null,null,null,null,null,null,null,null,null,null,null,null,null,null,null,null,null,null,null,null,null,null,null,null,null,null,null,null,null,null,null,null,null,null,null,null,null,null,null,null,null,"De Groof Steven",null,"De Groof Steven",{"$error":"#N/A"},{"$error":"#N/A"}]
["Aanwezige supporter","as",null,"Gele kaart",null,null,null,null,null,null,null,null,null,null,null,null,null,null,null,null,null,null,null,null,null,null,null,null,null,null,null,null,null,null,null,null,null,null,null,null,null,null,null,null,null,null,null,null,null,null,null,null,null,null,null,null,null,null,null,null,null,null,null,null,null,null,null,null,null,null,null,null,null,null,null,null,null,null,null,null,null,null,null,null,null,null,null,null,null,null,null,null,null,null,null,null,null,null,null,null,null,null,null,null,null,null,null,"Elst Pieter",null,"Elst Pieter",{"$error":"#N/A"},{"$error":"#N/A"}]
["Blessure","b",null,"Rechtstreekse rode kaart",null,null,null,null,null,null,null,null,null,null,null,null,null,null,null,null,null,null,null,null,null,null,null,null,null,null,null,null,"Aantal spelers met punten",null,null,null,null,{"$f":"COUNTIF(AL$5:AL$30,\">0\")","v":10},12,12,11,10,11,11,11,12,13,12,12,12,13,11,11,11,11,0,0,0,0,null,null,null,null,null,null,null,null,null,null,null,null,null,null,null,null,null,null,null,null,null,null,null,null,null,null,null,null,null,null,null,null,null,null,null,null,null,null,null,null,null,null,null,null,null,null,null,null,"Elst Pieter / Verlooy Kaïn",null,"Elst Pieter","Verlooy Kaïn",{"$error":"#N/A"}]
["Keeper","k",null,"2 gele kaarten en dus rode kaart",null,null,null,null,null,null,null,null,null,null,null,null,null,null,null,null,null,null,null,null,null,null,null,null,null,null,null,null,null,null,null,null,null,null,null,null,null,null,null,null,null,null,null,null,null,null,null,null,null,null,null,null,null,null,null,null,null,null,null,null,null,null,null,null,null,null,null,null,null,null,null,null,null,null,null,null,null,null,null,null,null,null,null,null,null,null,null,null,null,null,null,null,null,null,null,null,null,null,null,null,null,null,null,"Gielis Bernd",null,"Gielis Bernd",{"$error":"#N/A"},{"$error":"#N/A"}]
["Niet aangesloten","na",null,"Gele kaart en nadien rechtstreekse rode kaart",null,null,null,null,null,null,null,null,null,null,null,null,null,null,null,null,null,null,null,null,null,null,null,null,null,null,null,null,null,null,null,null,null,null,null,null,null,null,null,null,null,null,null,null,null,null,null,null,null,null,null,null,null,null,null,null,null,null,null,null,null,null,null,null,null,null,null,null,null,null,null,null,null,null,null,null,null,null,null,null,null,null,null,null,null,null,null,null,null,null,null,null,null,null,null,null,null,null,null,null,null,null,null,"De Groof Maarten",null,"De Groof Maarten",{"$error":"#N/A"},{"$error":"#N/A"}]
["Niet gespeeld","ng",null,"Opmerking indien strafschopdoelpunt en 1 of meer extra doelpunten",null,null,null,null,null,null,null,null,null,null,null,null,null,null,null,null,null,null,null,null,null,null,null,null,null,null,null,null,null,null,null,null,null,null,null,null,null,null,null,null,null,null,null,null,null,null,null,null,null,null,null,null,null,null,null,null,null,null,null,null,null,null,null,null,null,null,null,null,null,null,null,null,null,null,null,null,null,null,null,null,null,null,null,null,null,null,null,null,null,null,null,null,null,null,null,null,null,null,null,null,null,null,null,"Vermeylen Jason",null,"Vermeylen Jason",{"$error":"#N/A"},{"$error":"#N/A"}]
["Ploegverantwoordelijke","p",null,null,null,null,null,null,null,null,null,null,null,null,null,null,null,null,null,null,null,null,null,null,null,null,null,null,null,null,null,null,null,null,null,null,null,null,null,null,null,null,null,null,null,null,null,null,null,null,null,null,null,null,null,null,null,null,null,null,null,null,null,null,null,null,null,null,null,null,null,null,null,null,null,null,null,null,null,null,null,null,null,null,null,null,null,null,null,null,null,null,null,null,null,null,null,null,null,null,null,null,null,null,null,null,null,"Verlooy Kaïn",null,"Verlooy Kaïn",{"$error":"#N/A"},{"$error":"#N/A"}]
["Schorsing","s",null,"Aantal forfaitnederlagen",0,null,null,null,null,null,null,null,null,null,null,null,null,null,null,null,null,null,null,null,null,null,null,null,null,null,null,null,null,null,null,null,null,null,null,null,null,null,null,null,null,null,null,null,null,null,null,null,null,null,null,null,null,null,null,null,null,null,null,null,null,null,null,null,null,null,null,null,null,null,null,null,null,null,null,null,null,null,null,null,null,null,null,null,null,null,null,null,null,null,null,null,null,null,null,null,null,null,null,null,null,null,null,"De Groof Maarten",null,"De Groof Maarten",{"$error":"#N/A"},{"$error":"#N/A"}]
["Trainer","t",null,null,null,null,null,null,null,null,null,null,null,null,null,null,null,null,null,null,null,null,null,null,null,null,null,null,null,null,null,null,null,null,null,null,null,null,null,null,null,null,null,null,null,null,null,null,null,null,null,null,null,null,null,null,null,null,null,null,null,null,null,null,null,null,null,null,null,null,null,null,null,null,null,null,null,null,null,null,null,null,null,null,null,null,null,null,null,null,null,null,null,null,null,null,null,null,null,null,null,null,null,null,null,null,null,"Langenaeker Maarten",null,"Langenaeker Maarten",{"$error":"#N/A"},{"$error":"#N/A"}]
[null,null,null,null,null,null,null,null,null,null,null,null,null,null,null,null,null,null,null,null,null,null,null,null,null,null,null,null,null,null,null,null,null,null,null,null,null,null,null,null,null,null,null,null,null,null,null,null,null,null,null,null,null,null,null,null,null,null,null,null,null,null,null,null,null,null,null,null,null,null,null,null,null,null,null,null,null,null,null,null,null,null,null,null,null,null,null,null,null,null,null,null,null,null,null,null,null,null,null,null,null,null,null,null,null,null,null,"Coolsaet Joy / De Groof Maarten / Langenaeker Maarten",null,"Coolsaet Joy","De Groof Maarten","Langenaeker Maarten"]
[null,null,null,null,null,null,null,null,null,null,null,null,null,null,null,null,null,null,null,null,null,null,null,null,null,null,null,null,null,null,null,null,null,null,null,null,null,null,null,null,null,null,null,null,null,null,null,null,null,null,null,null,null,null,null,null,null,null,null,null,null,null,null,null,null,null,null,null,null,null,null,null,null,null,null,null,null,null,null,null,null,null,null,null,null,null,null,null,null,null,null,null,null,null,null,null,null,null,null,null,null,null,null,null,null,null,null,"De Groof Steven",null,"De Groof Steven",{"$error":"#N/A"},{"$error":"#N/A"}]
[null,{"$f":"B1","v":"Pouma United (U)"},"Paradeske (T)","De Vrede (U)","Bariton (T)","Racing Emblem (U)","Jolika (T)","Boerenbond (U)","Goka (U)","Hombeek (T)","Hoje (U)","Antverpia 98 (U)","Pouma United (T)","Paradeske (U)","Bariton (U)","Racing Emblem (T)","De Vrede (T)","Jolika (U)","Boerenbond (T)","Goka (T)","Hombeek (U)","Hoje (T)","Antverpia 98 (T)",null,null,null,null,null,null,null,null,null,null,null,null,null,null,null,null,null,null,null,null,null,null,null,null,null,null,null,null,null,null,null,null,null,null,null,null,null,null,null,null,null,null,null,null,null,null,null,null,null,null,null,null,null,null,null,null,null,null,null,null,null,null,null,null,null,null,null,null,null,null,null,null,null,null,null,null,null,null,null,null,null,null,null,null,"Van de Vondel Rob",null,"Van de Vondel Rob",{"$error":"#N/A"},{"$error":"#N/A"}]
[null,null,null,null,null,null,null,null,null,null,null,null,null,null,null,null,null,null,null,null,null,null,null,null,null,null,null,null,null,null,null,null,null,null,null,null,null,null,null,null,null,null,null,null,null,null,null,null,null,null,null,null,null,null,null,null,null,null,null,null,null,null,null,null,null,null,null,null,null,null,null,null,null,null,null,null,null,null,null,null,null,null,null,null,null,null,null,null,null,null,null,null,null,null,null,null,null,null,null,null,null,null,null,null,null,null,null,"De Groof Steven / Van Dessel Dieter",null,"De Groof Steven","Van Dessel Dieter",{"$error":"#N/A"}]
["Goals",{"$f":"SUM( B53:B79 )","v":2},3,1,2,3,4,0,2,2,2,5,4,1,1,3,6,2,2,0,0,0,0,null,null,null,null,null,null,null,null,null,{"$f":"_xlfn.LET( _xlpm.d, _xlfn.CHOOSECOLS( _xlfn.TAKE( _xlfn.SORTBY( A53:X80, X53:X80, -1 ), 5 ), 1, -1 ),\n_xlpm.f, _xlfn._xlws.FILTER( _xlpm.d, _xlfn.TAKE( _xlpm.d, , -1 ) > 0, \"No data\" ),\n_xlfn.HSTACK( _xlfn.XLOOKUP( _xlfn.TAKE( _xlpm.f, , 1 ), $DR$5:$DR$30, $DS$5:$DS$30 ), _xlfn.TAKE( _xlpm.f, , -1 )) )","v":"Stijn Hofmans"},12,null,null,null,null,null,null,null,null,null,null,null,null,null,null,null,null,null,null,null,null,null,null,null,null,null,null,null,null,null,null,null,null,null,null,null,null,null,null,null,null,null,null,null,null,null,null,null,null,null,null,null,null,null,null,null,null,null,null,null,null,null,null,null,null,null,null,null,null,null,null,null,null,null,"Verdickt Stijn",null,"Verdickt Stijn",{"$error":"#N/A"},{"$error":"#N/A"}]
[{"$f":"SUM( B51:W51 )","v":45},null,null,null,null,null,null,null,null,null,null,null,null,null,null,null,null,null,null,null,null,null,null,null,null,null,null,null,null,null,null,null,"Glenn De Vinster",11,null,null,null,null,null,null,null,null,null,null,null,null,null,null,null,null,null,null,null,null,null,null,null,null,null,null,null,null,null,null,null,null,null,null,null,null,null,null,null,null,null,null,null,null,null,null,null,null,null,null,null,null,null,null,null,null,null,null,null,null,null,null,null,null,null,null,null,null,null,null,null,null,null,"Van Dessel Dieter",null,"Van Dessel Dieter",{"$error":"#N/A"},{"$error":"#N/A"}]
[{"$f":"A5","v":"Beirinckx Jurgen"},null,null,null,null,null,null,null,null,null,null,null,null,null,null,null,null,null,null,null,null,null,null,{"$f":"SUM( B53:W53 ) + COUNTIF( B53:W53, \"ng\" )","v":0},null,null,null,null,null,null,null,null,"Maarten De Groof",6,null,null,null,null,null,null,null,null,null,null,null,null,null,null,null,null,null,null,null,null,null,null,null,null,null,null,null,null,null,null,null,null,null,null,null,null,null,null,null,null,null,null,null,null,null,null,null,null,null,null,null,null,null,null,null,null,null,null,null,null,null,null,null,null,null,null,null,null,null,null,null,null,null,"Verdickt Stijn",null,"Verdickt Stijn",{"$error":"#N/A"},{"$error":"#N/A"}]
["Beirinckx Sven",null,null,null,null,null,null,null,null,null,null,null,null,null,null,null,null,null,null,null,null,null,null,{"$f":"SUM( B54:W54 ) + COUNTIF( B54:W54, \"ng\" )","v":0},null,null,null,null,null,null,null,null,"Jason Vermeylen",6,null,null,null,null,null,null,null,null,null,null,null,null,null,null,null,null,null,null,null,null,null,null,null,null,null,null,null,null,null,null,null,null,null,null,null,null,null,null,null,null,null,null,null,null,null,null,null,null,null,null,null,null,null,null,null,null,null,null,null,null,null,null,null,null,null,null,null,null,null,null,null,null,null,"Verlooy Kaïn",null,"Verlooy Kaïn",{"$error":"#N/A"},{"$error":"#N/A"}]
["Beirinckx Wout",null,null,null,null,null,null,null,null,null,null,null,null,null,null,null,null,null,null,null,null,null,null,{"$f":"SUM( B55:W55 ) + COUNTIF( B55:W55, \"ng\" )","v":0},null,null,null,null,null,null,null,null,"Steven De Groof",4,null,null,null,null,null,null,null,null,null,null,null,null,null,null,null,null,null,null,null,null,null,null,null,null,null,null,null,null,null,null,null,null,null,null,null,null,null,null,null,null,null,null,null,null,null,null,null,null,null,null,null,null,null,null,null,null,null,null,null,null,null,null,null,null,null,null,null,null,null,null,null,null,null,"Hofmans Stijn",null,"Hofmans Stijn",{"$error":"#N/A"},{"$error":"#N/A"}]
["Boes Dieuwer",null,null,null,null,null,null,null,null,null,null,null,null,null,null,null,null,null,null,null,null,null,null,0,null,null,null,null,null,null,null,null,null,null,null,null,null,null,null,null,null,null,null,null,null,null,null,null,null,null,null,null,null,null,null,null,null,null,null,null,null,null,null,null,null,null,null,null,null,null,null,null,null,null,null,null,null,null,null,null,null,null,null,null,null,null,null,null,null,null,null,null,null,null,null,null,null,null,null,null,null,null,null,null,null,null,null,"Beirinckx Wout / De Groof Maarten",null,"Beirinckx Wout","De Groof Maarten",{"$error":"#N/A"}]
["Celis Ive",null,null,null,null,null,null,null,null,null,null,null,null,null,null,null,null,null,null,null,null,null,null,0,null,null,null,null,null,null,null,null,null,null,null,null,null,null,null,null,null,null,null,null,null,null,null,null,null,null,null,null,null,null,null,null,null,null,null,null,null,null,null,null,null,null,null,null,null,null,null,null,null,null,null,null,null,null,null,null,null,null,null,null,null,null,null,null,null,null,null,null,null,null,null,null,null,null,null,null,null,null,null,null,null,null,null,"De Groof Steven / Gielis Bernd",null,"De Groof Steven","Gielis Bernd",{"$error":"#N/A"}]
["Coolsaet Joy",null,null,null,null,null,null,null,null,null,null,null,null,null,null,null,null,null,null,null,null,null,null,0,null,null,null,null,null,null,null,null,null,null,null,null,null,null,null,null,null,null,null,null,null,null,null,null,null,null,null,null,null,null,null,null,null,null,null,null,null,null,null,null,null,null,null,null,null,null,null,null,null,null,null,null,null,null,null,null,null,null,null,null,null,null,null,null,null,null,null,null,null,null,null,null,null,null,null,null,null,null,null,null,null,null,null,"Celis Ive / Gielis Bernd",null,"Celis Ive","Gielis Bernd",{"$error":"#N/A"}]
["De Clerck Tom",null,null,null,null,null,null,null,null,null,null,null,null,null,null,null,null,null,null,null,null,null,null,0]
["De Groof Maarten",null,null,1,1,null,null,null,null,null,1,null,null,null,1,1,1,null,null,null,null,null,null,6]
["De Groof Steven",null,null,null,null,null,null,null,null,null,null,null,null,1,null,1,1,1,null,null,null,null,null,4]
["De Swert Erlend",null,null,null,null,null,null,null,null,null,null,null,null,null,null,null,null,null,null,null,null,null,null,0]
["De Vinster Glenn",null,null,null,null,null,null,null,1,2,null,2,3,null,null,null,2,null,1,null,null,null,null,{"$f":"SUM( B63:W63 ) + COUNTIF( B63:W63, \"ng\" )","v":11}]
["Elst Pieter",null,null,null,null,null,null,null,null,null,null,null,null,null,null,null,null,null,null,null,null,null,null,0]
["Gielis Bernd",null,null,null,null,null,null,null,null,null,null,null,null,null,null,null,null,null,null,null,null,null,null,0]
["Gielis Wim",null,null,null,null,null,null,null,null,null,null,1,null,null,null,null,null,null,null,null,null,null,null,1]
["Hofmans Stijn",null,2,null,null,3,null,null,1,null,null,1,null,null,null,1,2,1,1,null,null,null,null,12]
["Langenaeker Maarten",null,null,null,null,null,null,null,null,null,null,null,null,null,null,null,null,null,null,null,null,null,null,0]
["Lenaerts Jordy",null,null,null,null,null,null,null,null,null,null,null,null,null,null,null,null,null,null,null,null,null,null,0]
["Op De Beeck Maarten",null,null,null,null,null,null,null,null,null,null,null,null,null,null,null,null,null,null,null,null,null,null,0]
["Stevens Siebe",null,null,null,null,null,null,null,null,null,null,null,null,null,null,null,null,null,null,null,null,null,null,0]
["Van de Vondel Rob",2,null,null,null,null,null,null,null,null,null,null,null,null,null,null,null,null,null,null,null,null,null,2]
["Van Dessel Dieter",null,null,null,null,null,null,null,null,null,1,null,1,null,null,null,null,null,null,null,null,null,null,2]
["Verdickt Stijn",null,null,null,null,null,null,null,null,null,null,1,null,null,null,null,null,null,null,null,null,null,null,1]
["Verlooy Kaïn",null,null,null,null,null,null,null,null,null,null,null,null,null,null,null,null,null,null,null,null,null,null,0]
["Vermeylen Jason",null,1,null,1,null,4,null,null,null,null,null,null,null,null,null,null,null,null,null,null,null,null,6]
["Wouters Wim",null,null,null,null,null,null,null,null,null,null,null,null,null,null,null,null,null,null,null,null,null,null,0]
["Own-goals/ff-goals",null,null,null,null,null,null,null,null,null,null,null,null,null,null,null,null,null,null,null,null,null,null,0]
["Beirinckx Geert",null,null,null,null,null,null,null,null,null,null,null,null,null,null,null,null,null,null,null,null,null,null,0]
[]
[]
[]
[]
[]
[]
[]
[]
[]
[]
[]
[]
[]
[]
[]
[]
[]
[]
[]
[]
[]
["Assists",{"$f":"SUM( B103:B129 )","v":2},1,0,2,3,4,0,1,2,1,4,3,0,1,2,5,2,2,0,0,0,0,null,null,null,null,null,null,null,null,null,{"$f":"_xlfn.LET( _xlpm.d, _xlfn.CHOOSECOLS( _xlfn.TAKE( _xlfn.SORTBY( A103:X130, X103:X130, -1 ), 5 ), 1, -1 ),\n_xlpm.f, _xlfn._xlws.FILTER( _xlpm.d, _xlfn.TAKE( _xlpm.d, , -1 ) > 0, \"No data\" ),\n_xlfn.HSTACK( _xlfn.XLOOKUP( _xlfn.TAKE( _xlpm.f, , 1 ), $DR$5:$DR$30, $DS$5:$DS$30 ), _xlfn.TAKE( _xlpm.f, , -1 )) )","v":"Stijn Hofmans"},11]
[{"$f":"SUM( B101:W101 )","v":35},null,null,null,null,null,null,null,null,null,null,null,null,null,null,null,null,null,null,null,null,null,null,null,null,null,null,null,null,null,null,null,"Steven De Groof",5]
[{"$f":"A5","v":"Beirinckx Jurgen"},null,null,null,null,null,null,null,null,null,null,null,null,null,null,null,null,null,null,null,null,null,null,{"$f":"SUM( B103:W103 ) + COUNTIF( B103:W103, \"ng\" )","v":0},null,null,null,null,null,null,null,null,"Glenn De Vinster",5]
["Beirinckx Sven",null,null,null,null,null,null,null,null,null,null,null,null,null,null,null,null,null,null,null,null,null,null,{"$f":"SUM( B104:W104 ) + COUNTIF( B104:W104, \"ng\" )","v":0},null,null,null,null,null,null,null,null,"Stijn Verdickt",4]
["Beirinckx Wout",null,null,null,null,null,null,null,null,null,null,null,null,null,null,null,null,null,null,null,null,null,null,{"$f":"SUM( B105:W105 ) + COUNTIF( B105:W105, \"ng\" )","v":0},null,null,null,null,null,null,null,null,"Ive Celis",3]
["Boes Dieuwer",null,null,null,null,null,null,null,null,null,null,null,null,null,null,null,null,null,null,null,null,null,null,0]
["Celis Ive",null,null,null,1,null,null,null,null,null,null,null,null,null,null,1,null,null,1,null,null,null,null,3]
["Coolsaet Joy",null,null,null,null,null,null,null,null,null,null,null,null,null,null,null,null,null,null,null,null,null,null,0]
["De Clerck Tom",null,null,null,null,null,null,null,null,null,null,null,null,null,null,null,null,null,null,null,null,null,null,0]
["De Groof Maarten",null,null,null,null,2,null,null,null,null,null,null,null,null,null,null,null,null,null,null,null,null,null,2]
["De Groof Steven",1,null,null,null,null,1,null,1,null,null,null,null,null,null,null,1,null,1,null,null,null,null,5]
["De Swert Erlend",null,null,null,null,null,null,null,null,null,null,null,null,null,null,null,null,null,null,null,null,null,null,0]
["De Vinster Glenn",null,null,null,null,null,null,null,null,null,null,1,null,null,1,null,2,1,null,null,null,null,null,{"$f":"SUM( B113:W113 ) + COUNTIF( B113:W113, \"ng\" )","v":5}]
["Elst Pieter",null,1,null,null,null,null,null,null,null,null,null,null,null,null,null,null,null,null,null,null,null,null,1]
["Gielis Bernd",null,null,null,null,null,null,null,null,null,null,null,null,null,null,null,null,null,null,null,null,null,null,0]
["Gielis Wim",null,null,null,null,null,null,null,null,null,null,null,null,null,null,null,null,null,null,null,null,null,null,0]
["Hofmans Stijn",1,null,null,null,null,3,null,null,1,null,1,3,null,null,null,1,1,null,null,null,null,null,11]
["Langenaeker Maarten",null,null,null,null,1,null,null,null,null,null,null,null,null,null,null,null,null,null,null,null,null,null,1]
["Lenaerts Jordy",null,null,null,null,null,null,null,null,1,null,null,null,null,null,null,null,null,null,null,null,null,null,1]
["Op De Beeck Maarten",null,null,null,null,null,null,null,null,null,null,null,null,null,null,null,null,null,null,null,null,null,null,0]
["Stevens Siebe",null,null,null,null,null,null,null,null,null,null,null,null,null,null,null,null,null,null,null,null,null,null,0]
["Van de Vondel Rob",null,null,null,null,null,null,null,null,null,null,null,null,null,null,null,null,null,null,null,null,null,null,0]
["Van Dessel Dieter",null,null,null,null,null,null,null,null,null,null,1,null,null,null,null,null,null,null,null,null,null,null,1]
["Verdickt Stijn",null,null,null,null,null,null,null,null,null,1,1,null,null,null,1,1,null,null,null,null,null,null,4]
["Verlooy Kaïn",null,null,null,1,null,null,null,null,null,null,null,null,null,null,null,null,null,null,null,null,null,null,1]
["Vermeylen Jason",null,null,null,null,null,null,null,null,null,null,null,null,null,null,null,null,null,null,null,null,null,null,0]
["Wouters Wim",null,null,null,null,null,null,null,null,null,null,null,null,null,null,null,null,null,null,null,null,null,null,0]
["Own-goals/ff-goals",null,null,null,null,null,null,null,null,null,null,null,null,null,null,null,null,null,null,null,null,null,null,0]
["Beirinckx Geert",null,null,null,null,null,null,null,null,null,null,null,null,null,null,null,null,null,null,null,null,null,null,0]
[]
[]
[]
[]
[]
[]
[]
[]
[]
[]
[]
[]
[]
[]
[]
[]
[]
[]
[]
[]
[]
["In actie",{"$f":"SUM( B153:B180 )","v":13},{"$f":"SUM( C153:C180 )","v":12},12,12,13,12,10,10,13,12,12,13,12,13,13,13,11,12,0,0,0,0,null,null,null,null,null,null,null,null,null,{"$f":"_xlfn.LET( _xlpm.d, _xlfn.CHOOSECOLS( _xlfn.TAKE( _xlfn.SORTBY( A153:X180, X153:X180, -1 ), 5 ), 1, -1 ),\n_xlpm.f, _xlfn._xlws.FILTER( _xlpm.d, _xlfn.TAKE( _xlpm.d, , -1 ) > 0, \"No data\" ),\n_xlfn.HSTACK( _xlfn.XLOOKUP( _xlfn.TAKE( _xlpm.f, , 1 ), $DR$5:$DR$30, $DS$5:$DS$30 ), _xlfn.TAKE( _xlpm.f, , -1 )) )","v":"Steven De Groof"},16]
[{"$f":"AVERAGEIF( B151:W151, \">0\", B151:W151 )","v":12.111111111111111},null,null,null,null,null,null,null,null,null,null,null,null,null,null,null,null,null,null,null,null,null,null,null,null,null,null,null,null,null,null,null,"Wout Beirinckx",15]
[{"$f":"A5","v":"Beirinckx Jurgen"},null,null,null,null,null,null,null,null,null,null,1,null,null,null,null,null,null,null,null,null,null,null,{"$f":"COUNTA( B153:W153 )","v":1},null,null,null,null,null,null,null,null,"Maarten De Groof",15]
["Beirinckx Sven",null,null,null,null,null,null,null,null,null,null,null,null,null,null,null,null,null,null,null,null,null,null,{"$f":"COUNTA( B154:W154 )","v":0},null,null,null,null,null,null,null,null,"Stijn Hofmans",15]
["Beirinckx Wout",1,1,1,1,1,1,1,"k",1,null,null,null,1,"k","k","k","k","k",null,null,null,null,15,null,null,null,null,null,null,null,null,"Maarten Langenaeker",15]
["Boes Dieuwer",1,null,1,null,1,null,1,1,null,null,null,1,null,1,1,1,1,null,null,null,null,null,10]
["Celis Ive",null,null,null,1,1,1,1,1,null,1,null,null,1,1,1,1,1,1,null,null,null,null,12]
["Coolsaet Joy",null,1,null,1,null,1,1,1,1,1,1,1,1,1,1,1,null,1,null,null,null,null,14]
["De Clerck Tom",null,null,null,null,null,null,null,null,null,null,null,null,null,null,null,null,null,null,null,null,null,null,0]
["De Groof Maarten",1,1,1,1,1,null,1,1,1,1,1,1,1,1,1,1,null,null,null,null,null,null,15]
["De Groof Steven",1,1,1,1,1,1,1,1,1,1,null,null,1,1,1,1,1,1,null,null,null,null,16]
["De Swert Erlend",1,1,1,null,1,1,null,null,null,1,1,1,null,1,null,null,null,null,null,null,null,null,9]
["De Vinster Glenn",null,null,null,null,null,null,null,1,1,1,1,1,null,1,1,1,1,1,null,null,null,null,10]
["Elst Pieter",1,1,1,1,1,null,null,null,null,1,null,1,null,null,1,1,1,1,null,null,null,null,11]
["Gielis Bernd",1,1,1,1,null,1,null,null,1,1,1,null,null,null,1,1,1,1,null,null,null,null,12]
["Gielis Wim",1,null,null,1,1,null,1,1,1,null,1,1,1,1,1,1,1,1,null,null,null,null,14]
["Hofmans Stijn",1,1,1,null,1,1,null,1,1,null,1,1,1,1,1,1,1,1,null,null,null,null,15]
["Langenaeker Maarten","k","k","k","k","k","k","k",null,"k","k","k",1,1,1,null,null,1,1,null,null,null,null,15]
["Lenaerts Jordy",null,null,null,null,1,null,1,null,1,1,1,1,null,null,1,null,null,null,null,null,null,null,7]
["Op De Beeck Maarten",null,null,null,null,null,null,null,null,null,null,null,null,null,null,null,null,null,null,null,null,null,null,0]
["Stevens Siebe",1,null,null,null,null,null,null,null,null,null,null,null,null,null,null,null,null,null,null,null,null,null,1]
["Van de Vondel Rob",1,1,1,1,1,1,1,1,1,null,null,1,1,null,null,null,null,null,null,null,null,null,11]
["Van Dessel Dieter",1,null,1,1,1,1,1,null,1,1,1,1,1,1,null,1,1,1,null,null,null,null,15]
["Verdickt Stijn",null,1,null,null,null,1,null,null,1,1,1,1,1,1,1,1,null,1,null,null,null,null,11]
["Verlooy Kaïn",null,1,1,1,null,1,null,1,1,1,1,null,1,1,1,1,1,1,null,null,null,null,14]
["Vermeylen Jason",1,1,1,1,1,1,null,null,null,null,null,null,null,null,null,null,null,null,null,null,null,null,6]
["Wouters Wim",null,null,null,null,null,null,null,null,null,null,null,null,null,null,null,null,null,null,null,null,null,null,0]
["Own-goals/ff-goals",null,null,null,null,null,null,null,null,null,null,null,null,null,null,null,null,null,null,null,null,null,null,0]
["Beirinckx Geert",null,null,null,null,null,null,null,null,null,null,null,null,null,null,null,null,null,null,null,null,null,null,0]
[]
[]
[]
[]
[]
[]
[]
[]
[]
[]
[]
[]
[]
[]
[]
[]
[]
[]
[]
[]
[]
["Kaarten",{"$f":"COUNTIF( B203:B229, \"geel\" )","v":0},0,2,0,0,0,0,0,0,1,0,0,1,0,3,1,1,2,0,0,0,0,null,null,null,null,null,null,null,null,null,{"$f":"_xlfn.LET( _xlpm.d, _xlfn.CHOOSECOLS( _xlfn.TAKE( _xlfn.SORTBY( A203:X230, X203:X230, -1 ), 5 ), 1, -1 ),\n_xlpm.f, _xlfn._xlws.FILTER( _xlpm.d, _xlfn.TAKE( _xlpm.d, , -1 ) > 0, \"No data\" ),\n_xlfn.HSTACK( _xlfn.XLOOKUP( _xlfn.TAKE( _xlpm.f, , 1 ), $DR$5:$DR$30, $DS$5:$DS$30 ), _xlfn.TAKE( _xlpm.f, , -1 )) )","v":"Dieter Van Dessel"},3]
[{"$f":"SUM( B201:W202 )","v":11},{"$f":"COUNTIF( B203:B229, \"rood\" )","v":0},0,0,0,0,0,0,0,0,0,0,0,0,0,0,0,0,0,0,0,0,0,null,null,null,null,null,null,null,null,null,"Ive Celis",2]
[{"$f":"A5","v":"Beirinckx Jurgen"},null,null,null,null,null,null,null,null,null,null,null,null,null,null,null,null,null,null,null,null,null,null,{"$f":"COUNTIF( B203:W203, \"<>\" )","v":0},null,null,null,null,null,null,null,null,"Joy Coolsaet",1]
["Beirinckx Sven",null,null,null,null,null,null,null,null,null,null,null,null,null,null,null,null,null,null,null,null,null,null,{"$f":"COUNTIF( B204:W204, \"<>\" )","v":0},null,null,null,null,null,null,null,null,"Glenn De Vinster",1]
["Beirinckx Wout",null,null,null,null,null,null,null,null,null,null,null,null,null,null,null,null,null,null,null,null,null,null,{"$f":"COUNTIF( B205:W205, \"<>\" )","v":0},null,null,null,null,null,null,null,null,"Maarten Langenaeker",1]
["Boes Dieuwer",null,null,null,null,null,null,null,null,null,null,null,null,null,null,null,null,null,null,null,null,null,null,0]
["Celis Ive",null,null,null,null,null,null,null,null,null,null,null,null,"geel",null,"geel",null,null,null,null,null,null,null,2]
["Coolsaet Joy",null,null,null,null,null,null,null,null,null,null,null,null,null,null,null,null,null,"geel",null,null,null,null,1]
["De Clerck Tom",null,null,null,null,null,null,null,null,null,null,null,null,null,null,null,null,null,null,null,null,null,null,0]
["De Groof Maarten",null,null,null,null,null,null,null,null,null,null,null,null,null,null,null,null,null,null,null,null,null,null,0]
["De Groof Steven",null,null,null,null,null,null,null,null,null,null,null,null,null,null,null,null,null,null,null,null,null,null,0]
["De Swert Erlend",null,null,null,null,null,null,null,null,null,null,null,null,null,null,null,null,null,null,null,null,null,null,0]
["De Vinster Glenn",null,null,null,null,null,null,null,null,null,null,null,null,null,null,"geel",null,null,null,null,null,null,null,{"$f":"COUNTIF( B213:W213, \"<>\" )","v":1}]
["Elst Pieter",null,null,null,null,null,null,null,null,null,null,null,null,null,null,null,null,null,null,null,null,null,null,0]
["Gielis Bernd",null,null,null,null,null,null,null,null,null,null,null,null,null,null,null,null,null,null,null,null,null,null,0]
["Gielis Wim",null,null,null,null,null,null,null,null,null,null,null,null,null,null,null,null,null,null,null,null,null,null,0]
["Hofmans Stijn",null,null,null,null,null,null,null,null,null,null,null,null,null,null,null,null,null,null,null,null,null,null,0]
["Langenaeker Maarten",null,null,null,null,null,null,null,null,null,null,null,null,null,null,null,null,"geel",null,null,null,null,null,1]
["Lenaerts Jordy",null,null,null,null,null,null,null,null,null,null,null,null,null,null,null,null,null,null,null,null,null,null,0]
["Op De Beeck Maarten",null,null,null,null,null,null,null,null,null,null,null,null,null,null,null,null,null,null,null,null,null,null,0]
["Stevens Siebe",null,null,null,null,null,null,null,null,null,null,null,null,null,null,null,null,null,null,null,null,null,null,0]
["Van de Vondel Rob",null,null,"geel",null,null,null,null,null,null,null,null,null,null,null,null,null,null,null,null,null,null,null,1]
["Van Dessel Dieter",null,null,null,null,null,null,null,null,null,"geel",null,null,null,null,null,"geel",null,"geel",null,null,null,null,3]
["Verdickt Stijn",null,null,null,null,null,null,null,null,null,null,null,null,null,null,"geel",null,null,null,null,null,null,null,1]
["Verlooy Kaïn",null,null,"geel",null,null,null,null,null,null,null,null,null,null,null,null,null,null,null,null,null,null,null,1]
["Vermeylen Jason",null,null,null,null,null,null,null,null,null,null,null,null,null,null,null,null,null,null,null,null,null,null,0]
["Wouters Wim",null,null,null,null,null,null,null,null,null,null,null,null,null,null,null,null,null,null,null,null,null,null,0]
["Own-goals/ff-goals",null,null,null,null,null,null,null,null,null,null,null,null,null,null,null,null,null,null,null,null,null,null,0]
["Beirinckx Geert",null,null,null,null,null,null,null,null,null,null,null,null,null,null,null,null,null,null,null,null,null,null,0]
[]
[]
[]
[]
[]
[]
[]
[]
[]
[]
[]
[]
[]
[]
[]
[]
[]
[]
[]
[]
[]
["MVDM",{"$f":"SUM( B253:B279 )","v":75},75,70,80,110,80,65,60,70,75,80,75,65,90,75,80,65,85,0,0,0,0,null,null,null,null,null,null,null,null,null,{"$f":"_xlfn.LET( _xlpm.d, _xlfn.CHOOSECOLS( _xlfn.TAKE( _xlfn.SORTBY( A253:X280, X253:X280, -1 ), 5 ), 1, -1 ),\n_xlpm.f, _xlfn._xlws.FILTER( _xlpm.d, _xlfn.TAKE( _xlpm.d, , -1 ) > 0, \"No data\" ),\n_xlfn.HSTACK( _xlfn.XLOOKUP( _xlfn.TAKE( _xlpm.f, , 1 ), $DR$5:$DR$30, $DS$5:$DS$30 ), _xlfn.TAKE( _xlpm.f, , -1 )) )","v":"Stijn Hofmans"},150]
[{"$f":"SUM( B251:W251 )","v":1375},null,null,null,null,null,null,null,null,null,null,null,null,null,null,null,null,null,null,null,null,null,null,null,null,null,null,null,null,null,null,null,"Maarten De Groof",141]
[{"$f":"A5","v":"Beirinckx Jurgen"},null,null,null,null,null,null,null,null,null,null,0,null,null,1,null,null,null,null,null,null,null,null,{"$f":"SUM( B253:W253 )","v":1},null,null,null,null,null,null,null,null,"Kaïn Verlooy",115]
["Beirinckx Sven",null,null,null,null,null,null,null,null,null,null,null,null,null,null,null,null,null,null,null,null,null,null,{"$f":"SUM( B254:W254 )","v":0},null,null,null,null,null,null,null,null,"Glenn De Vinster",109]
["Beirinckx Wout",0,0,2,6,2,1,5,11,1,null,null,null,4,12,3,11,3,5,null,null,null,null,{"$f":"SUM( B255:W255 )","v":66},null,null,null,null,null,null,null,null,"Steven De Groof",106]
["Boes Dieuwer",0,null,0,null,0,null,1,2,null,null,null,2,null,7,1,0,1,null,null,null,null,null,14]
["Celis Ive",null,null,null,7,13,7,10,4,null,9,null,null,6,17,14,4,2,10,null,null,null,null,103]
["Coolsaet Joy",null,4,null,0,null,0,8,2,3,13,6,9,3,3,0,0,null,0,null,null,null,null,51]
["De Clerck Tom",null,null,null,null,null,null,null,null,null,null,null,null,null,null,null,null,null,null,null,null,null,null,0]
["De Groof Maarten",5,8,14,15,14,null,8,5,6,7,4,5,10,16,13,11,null,null,null,null,null,null,141]
["De Groof Steven",18,6,8,0,4,2,3,7,0,8,null,null,11,4,8,12,8,7,null,null,null,null,106]
["De Swert Erlend",0,1,1,null,0,0,null,null,null,2,1,2,null,4,null,null,null,null,null,null,null,null,11]
["De Vinster Glenn",null,null,null,null,null,null,null,11,13,7,19,17,null,4,5,14,6,13,null,null,null,null,{"$f":"SUM( B263:W263 )","v":109}]
["Elst Pieter",null,6,3,13,3,null,null,null,null,1,null,4,null,null,4,4,10,11,null,null,null,null,59]
["Gielis Bernd",12,4,2,4,null,7,null,null,4,5,4,null,null,null,6,7,8,10,null,null,null,null,73]
["Gielis Wim",0,null,null,1,0,null,1,1,2,null,6,1,3,0,0,0,0,0,null,null,null,null,15]
["Hofmans Stijn",10,13,5,null,32,15,null,9,5,null,7,17,1,3,9,10,7,7,null,null,null,null,150]
["Langenaeker Maarten",1,7,3,5,25,10,8,null,14,3,6,4,6,5,null,null,3,6,null,null,null,null,106]
["Lenaerts Jordy",null,null,null,null,0,null,9,null,3,3,2,0,null,null,0,null,null,null,null,null,null,null,17]
["Op De Beeck Maarten",null,null,null,null,null,null,null,null,null,null,null,null,null,null,null,null,null,null,null,null,null,null,0]
["Stevens Siebe",1,null,null,null,null,null,null,null,null,null,null,null,null,null,null,null,null,null,null,null,null,null,1]
["Van de Vondel Rob",16,6,5,4,11,3,6,5,11,null,null,4,5,null,null,null,null,1,null,null,null,null,77]
["Van Dessel Dieter",7,null,5,2,1,6,6,null,2,8,5,8,3,1,null,1,6,4,null,null,null,null,65]
["Verdickt Stijn",null,2,null,null,null,1,null,null,0,4,9,2,9,0,4,1,null,0,null,null,null,null,32]
["Verlooy Kaïn",4,7,13,8,null,6,null,3,6,5,11,null,4,13,8,5,11,11,null,null,null,null,115]
["Vermeylen Jason",1,10,9,15,5,22,null,null,null,null,null,null,null,null,null,null,null,null,null,null,null,null,62]
["Wouters Wim",null,null,null,null,null,null,null,null,null,null,null,null,null,null,null,null,null,null,null,null,null,null,0]
["Own-goals/ff-goals",null,null,null,null,null,null,null,null,null,null,null,null,null,null,null,null,null,null,null,null,null,null,0]
["Beirinckx Geert",null,1,null,null,null,null,null,null,null,null,null,null,null,null,null,null,null,null,null,null,null,null,1]
[]
[]
[]
[]
[]
[]
[]
[]
[]
[]
[]
[]
[]
[]
[]
[]
[]
[]
[]
[]
[]
["MVDM - herwogen",{"$f":"SUM( B303:B330 )","v":100},{"$f":"SUM( C303:C330 )","v":99.999999999999986},100,100,99.999999999999986,100,100,100,100.00000000000001,100,100,100.00000000000001,100,100,100,100,99.999999999999986,100,0,0,0,0,null,null,null,null,null,null,null,null,null,{"$f":"_xlfn.LET( _xlpm.d, _xlfn.CHOOSECOLS( _xlfn.TAKE( _xlfn.SORTBY( A303:X330, X303:X330, -1 ), 5 ), 1, -1 ),\n_xlpm.f, _xlfn._xlws.FILTER( _xlpm.d, _xlfn.TAKE( _xlpm.d, , -1 ) > 0, \"No data\" ),\n_xlfn.HSTACK( _xlfn.XLOOKUP( _xlfn.TAKE( _xlpm.f, , 1 ), $DR$5:$DR$30, $DS$5:$DS$30 ), _xlfn.TAKE( _xlpm.f, , -1 )) )","v":"Stijn Hofmans"},187.58627646862942]
[{"$f":"SUM( B301:W301 )","v":1800},null,null,null,null,null,null,null,null,null,null,null,null,null,null,null,null,null,null,null,null,null,null,null,null,null,null,null,null,null,null,null,"Maarten De Groof",183.26878676878675]
[{"$f":"A5","v":"Beirinckx Jurgen"},null,null,null,null,null,null,null,null,null,null,0,null,null,1.1111111111111112,null,null,null,null,null,null,null,null,{"$f":"SUM( B303:W303 )","v":1.1111111111111112},null,null,null,null,null,null,null,null,"Kaïn Verlooy",152.10540113481292]
["Beirinckx Sven",null,null,null,null,null,null,null,null,null,null,null,null,null,null,null,null,null,null,null,null,null,null,{"$f":"SUM( B304:W304 )","v":0},null,null,null,null,null,null,null,null,"Glenn De Vinster",145.79075989370108]
["Beirinckx Wout",0,0,2.8571428571428572,7.5,1.8181818181818181,1.25,7.6923076923076925,18.333333333333332,1.4285714285714286,null,null,null,6.1538461538461542,13.333333333333334,4,13.75,4.615384615384615,5.882352941176471,null,null,null,null,{"$f":"SUM( B305:W305 )","v":88.614454173277693},null,null,null,null,null,null,null,null,"Steven De Groof",144.09082747318041]
["Boes Dieuwer",0,null,0,null,0,null,1.5384615384615385,3.3333333333333335,null,null,null,2.6666666666666665,null,7.7777777777777777,1.3333333333333333,0,1.5384615384615385,null,null,null,null,null,18.188034188034187]
["Celis Ive",null,null,null,8.75,11.818181818181818,8.75,15.384615384615385,6.666666666666667,null,12,null,null,9.2307692307692299,18.888888888888889,18.666666666666668,5,3.0769230769230771,11.764705882352942,null,null,null,null,129.99741761506468]
["Coolsaet Joy",null,5.333333333333333,null,0,null,0,12.307692307692308,3.3333333333333335,4.2857142857142856,17.333333333333332,7.5,12,4.615384615384615,3.3333333333333335,0,0,null,0,null,null,null,null,70.04212454212454]
["De Clerck Tom",null,null,null,null,null,null,null,null,null,null,null,null,null,null,null,null,null,null,null,null,null,null,0]
["De Groof Maarten",6.666666666666667,10.666666666666666,20,18.75,12.727272727272727,null,12.307692307692308,8.3333333333333339,8.5714285714285712,9.3333333333333339,5,6.666666666666667,15.384615384615385,17.777777777777779,17.333333333333332,13.75,null,null,null,null,null,null,183.26878676878675]
["De Groof Steven",24,8,11.428571428571429,0,3.6363636363636362,2.5,4.615384615384615,11.666666666666666,0,10.666666666666666,null,null,16.923076923076923,4.4444444444444446,10.666666666666666,15,12.307692307692308,8.235294117647058,null,null,null,null,144.09082747318041]
["De Swert Erlend",0,1.3333333333333333,1.4285714285714286,null,0,0,null,null,null,2.6666666666666665,1.25,2.6666666666666665,null,4.4444444444444446,null,null,null,null,null,null,null,null,13.78968253968254]
["De Vinster Glenn",null,null,null,null,null,null,null,18.333333333333332,18.571428571428573,9.3333333333333339,23.75,22.666666666666668,null,4.4444444444444446,6.666666666666667,17.5,9.2307692307692299,15.294117647058824,null,null,null,null,{"$f":"SUM( B313:W313 )","v":145.79075989370108}]
["Elst Pieter",null,8,4.2857142857142856,16.25,2.7272727272727271,null,null,null,null,1.3333333333333333,null,5.333333333333333,null,null,5.333333333333333,5,15.384615384615385,12.941176470588236,null,null,null,null,76.588778868190644]
["Gielis Bernd",16,5.333333333333333,2.8571428571428572,5,null,8.75,null,null,5.7142857142857144,6.666666666666667,5,null,null,null,8,8.75,12.307692307692308,11.764705882352942,null,null,null,null,96.143826761473818]
["Gielis Wim",0,null,null,1.25,0,null,1.5384615384615385,1.6666666666666667,2.8571428571428572,null,7.5,1.3333333333333333,4.615384615384615,0,0,0,0,0,null,null,null,null,20.760989010989007]
["Hofmans Stijn",13.333333333333334,17.333333333333332,7.1428571428571432,null,29.09090909090909,18.75,null,15,7.1428571428571432,null,8.75,22.666666666666668,1.5384615384615385,3.3333333333333335,12,12.5,10.76923076923077,8.235294117647058,null,null,null,null,187.58627646862942]
["Langenaeker Maarten",1.3333333333333333,9.3333333333333339,4.2857142857142856,6.25,22.727272727272727,12.5,12.307692307692308,null,20,4,7.5,5.333333333333333,9.2307692307692299,5.5555555555555554,null,null,4.615384615384615,7.0588235294117645,null,null,null,null,132.03121225180047]
["Lenaerts Jordy",null,null,null,null,0,null,13.846153846153847,null,4.2857142857142856,4,2.5,0,null,null,0,null,null,null,null,null,null,null,24.631868131868131]
["Op De Beeck Maarten",null,null,null,null,null,null,null,null,null,null,null,null,null,null,null,null,null,null,null,null,null,null,0]
["Stevens Siebe",1.3333333333333333,null,null,null,null,null,null,null,null,null,null,null,null,null,null,null,null,null,null,null,null,null,1.3333333333333333]
["Van de Vondel Rob",21.333333333333332,8,7.1428571428571432,5,10,3.75,9.2307692307692299,8.3333333333333339,15.714285714285714,null,null,5.333333333333333,7.6923076923076925,null,null,null,null,1.1764705882352942,null,null,null,null,102.70669036845506]
["Van Dessel Dieter",9.3333333333333339,null,7.1428571428571432,2.5,0.90909090909090906,7.5,9.2307692307692299,null,2.8571428571428572,10.666666666666666,6.25,10.666666666666666,4.615384615384615,1.1111111111111112,null,1.25,9.2307692307692299,4.7058823529411766,null,null,null,null,87.969674116732932]
["Verdickt Stijn",null,2.6666666666666665,null,null,null,1.25,null,null,0,5.333333333333333,11.25,2.6666666666666665,13.846153846153847,0,5.333333333333333,1.25,null,0,null,null,null,null,43.596153846153847]
["Verlooy Kaïn",5.333333333333333,9.3333333333333339,18.571428571428573,10,null,7.5,null,5,8.5714285714285712,6.666666666666667,13.75,null,6.1538461538461542,14.444444444444445,10.666666666666666,6.25,16.923076923076923,12.941176470588236,null,null,null,null,152.10540113481292]
["Vermeylen Jason",1.3333333333333333,13.333333333333334,12.857142857142858,18.75,4.5454545454545459,27.5,null,null,null,null,null,null,null,null,null,null,null,null,null,null,null,null,78.319264069264079]
["Wouters Wim",null,null,null,null,null,null,null,null,null,null,null,null,null,null,null,null,null,null,null,null,null,null,0]
["Own-goals/ff-goals",null,null,null,null,null,null,null,null,null,null,null,null,null,null,null,null,null,null,null,null,null,null,0]
["Beirinckx Geert",null,1.3333333333333333,null,null,null,null,null,null,null,null,null,null,null,null,null,null,null,null,null,null,null,null,1.3333333333333333]

{"sheet":"Topschutters","index":4,"n_rows":9,"n_cols":4,"rows_kept":9,"cut":false,"hidden":false,"merged":[]}
[{"$f":"_xlfn.SORTBY( _xlfn._xlws.FILTER( spelersstatistieken!A5:A29, spelersstatistieken!X5:X29 > 0 ), _xlfn._xlws.FILTER( spelersstatistieken!X5:X29, spelersstatistieken!X5:X29 > 0 ), -1 )","v":"Hofmans Stijn"},{"$f":"INDEX( spelersstatistieken!X5:X29,_xlfn.ANCHORARRAY( D1) )","v":12},{"$f":"_xlfn.TEXTJOIN( \", \", TRUE, IF( ISNUMBER( INDEX( spelersstatistieken!$B$5:$W$30, D1, 0 )), spelersstatistieken!$B$1:$W$1 &\n                                             \" (\" & INDEX( spelersstatistieken!$B$5:$W$30, D1, 0 ) & \")\", \"\" ))","v":"Pouma United (U) (1), Paradeske (T) (1), De Vrede (U) (1), Racing Emblem (U) (1), Jolika (T) (1), Goka (U) (1), Hombeek (T) (1), Antverpia 98 (U) (1), Pouma United (T) (1), Paradeske (U) (1), Bariton (U) (1), Racing Emblem (T) (1), De Vrede (T) (1), Jolika (U) (1), Boerenbond (T) (1)"},{"$f":"MATCH(_xlfn.ANCHORARRAY( A1), spelersstatistieken!$A$5:$A$29, 0 )","v":15}]
["De Vinster Glenn",11,{"$f":"_xlfn.TEXTJOIN( \", \", TRUE, IF( ISNUMBER( INDEX( spelersstatistieken!$B$5:$W$30, D2, 0 )), spelersstatistieken!$B$1:$W$1 &\n                                             \" (\" & INDEX( spelersstatistieken!$B$5:$W$30, D2, 0 ) & \")\", \"\" ))","v":"Goka (U) (1), Hombeek (T) (1), Hoje (U) (1), Antverpia 98 (U) (1), Pouma United (T) (1), Bariton (U) (1), Racing Emblem (T) (1), De Vrede (T) (1), Jolika (U) (1), Boerenbond (T) (1)"},11]
["De Groof Maarten",6,{"$f":"_xlfn.TEXTJOIN( \", \", TRUE, IF( ISNUMBER( INDEX( spelersstatistieken!$B$5:$W$30, D3, 0 )), spelersstatistieken!$B$1:$W$1 &\n                                             \" (\" & INDEX( spelersstatistieken!$B$5:$W$30, D3, 0 ) & \")\", \"\" ))","v":"Pouma United (U) (1), Paradeske (T) (1), De Vrede (U) (1), Bariton (T) (1), Racing Emblem (U) (1), Boerenbond (U) (1), Goka (U) (1), Hombeek (T) (1), Hoje (U) (1), Antverpia 98 (U) (1), Pouma United (T) (1), Paradeske (U) (1), Bariton (U) (1), Racing Emblem (T) (1), De Vrede (T) (1)"},8]
["Vermeylen Jason",6,{"$f":"_xlfn.TEXTJOIN( \", \", TRUE, IF( ISNUMBER( INDEX( spelersstatistieken!$B$5:$W$30, D4, 0 )), spelersstatistieken!$B$1:$W$1 &\n                                             \" (\" & INDEX( spelersstatistieken!$B$5:$W$30, D4, 0 ) & \")\", \"\" ))","v":"Pouma United (U) (1), Paradeske (T) (1), De Vrede (U) (1), Bariton (T) (1), Racing Emblem (U) (1), Jolika (T) (1)"},24]
["De Groof Steven",4,{"$f":"_xlfn.TEXTJOIN( \", \", TRUE, IF( ISNUMBER( INDEX( spelersstatistieken!$B$5:$W$30, D5, 0 )), spelersstatistieken!$B$1:$W$1 &\n                                             \" (\" & INDEX( spelersstatistieken!$B$5:$W$30, D5, 0 ) & \")\", \"\" ))","v":"Pouma United (U) (1), Paradeske (T) (1), De Vrede (U) (1), Bariton (T) (1), Racing Emblem (U) (1), Jolika (T) (1), Boerenbond (U) (1), Goka (U) (1), Hombeek (T) (1), Hoje (U) (1), Paradeske (U) (1), Bariton (U) (1), Racing Emblem (T) (1), De Vrede (T) (1), Jolika (U) (1), Boerenbond (T) (1)"},9]
["Van de Vondel Rob",2,null,20]
["Van Dessel Dieter",2,null,21]
["Gielis Wim",1,null,14]
["Verdickt Stijn",1,null,22]

{"sheet":"Stats","index":5,"n_rows":19,"n_cols":4,"rows_kept":19,"cut":false,"hidden":true,"merged":[]}
[null,"Albatros Paradeske"]
[null,"Aanwezigheden","Goals","Assists"]
["Van de Vondel Rob",1]
["Stevens Siebe",1,2]
["Langenaeker Maarten",1]
["De Groof Steven",1]
["De Groof Maarten",1]
["Hofmans Stijn",1,2]
["Van Dessel Dieter",1]
["Celis Ive",1,null,2]
["Verlooy Kaïn"]
["Beirinckx Wout",1,1]
["De Swert Erlend",1]
["Elst Pieter"]
["Verdickt Stijn",1]
["Gielis Bernd",1]
["Coolsaet Joy"]
["Boes Dieuwer",1]
["Beirinckx Jurgen","ng"]