{"text_format":"1","workbook":"xlsx","n_sheets":4,"sheets":["rooster en stand","export html","kalender","spelersstatistieken"],"not_rendered":{"charts":0,"images":13,"macros":1,"external_links":0,"defined_names":11,"comments":0,"pivot_tables":0},"unopened":[],"bounds":{"document_bytes":16777216,"sheet_cells":100000,"rows_first":2000,"rows_last":500,"rows_between":2000,"halvings":0,"cell_chars":16384,"cell_head_chars":4096},"cells_cut":0,"cells_raw":0,"read":"whole","date_system":"1900"}

{"sheet":"rooster en stand","index":0,"n_rows":54,"n_cols":113,"rows_kept":54,"cut":false,"hidden":false,"merged":[[2,41,3,41],[2,42,3,42],[2,45,3,45],[2,46,3,46],[2,25,3,25],[2,39,3,39],[2,40,3,40],[2,17,3,17],[2,18,3,18],[2,38,3,38],[2,31,3,31],[2,28,3,28],[2,29,3,29],[2,34,3,34],[2,35,3,35],[2,37,3,37],[2,36,3,36],[2,24,3,24],[2,26,3,26],[2,27,3,27],[2,19,3,19],[2,20,3,20],[2,21,3,21],[2,2,2,7],[3,5,3,6],[2,15,3,15],[2,16,3,16],[22,5,22,7],[2,48,3,48],[2,49,3,49],[2,50,3,50],[2,63,3,63],[2,59,3,59],[2,60,3,60],[2,61,3,61],[2,62,3,62],[2,22,3,22],[2,23,3,23],[2,58,3,58],[2,30,3,30],[2,47,3,47],[2,43,3,43],[2,32,3,32],[2,33,3,33],[2,56,3,56],[2,57,3,57],[2,51,3,51],[2,52,3,52],[2,44,3,44],[2,55,3,55],[2,53,3,53],[2,54,3,54]]}
[]
[null,null,"Updated:","2015-03-15T21:37:14",null,"© 2014/2015 - Wim Gielis - wim.gielis@gmail.com - http://www.wimgielis.be"]
[null,null,"Lierse",null,null,null,null,null,null,null,null,null,null,null,null,null,{"$f":"P5","v":"Anderlecht"},{"$f":"P6","v":"Cercle Brugge"},{"$f":"P7","v":"Charleroi"},{"$f":"P8","v":"Club Brugge"},{"$f":"P9","v":"Genk"},{"$f":"P10","v":"Gent"},{"$f":"P11","v":"Kortrijk"},{"$f":"P12","v":"KV Mechelen"},{"$f":"P13","v":"Lierse"},{"$f":"P14","v":"Lokeren"},{"$f":"P15","v":"Moeskroen-Peruwelz"},{"$f":"P16","v":"Oostende"},{"$f":"P17","v":"Standard"},{"$f":"P18","v":"Waasland-Beveren"},{"$f":"P19","v":"Westerlo"},{"$f":"P20","v":"Zulte-Waregem"},{"$f":"P5","v":"Anderlecht"},{"$f":"P6","v":"Cercle Brugge"},{"$f":"P7","v":"Charleroi"},{"$f":"P8","v":"Club Brugge"},{"$f":"P9","v":"Genk"},{"$f":"P10","v":"Gent"},{"$f":"P11","v":"Kortrijk"},{"$f":"P12","v":"KV Mechelen"},{"$f":"P13","v":"Lierse"},{"$f":"P14","v":"Lokeren"},{"$f":"P15","v":"Moeskroen-Peruwelz"},{"$f":"P16","v":"Oostende"},{"$f":"P17","v":"Standard"},{"$f":"P18","v":"Waasland-Beveren"},{"$f":"P19","v":"Westerlo"},{"$f":"P20","v":"Zulte-Waregem"},{"$f":"P5","v":"Anderlecht"},{"$f":"P6","v":"Cercle Brugge"},{"$f":"P7","v":"Charleroi"},{"$f":"P8","v":"Club Brugge"},{"$f":"P9","v":"Genk"},{"$f":"P10","v":"Gent"},{"$f":"P11","v":"Kortrijk"},{"$f":"P12","v":"KV Mechelen"},{"$f":"P13","v":"Lierse"},{"$f":"P14","v":"Lokeren"},{"$f":"P15","v":"Moeskroen-Peruwelz"},{"$f":"P16","v":"Oostende"},{"$f":"P17","v":"Standard"},{"$f":"P18","v":"Waasland-Beveren"},{"$f":"P19","v":"Westerlo"},{"$f":"P20","v":"Zulte-Waregem"}]
[null,null,null,"Ploeg","P","M",null,"W","V","G","+","-","S","VP"]
[null,null,1,{"$f":"VLOOKUP(BZ5,HulpberekeningenStand,2,FALSE)","v":"Club Brugge"},{"$f":"3*H5+J5","v":61},{"$f":"SUM(H5:J5)","v":30},{"$f":"REPT(IF(F5-MODE(F5:F20)<0,\"-\",\"+\"),ABS(F5-MODE(F5:F20)))","v":""},{"$f":"VLOOKUP(BZ5,HulpberekeningenStand,5,FALSE)","v":17},{"$f":"VLOOKUP(BZ5,HulpberekeningenStand,6,FALSE)","v":3},{"$f":"VLOOKUP(BZ5,HulpberekeningenStand,7,FALSE)","v":10},{"$f":"VLOOKUP(BZ5,HulpberekeningenStand,8,FALSE)","v":69},{"$f":"VLOOKUP(BZ5,HulpberekeningenStand,9,FALSE)","v":28},{"$f":"K5-L5","v":41},{"$f":"3*F5-E5","v":29},null,"Anderlecht",null,"3-2","1-0","2-2","0-0","1-2","2-0","1-1","3-0","1-1","3-1","3-0","0-2","1-0","4-0","0-0",null,8,3,17,10,30,28,26,22,14,1,19,12,5,21,24,null,"2014-09-20","2014-08-10","2014-11-29","2014-10-05","2015-03-14","2015-03-01","2015-02-15","2015-01-18","2014-11-01","2014-07-27","2014-12-14","2014-10-26","2014-08-24","2014-12-26","2015-01-31",null,{"$f":"RANK(BP5,$BP$5:$BP$20,0)+RANK(BR5,$BR$5:$BR$20,0)/10^2+RANK(BQ5,$BQ$5:$BQ$20,1)/10^4+RANK(BW5,$BW$5:$BW$20,0)/10^6+BY5/10^8","v":2.0201030100000001},{"$f":"P5","v":"Anderlecht"},{"$f":"3*BR5+BT5","v":57},{"$f":"SUM(BR5:BT5)","v":30},{"$f":"CHOOSE(StandBer,COUNTIF(CC39:CR39,\"t\")+COUNTIF(CC39:CC54,\"u\")+COUNTIF(CT39:DI39,\"t\")+COUNTIF(CT39:CT54,\"u\"),COUNTIF(CC39:CR39,\"t\")+COUNTIF(CC39:CC54,\"u\"),COUNTIF(CT39:DI39,\"t\")+COUNTIF(CT39:CT54,\"u\"),COUNTIF(CC39:CR39,\"t\")+COUNTIF(CT39:DI39,\"t\"),COUNTIF(CC39:CC54,\"u\")+COUNTIF(CT39:CT54,\"u\"))","v":16},{"$f":"CHOOSE(StandBer,COUNTIF(CC39:CR39,\"u\")+COUNTIF(CC39:CC54,\"t\")+COUNTIF(CT39:DI39,\"u\")+COUNTIF(CT39:CT54,\"t\"),COUNTIF(CC39:CR39,\"u\")+COUNTIF(CC39:CC54,\"t\"),COUNTIF(CT39:DI39,\"u\")+COUNTIF(CT39:CT54,\"t\"),COUNTIF(CC39:CR39,\"u\")+COUNTIF(CT39:DI39,\"u\"),COUNTIF(CC39:CC54,\"t\")+COUNTIF(CT39:CT54,\"t\"))+BX5","v":5},{"$f":"CHOOSE(StandBer,COUNTIF(CC39:CR39,\"g\")+COUNTIF(CC39:CC54,\"g\")+COUNTIF(CT39:DI39,\"g\")+COUNTIF(CT39:CT54,\"g\"),COUNTIF(CC39:CR39,\"g\")+COUNTIF(CC39:CC54,\"g\"),COUNTIF(CT39:DI39,\"g\")+COUNTIF(CT39:CT54,\"g\"),COUNTIF(CC39:CR39,\"g\")+COUNTIF(CT39:DI39,\"g\"),COUNTIF(CC39:CC54,\"g\")+COUNTIF(CT39:CT54,\"g\"))","v":9},{"$f":"CHOOSE(StandBer,SUM(CC5:CR5)+SUM(CC22:CC37)+SUM(CT5:DI5)+SUM(CT22:CT37),SUM(CC5:CR5)+SUM(CC22:CC37),SUM(CT5:DI5)+SUM(CT22:CT37),SUM(CC5:CR5)+SUM(CT5:DI5),SUM(CC22:CC37)+SUM(CT22:CT37))-5*BX5","v":52},{"$f":"CHOOSE(StandBer,SUM(CC5:CC20)+SUM(CC22:CR22)+SUM(CT5:CT20)+SUM(CT22:DI22),SUM(CC5:CC20)+SUM(CC22:CR22),SUM(CT5:CT20)+SUM(CT22:DI22),SUM(CC5:CC20)+SUM(CT5:CT20),SUM(CC22:CR22)+SUM(CT22:DI22))","v":30},{"$f":"BU5-BV5","v":22},{"$f":"CHOOSE(StandBer,COUNTIF(CC39:CR39,\"ff\")+COUNTIF(CC39:CC54,\"ff\")+COUNTIF(CT39:DI39,\"ff\")+COUNTIF(CT39:CT54,\"ff\"),COUNTIF(CC39:CR39,\"ff\")+COUNTIF(CC39:CC54,\"ff\"),COUNTIF(CT39:DI39,\"ff\")+COUNTIF(CT39:CT54,\"ff\"),COUNTIF(CC39:CR39,\"ff\")+COUNTIF(CT39:DI39,\"ff\"),COUNTIF(CC39:CC54,\"ff\")+COUNTIF(CT39:CT54,\"ff\"))","v":0},1,{"$f":"SMALL(BN5:BN20,1)","v":1.0101010399999999},null,null,null,{"$f":"IF(OR(ISERROR(FIND(\"-\",R5)),AH5>15),\"\",IF(LEFT(R5)=\"*\",5,MID(R5,1,FIND(\"-\",R5)-1)-0))","v":3},{"$f":"IF(OR(ISERROR(FIND(\"-\",S5)),AI5>15),\"\",IF(LEFT(S5)=\"*\",5,MID(S5,1,FIND(\"-\",S5)-1)-0))","v":1},{"$f":"IF(OR(ISERROR(FIND(\"-\",T5)),AJ5>15),\"\",IF(LEFT(T5)=\"*\",5,MID(T5,1,FIND(\"-\",T5)-1)-0))","v":""},{"$f":"IF(OR(ISERROR(FIND(\"-\",U5)),AK5>15),\"\",IF(LEFT(U5)=\"*\",5,MID(U5,1,FIND(\"-\",U5)-1)-0))","v":0},{"$f":"IF(OR(ISERROR(FIND(\"-\",V5)),AL5>15),\"\",IF(LEFT(V5)=\"*\",5,MID(V5,1,FIND(\"-\",V5)-1)-0))","v":""},{"$f":"IF(OR(ISERROR(FIND(\"-\",W5)),AM5>15),\"\",IF(LEFT(W5)=\"*\",5,MID(W5,1,FIND(\"-\",W5)-1)-0))","v":""},{"$f":"IF(OR(ISERROR(FIND(\"-\",X5)),AN5>15),\"\",IF(LEFT(X5)=\"*\",5,MID(X5,1,FIND(\"-\",X5)-1)-0))","v":""},{"$f":"IF(OR(ISERROR(FIND(\"-\",Y5)),AO5>15),\"\",IF(LEFT(Y5)=\"*\",5,MID(Y5,1,FIND(\"-\",Y5)-1)-0))","v":""},{"$f":"IF(OR(ISERROR(FIND(\"-\",Z5)),AP5>15),\"\",IF(LEFT(Z5)=\"*\",5,MID(Z5,1,FIND(\"-\",Z5)-1)-0))","v":1},{"$f":"IF(OR(ISERROR(FIND(\"-\",AA5)),AQ5>15),\"\",IF(LEFT(AA5)=\"*\",5,MID(AA5,1,FIND(\"-\",AA5)-1)-0))","v":3},{"$f":"IF(OR(ISERROR(FIND(\"-\",AB5)),AR5>15),\"\",IF(LEFT(AB5)=\"*\",5,MID(AB5,1,FIND(\"-\",AB5)-1)-0))","v":""},{"$f":"IF(OR(ISERROR(FIND(\"-\",AC5)),AS5>15),\"\",IF(LEFT(AC5)=\"*\",5,MID(AC5,1,FIND(\"-\",AC5)-1)-0))","v":0},{"$f":"IF(OR(ISERROR(FIND(\"-\",AD5)),AT5>15),\"\",IF(LEFT(AD5)=\"*\",5,MID(AD5,1,FIND(\"-\",AD5)-1)-0))","v":1},{"$f":"IF(OR(ISERROR(FIND(\"-\",AE5)),AU5>15),\"\",IF(LEFT(AE5)=\"*\",5,MID(AE5,1,FIND(\"-\",AE5)-1)-0))","v":""},{"$f":"IF(OR(ISERROR(FIND(\"-\",AF5)),AV5>15),\"\",IF(LEFT(AF5)=\"*\",5,MID(AF5,1,FIND(\"-\",AF5)-1)-0))","v":""},null,null,{"$f":"IF(OR(ISERROR(FIND(\"-\",R5)),AH5<=15),\"\",IF(LEFT(R5)=\"*\",5,MID(R5,1,FIND(\"-\",R5)-1)-0))","v":""},{"$f":"IF(OR(ISERROR(FIND(\"-\",S5)),AI5<=15),\"\",IF(LEFT(S5)=\"*\",5,MID(S5,1,FIND(\"-\",S5)-1)-0))","v":""},{"$f":"IF(OR(ISERROR(FIND(\"-\",T5)),AJ5<=15),\"\",IF(LEFT(T5)=\"*\",5,MID(T5,1,FIND(\"-\",T5)-1)-0))","v":2},{"$f":"IF(OR(ISERROR(FIND(\"-\",U5)),AK5<=15),\"\",IF(LEFT(U5)=\"*\",5,MID(U5,1,FIND(\"-\",U5)-1)-0))","v":""},{"$f":"IF(OR(ISERROR(FIND(\"-\",V5)),AL5<=15),\"\",IF(LEFT(V5)=\"*\",5,MID(V5,1,FIND(\"-\",V5)-1)-0))","v":1},{"$f":"IF(OR(ISERROR(FIND(\"-\",W5)),AM5<=15),\"\",IF(LEFT(W5)=\"*\",5,MID(W5,1,FIND(\"-\",W5)-1)-0))","v":2},{"$f":"IF(OR(ISERROR(FIND(\"-\",X5)),AN5<=15),\"\",IF(LEFT(X5)=\"*\",5,MID(X5,1,FIND(\"-\",X5)-1)-0))","v":1},{"$f":"IF(OR(ISERROR(FIND(\"-\",Y5)),AO5<=15),\"\",IF(LEFT(Y5)=\"*\",5,MID(Y5,1,FIND(\"-\",Y5)-1)-0))","v":3},{"$f":"IF(OR(ISERROR(FIND(\"-\",Z5)),AP5<=15),\"\",IF(LEFT(Z5)=\"*\",5,MID(Z5,1,FIND(\"-\",Z5)-1)-0))","v":""},{"$f":"IF(OR(ISERROR(FIND(\"-\",AA5)),AQ5<=15),\"\",IF(LEFT(AA5)=\"*\",5,MID(AA5,1,FIND(\"-\",AA5)-1)-0))","v":""},{"$f":"IF(OR(ISERROR(FIND(\"-\",AB5)),AR5<=15),\"\",IF(LEFT(AB5)=\"*\",5,MID(AB5,1,FIND(\"-\",AB5)-1)-0))","v":3},{"$f":"IF(OR(ISERROR(FIND(\"-\",AC5)),AS5<=15),\"\",IF(LEFT(AC5)=\"*\",5,MID(AC5,1,FIND(\"-\",AC5)-1)-0))","v":""},{"$f":"IF(OR(ISERROR(FIND(\"-\",AD5)),AT5<=15),\"\",IF(LEFT(AD5)=\"*\",5,MID(AD5,1,FIND(\"-\",AD5)-1)-0))","v":""},{"$f":"IF(OR(ISERROR(FIND(\"-\",AE5)),AU5<=15),\"\",IF(LEFT(AE5)=\"*\",5,MID(AE5,1,FIND(\"-\",AE5)-1)-0))","v":4},{"$f":"IF(OR(ISERROR(FIND(\"-\",AF5)),AV5<=15),\"\",IF(LEFT(AF5)=\"*\",5,MID(AF5,1,FIND(\"-\",AF5)-1)-0))","v":0}]
[null,null,{"$f":"IF(RANK(E6,E5:E20,0)>RANK(E5,E5:E20,0),RANK(E6,E5:E20,0),\"\")","v":2},"Gent",57,30,{"$f":"REPT(IF(F6-MODE(F5:F20)<0,\"-\",\"+\"),ABS(F6-MODE(F5:F20)))","v":""},16,5,9,52,29,23,33,null,"Cercle Brugge","0-2",null,"1-0","0-3","0-1","0-0","0-4","2-3","1-2","1-0","2-1","0-1","0-1","1-0","1-2","2-2",25,null,7,23,17,1,14,30,11,5,19,3,13,21,9,27,"2015-02-08",null,"2014-09-13","2015-01-24","2014-11-29","2014-07-26","2014-11-01","2015-03-14","2014-10-18","2014-08-24","2014-12-13","2014-08-09","2014-10-29","2014-12-27","2014-09-27","2015-02-21",null,{"$f":"RANK(BP6,$BP$5:$BP$20,0)+RANK(BR6,$BR$5:$BR$20,0)/10^2+RANK(BQ6,$BQ$5:$BQ$20,1)/10^4+RANK(BW6,$BW$5:$BW$20,0)/10^6+BY6/10^8","v":15.150115019999999},"Cercle Brugge",24,30,{"$f":"CHOOSE(StandBer,COUNTIF(CC40:CR40,\"t\")+COUNTIF(CD39:CD54,\"u\")+COUNTIF(CT40:DI40,\"t\")+COUNTIF(CU39:CU54,\"u\"),COUNTIF(CC40:CR40,\"t\")+COUNTIF(CD39:CD54,\"u\"),COUNTIF(CT40:DI40,\"t\")+COUNTIF(CU39:CU54,\"u\"),COUNTIF(CC40:CR40,\"t\")+COUNTIF(CT40:DI40,\"t\"),COUNTIF(CD39:CD54,\"u\")+COUNTIF(CU39:CU54,\"u\"))","v":6},{"$f":"CHOOSE(StandBer,COUNTIF(CC40:CR40,\"u\")+COUNTIF(CD39:CD54,\"t\")+COUNTIF(CT40:DI40,\"u\")+COUNTIF(CU39:CU54,\"t\"),COUNTIF(CC40:CR40,\"u\")+COUNTIF(CD39:CD54,\"t\"),COUNTIF(CT40:DI40,\"u\")+COUNTIF(CU39:CU54,\"t\"),COUNTIF(CC40:CR40,\"u\")+COUNTIF(CT40:DI40,\"u\"),COUNTIF(CD39:CD54,\"t\")+COUNTIF(CU39:CU54,\"t\"))+BX6","v":18},{"$f":"CHOOSE(StandBer,COUNTIF(CC40:CR40,\"g\")+COUNTIF(CD39:CD54,\"g\")+COUNTIF(CT40:DI40,\"g\")+COUNTIF(CU39:CU54,\"g\"),COUNTIF(CC40:CR40,\"g\")+COUNTIF(CD39:CD54,\"g\"),COUNTIF(CT40:DI40,\"g\")+COUNTIF(CU39:CU54,\"g\"),COUNTIF(CC40:CR40,\"g\")+COUNTIF(CT40:DI40,\"g\"),COUNTIF(CD39:CD54,\"g\")+COUNTIF(CU39:CU54,\"g\"))","v":6},{"$f":"CHOOSE(StandBer,SUM(CC6:CR6)+SUM(CD22:CD37)+SUM(CT6:DI6)+SUM(CU22:CU37),SUM(CC6:CR6)+SUM(CD22:CD37),SUM(CT6:DI6)+SUM(CU22:CU37),SUM(CC6:CR6)+SUM(CT6:DI6),SUM(CD22:CD37)+SUM(CU22:CU37))-5*BX6","v":21},{"$f":"CHOOSE(StandBer,SUM(CD5:CD20)+SUM(CC23:CR23)+SUM(CU5:CU20)+SUM(CT23:DI23),SUM(CD5:CD20)+SUM(CC23:CR23),SUM(CU5:CU20)+SUM(CT23:DI23),SUM(CD5:CD20)+SUM(CU5:CU20),SUM(CC23:CR23)+SUM(CT23:DI23))","v":45},-24,{"$f":"CHOOSE(StandBer,COUNTIF(CC40:CR40,\"ff\")+COUNTIF(CD39:CD54,\"ff\")+COUNTIF(CT40:DI40,\"ff\")+COUNTIF(CU39:CU54,\"ff\"),COUNTIF(CC40:CR40,\"ff\")+COUNTIF(CD39:CD54,\"ff\"),COUNTIF(CT40:DI40,\"ff\")+COUNTIF(CU39:CU54,\"ff\"),COUNTIF(CC40:CR40,\"ff\")+COUNTIF(CT40:DI40,\"ff\"),COUNTIF(CD39:CD54,\"ff\")+COUNTIF(CU39:CU54,\"ff\"))","v":0},2,{"$f":"SMALL(BN5:BN20,2)","v":2.0201020600000001},null,null,{"$f":"IF(OR(ISERROR(FIND(\"-\",Q6)),AG6>15),\"\",IF(LEFT(Q6)=\"*\",5,MID(Q6,1,FIND(\"-\",Q6)-1)-0))","v":""},null,1,"","",0,0,"",1,1,"",0,0,"",1,"",null,{"$f":"IF(OR(ISERROR(FIND(\"-\",Q6)),AG6<=15),\"\",IF(LEFT(Q6)=\"*\",5,MID(Q6,1,FIND(\"-\",Q6)-1)-0))","v":0},null,"",0,0,"","",2,"","",2,"","",1,"",2]
[null,null,{"$f":"IF(RANK(E7,E5:E20,0)>RANK(E6,E5:E20,0),RANK(E7,E5:E20,0),\"\")","v":""},"Anderlecht",57,30,{"$f":"REPT(IF(F7-MODE(F5:F20)<0,\"-\",\"+\"),ABS(F7-MODE(F5:F20)))","v":""},16,5,9,52,30,22,33,null,"Charleroi","3-1","0-2",null,"0-0","1-0","0-0","0-2","2-0","6-0","1-0","2-0","2-0","0-1","2-2","2-3","2-1",16,22,null,14,24,26,10,6,20,28,30,12,18,4,2,8,"2014-11-22","2015-01-17",null,"2014-11-02","2015-01-31","2015-02-15","2014-10-04","2014-08-31","2014-12-20","2015-02-28","2015-03-14","2014-10-25","2014-12-07","2014-08-16","2014-08-02","2014-09-19",null,6.060105029999999,"Charleroi",49,30,{"$f":"CHOOSE(StandBer,COUNTIF(CC41:CR41,\"t\")+COUNTIF(CE39:CE54,\"u\")+COUNTIF(CT41:DI41,\"t\")+COUNTIF(CV39:CV54,\"u\"),COUNTIF(CC41:CR41,\"t\")+COUNTIF(CE39:CE54,\"u\"),COUNTIF(CT41:DI41,\"t\")+COUNTIF(CV39:CV54,\"u\"),COUNTIF(CC41:CR41,\"t\")+COUNTIF(CT41:DI41,\"t\"),COUNTIF(CE39:CE54,\"u\")+COUNTIF(CV39:CV54,\"u\"))","v":14},{"$f":"CHOOSE(StandBer,COUNTIF(CC41:CR41,\"u\")+COUNTIF(CE39:CE54,\"t\")+COUNTIF(CT41:DI41,\"u\")+COUNTIF(CV39:CV54,\"t\"),COUNTIF(CC41:CR41,\"u\")+COUNTIF(CE39:CE54,\"t\"),COUNTIF(CT41:DI41,\"u\")+COUNTIF(CV39:CV54,\"t\"),COUNTIF(CC41:CR41,\"u\")+COUNTIF(CT41:DI41,\"u\"),COUNTIF(CE39:CE54,\"t\")+COUNTIF(CV39:CV54,\"t\"))+BX7","v":9},{"$f":"CHOOSE(StandBer,COUNTIF(CC41:CR41,\"g\")+COUNTIF(CE39:CE54,\"g\")+COUNTIF(CT41:DI41,\"g\")+COUNTIF(CV39:CV54,\"g\"),COUNTIF(CC41:CR41,\"g\")+COUNTIF(CE39:CE54,\"g\"),COUNTIF(CT41:DI41,\"g\")+COUNTIF(CV39:CV54,\"g\"),COUNTIF(CC41:CR41,\"g\")+COUNTIF(CT41:DI41,\"g\"),COUNTIF(CE39:CE54,\"g\")+COUNTIF(CV39:CV54,\"g\"))","v":7},{"$f":"CHOOSE(StandBer,SUM(CC7:CR7)+SUM(CE22:CE37)+SUM(CT7:DI7)+SUM(CV22:CV37),SUM(CC7:CR7)+SUM(CE22:CE37),SUM(CT7:DI7)+SUM(CV22:CV37),SUM(CC7:CR7)+SUM(CT7:DI7),SUM(CE22:CE37)+SUM(CV22:CV37))-5*BX7","v":44},{"$f":"CHOOSE(StandBer,SUM(CE5:CE20)+SUM(CC24:CR24)+SUM(CV5:CV20)+SUM(CT24:DI24),SUM(CE5:CE20)+SUM(CC24:CR24),SUM(CV5:CV20)+SUM(CT24:DI24),SUM(CE5:CE20)+SUM(CV5:CV20),SUM(CC24:CR24)+SUM(CT24:DI24))","v":31},13,{"$f":"CHOOSE(StandBer,COUNTIF(CC41:CR41,\"ff\")+COUNTIF(CE39:CE54,\"ff\")+COUNTIF(CT41:DI41,\"ff\")+COUNTIF(CV39:CV54,\"ff\"),COUNTIF(CC41:CR41,\"ff\")+COUNTIF(CE39:CE54,\"ff\"),COUNTIF(CT41:DI41,\"ff\")+COUNTIF(CV39:CV54,\"ff\"),COUNTIF(CC41:CR41,\"ff\")+COUNTIF(CT41:DI41,\"ff\"),COUNTIF(CE39:CE54,\"ff\")+COUNTIF(CV39:CV54,\"ff\"))","v":0},3,{"$f":"SMALL(BN5:BN20,3)","v":2.0201030100000001},null,null,"","",null,0,"","",0,2,"","","",2,"",2,2,2,null,3,0,null,"",1,0,"","",6,1,2,"",0,"","",""]
[null,null,{"$f":"IF(RANK(E8,E5:E20,0)>RANK(E7,E5:E20,0),RANK(E8,E5:E20,0),\"\")","v":4},"Standard",53,30,{"$f":"REPT(IF(F8-MODE(F5:F20)<0,\"-\",\"+\"),ABS(F8-MODE(F5:F20)))","v":""},16,9,5,49,39,10,37,null,"Club Brugge","2-2","1-1","1-0",null,"4-1","2-2","5-0","1-1","1-0","1-1","3-0","2-0","3-0","4-2","5-0","2-1",6,4,29,null,20,12,8,22,2,26,28,24,10,16,15,18,"2014-08-31","2014-08-15","2015-03-07",null,"2014-12-21","2014-10-26","2014-09-21","2015-01-17","2014-08-03","2015-02-15","2015-03-01","2015-01-31","2014-10-05","2014-11-22","2014-11-09","2014-12-07",null,1.0101010399999999,"Club Brugge",61,30,{"$f":"CHOOSE(StandBer,COUNTIF(CC42:CR42,\"t\")+COUNTIF(CF39:CF54,\"u\")+COUNTIF(CT42:DI42,\"t\")+COUNTIF(CW39:CW54,\"u\"),COUNTIF(CC42:CR42,\"t\")+COUNTIF(CF39:CF54,\"u\"),COUNTIF(CT42:DI42,\"t\")+COUNTIF(CW39:CW54,\"u\"),COUNTIF(CC42:CR42,\"t\")+COUNTIF(CT42:DI42,\"t\"),COUNTIF(CF39:CF54,\"u\")+COUNTIF(CW39:CW54,\"u\"))","v":17},{"$f":"CHOOSE(StandBer,COUNTIF(CC42:CR42,\"u\")+COUNTIF(CF39:CF54,\"t\")+COUNTIF(CT42:DI42,\"u\")+COUNTIF(CW39:CW54,\"t\"),COUNTIF(CC42:CR42,\"u\")+COUNTIF(CF39:CF54,\"t\"),COUNTIF(CT42:DI42,\"u\")+COUNTIF(CW39:CW54,\"t\"),COUNTIF(CC42:CR42,\"u\")+COUNTIF(CT42:DI42,\"u\"),COUNTIF(CF39:CF54,\"t\")+COUNTIF(CW39:CW54,\"t\"))+BX8","v":3},{"$f":"CHOOSE(StandBer,COUNTIF(CC42:CR42,\"g\")+COUNTIF(CF39:CF54,\"g\")+COUNTIF(CT42:DI42,\"g\")+COUNTIF(CW39:CW54,\"g\"),COUNTIF(CC42:CR42,\"g\")+COUNTIF(CF39:CF54,\"g\"),COUNTIF(CT42:DI42,\"g\")+COUNTIF(CW39:CW54,\"g\"),COUNTIF(CC42:CR42,\"g\")+COUNTIF(CT42:DI42,\"g\"),COUNTIF(CF39:CF54,\"g\")+COUNTIF(CW39:CW54,\"g\"))","v":10},{"$f":"CHOOSE(StandBer,SUM(CC8:CR8)+SUM(CF22:CF37)+SUM(CT8:DI8)+SUM(CW22:CW37),SUM(CC8:CR8)+SUM(CF22:CF37),SUM(CT8:DI8)+SUM(CW22:CW37),SUM(CC8:CR8)+SUM(CT8:DI8),SUM(CF22:CF37)+SUM(CW22:CW37))-5*BX8","v":69},{"$f":"CHOOSE(StandBer,SUM(CF5:CF20)+SUM(CC25:CR25)+SUM(CW5:CW20)+SUM(CT25:DI25),SUM(CF5:CF20)+SUM(CC25:CR25),SUM(CW5:CW20)+SUM(CT25:DI25),SUM(CF5:CF20)+SUM(CW5:CW20),SUM(CC25:CR25)+SUM(CT25:DI25))","v":28},41,{"$f":"CHOOSE(StandBer,COUNTIF(CC42:CR42,\"ff\")+COUNTIF(CF39:CF54,\"ff\")+COUNTIF(CT42:DI42,\"ff\")+COUNTIF(CW39:CW54,\"ff\"),COUNTIF(CC42:CR42,\"ff\")+COUNTIF(CF39:CF54,\"ff\"),COUNTIF(CT42:DI42,\"ff\")+COUNTIF(CW39:CW54,\"ff\"),COUNTIF(CC42:CR42,\"ff\")+COUNTIF(CT42:DI42,\"ff\"),COUNTIF(CF39:CF54,\"ff\")+COUNTIF(CW39:CW54,\"ff\"))","v":0},4,{"$f":"SMALL(BN5:BN20,4)","v":4.0201061299999994},null,null,2,1,"",null,"",2,5,"",1,"","","",3,"",5,"",null,"","",1,null,4,"","",1,"",1,3,2,"",4,"",2]
[null,null,{"$f":"IF(RANK(E9,E5:E20,0)>RANK(E8,E5:E20,0),RANK(E9,E5:E20,0),\"\")","v":5},"Kortrijk",51,30,{"$f":"REPT(IF(F9-MODE(F5:F20)<0,\"-\",\"+\"),ABS(F9-MODE(F5:F20)))","v":""},16,11,3,54,35,19,39,null,"Genk","0-2","1-1","1-1","1-1",null,"3-2","3-0","3-0","3-0","0-0","2-0","1-1","0-2","1-0","3-1","3-2",27,2,9,7,null,5,19,16,13,3,23,21,15,25,11,29,"2015-02-21","2014-08-02","2014-09-27","2014-09-14",null,"2014-08-23","2014-12-13","2014-11-23","2014-10-28","2014-08-08","2015-01-24","2015-02-03","2014-11-09","2015-02-08","2014-10-19","2015-03-07",null,6.0701070499999998,"Genk",49,30,{"$f":"CHOOSE(StandBer,COUNTIF(CC43:CR43,\"t\")+COUNTIF(CG39:CG54,\"u\")+COUNTIF(CT43:DI43,\"t\")+COUNTIF(CX39:CX54,\"u\"),COUNTIF(CC43:CR43,\"t\")+COUNTIF(CG39:CG54,\"u\"),COUNTIF(CT43:DI43,\"t\")+COUNTIF(CX39:CX54,\"u\"),COUNTIF(CC43:CR43,\"t\")+COUNTIF(CT43:DI43,\"t\"),COUNTIF(CG39:CG54,\"u\")+COUNTIF(CX39:CX54,\"u\"))","v":13},{"$f":"CHOOSE(StandBer,COUNTIF(CC43:CR43,\"u\")+COUNTIF(CG39:CG54,\"t\")+COUNTIF(CT43:DI43,\"u\")+COUNTIF(CX39:CX54,\"t\"),COUNTIF(CC43:CR43,\"u\")+COUNTIF(CG39:CG54,\"t\"),COUNTIF(CT43:DI43,\"u\")+COUNTIF(CX39:CX54,\"t\"),COUNTIF(CC43:CR43,\"u\")+COUNTIF(CT43:DI43,\"u\"),COUNTIF(CG39:CG54,\"t\")+COUNTIF(CX39:CX54,\"t\"))+BX9","v":7},{"$f":"CHOOSE(StandBer,COUNTIF(CC43:CR43,\"g\")+COUNTIF(CG39:CG54,\"g\")+COUNTIF(CT43:DI43,\"g\")+COUNTIF(CX39:CX54,\"g\"),COUNTIF(CC43:CR43,\"g\")+COUNTIF(CG39:CG54,\"g\"),COUNTIF(CT43:DI43,\"g\")+COUNTIF(CX39:CX54,\"g\"),COUNTIF(CC43:CR43,\"g\")+COUNTIF(CT43:DI43,\"g\"),COUNTIF(CG39:CG54,\"g\")+COUNTIF(CX39:CX54,\"g\"))","v":10},{"$f":"CHOOSE(StandBer,SUM(CC9:CR9)+SUM(CG22:CG37)+SUM(CT9:DI9)+SUM(CX22:CX37),SUM(CC9:CR9)+SUM(CG22:CG37),SUM(CT9:DI9)+SUM(CX22:CX37),SUM(CC9:CR9)+SUM(CT9:DI9),SUM(CG22:CG37)+SUM(CX22:CX37))-5*BX9","v":38},{"$f":"CHOOSE(StandBer,SUM(CG5:CG20)+SUM(CC26:CR26)+SUM(CX5:CX20)+SUM(CT26:DI26),SUM(CG5:CG20)+SUM(CC26:CR26),SUM(CX5:CX20)+SUM(CT26:DI26),SUM(CG5:CG20)+SUM(CX5:CX20),SUM(CC26:CR26)+SUM(CT26:DI26))","v":29},9,{"$f":"CHOOSE(StandBer,COUNTIF(CC43:CR43,\"ff\")+COUNTIF(CG39:CG54,\"ff\")+COUNTIF(CT43:DI43,\"ff\")+COUNTIF(CX39:CX54,\"ff\"),COUNTIF(CC43:CR43,\"ff\")+COUNTIF(CG39:CG54,\"ff\"),COUNTIF(CT43:DI43,\"ff\")+COUNTIF(CX39:CX54,\"ff\"),COUNTIF(CC43:CR43,\"ff\")+COUNTIF(CT43:DI43,\"ff\"),COUNTIF(CG39:CG54,\"ff\")+COUNTIF(CX39:CX54,\"ff\"))","v":0},5,{"$f":"SMALL(BN5:BN20,5)","v":5.0201040699999986},null,null,"",1,1,1,null,3,"","",3,0,"","",0,"",3,"",null,0,"","","",null,"",3,3,"","",2,1,"",1,"",3]
[null,null,{"$f":"IF(RANK(E10,E5:E20,0)>RANK(E9,E5:E20,0),RANK(E10,E5:E20,0),\"\")","v":6},"Charleroi",49,30,{"$f":"REPT(IF(F10-MODE(F5:F20)<0,\"-\",\"+\"),ABS(F10-MODE(F5:F20)))","v":""},14,9,7,44,31,13,41,null,"Gent","0-2","4-0","2-2","2-1","0-0",null,"0-1","3-1","2-1","1-1","1-0","3-1","1-2","4-1","4-0","3-1",15,16,11,27,18,null,6,2,29,9,7,23,20,13,25,4,"2014-11-09","2014-11-22","2014-10-18","2015-02-21","2014-12-07",null,"2014-08-30","2014-08-03","2015-03-07","2014-09-28","2014-09-14","2015-01-24","2014-12-21","2014-10-29","2015-02-07","2014-08-17",null,2.0201020600000001,"Gent",57,30,{"$f":"CHOOSE(StandBer,COUNTIF(CC44:CR44,\"t\")+COUNTIF(CH39:CH54,\"u\")+COUNTIF(CT44:DI44,\"t\")+COUNTIF(CY39:CY54,\"u\"),COUNTIF(CC44:CR44,\"t\")+COUNTIF(CH39:CH54,\"u\"),COUNTIF(CT44:DI44,\"t\")+COUNTIF(CY39:CY54,\"u\"),COUNTIF(CC44:CR44,\"t\")+COUNTIF(CT44:DI44,\"t\"),COUNTIF(CH39:CH54,\"u\")+COUNTIF(CY39:CY54,\"u\"))","v":16},{"$f":"CHOOSE(StandBer,COUNTIF(CC44:CR44,\"u\")+COUNTIF(CH39:CH54,\"t\")+COUNTIF(CT44:DI44,\"u\")+COUNTIF(CY39:CY54,\"t\"),COUNTIF(CC44:CR44,\"u\")+COUNTIF(CH39:CH54,\"t\"),COUNTIF(CT44:DI44,\"u\")+COUNTIF(CY39:CY54,\"t\"),COUNTIF(CC44:CR44,\"u\")+COUNTIF(CT44:DI44,\"u\"),COUNTIF(CH39:CH54,\"t\")+COUNTIF(CY39:CY54,\"t\"))+BX10","v":5},{"$f":"CHOOSE(StandBer,COUNTIF(CC44:CR44,\"g\")+COUNTIF(CH39:CH54,\"g\")+COUNTIF(CT44:DI44,\"g\")+COUNTIF(CY39:CY54,\"g\"),COUNTIF(CC44:CR44,\"g\")+COUNTIF(CH39:CH54,\"g\"),COUNTIF(CT44:DI44,\"g\")+COUNTIF(CY39:CY54,\"g\"),COUNTIF(CC44:CR44,\"g\")+COUNTIF(CT44:DI44,\"g\"),COUNTIF(CH39:CH54,\"g\")+COUNTIF(CY39:CY54,\"g\"))","v":9},{"$f":"CHOOSE(StandBer,SUM(CC10:CR10)+SUM(CH22:CH37)+SUM(CT10:DI10)+SUM(CY22:CY37),SUM(CC10:CR10)+SUM(CH22:CH37),SUM(CT10:DI10)+SUM(CY22:CY37),SUM(CC10:CR10)+SUM(CT10:DI10),SUM(CH22:CH37)+SUM(CY22:CY37))-5*BX10","v":52},{"$f":"CHOOSE(StandBer,SUM(CH5:CH20)+SUM(CC27:CR27)+SUM(CY5:CY20)+SUM(CT27:DI27),SUM(CH5:CH20)+SUM(CC27:CR27),SUM(CY5:CY20)+SUM(CT27:DI27),SUM(CH5:CH20)+SUM(CY5:CY20),SUM(CC27:CR27)+SUM(CT27:DI27))","v":29},23,{"$f":"CHOOSE(StandBer,COUNTIF(CC44:CR44,\"ff\")+COUNTIF(CH39:CH54,\"ff\")+COUNTIF(CT44:DI44,\"ff\")+COUNTIF(CY39:CY54,\"ff\"),COUNTIF(CC44:CR44,\"ff\")+COUNTIF(CH39:CH54,\"ff\"),COUNTIF(CT44:DI44,\"ff\")+COUNTIF(CY39:CY54,\"ff\"),COUNTIF(CC44:CR44,\"ff\")+COUNTIF(CT44:DI44,\"ff\"),COUNTIF(CH39:CH54,\"ff\")+COUNTIF(CY39:CY54,\"ff\"))","v":0},6,{"$f":"SMALL(BN5:BN20,6)","v":6.060105029999999},null,null,0,"",2,"","",null,0,3,"",1,1,"","",4,"",3,null,"",4,"",2,0,null,"","",2,"","",3,1,"",4,""]
[null,null,{"$f":"IF(RANK(E11,E5:E20,0)>RANK(E10,E5:E20,0),RANK(E11,E5:E20,0),\"\")","v":""},"Genk",49,30,{"$f":"REPT(IF(F11-MODE(F5:F20)<0,\"-\",\"+\"),ABS(F11-MODE(F5:F20)))","v":""},13,7,10,38,29,9,41,null,"Kortrijk","2-3","1-0","0-0","2-0","1-1","2-3",null,"3-0","1-0","2-3","3-0","0-2","2-3","2-1","6-0","3-1",13,29,23,25,4,21,null,18,15,7,9,5,2,11,27,16,"2014-10-29","2015-03-07","2015-01-24","2015-02-08","2014-08-16","2014-12-26",null,"2014-12-06","2014-11-08","2014-09-14","2014-09-27","2014-08-23","2014-08-02","2014-10-18","2015-02-21","2014-11-23",null,5.0201040699999986,"Kortrijk",51,30,{"$f":"CHOOSE(StandBer,COUNTIF(CC45:CR45,\"t\")+COUNTIF(CI39:CI54,\"u\")+COUNTIF(CT45:DI45,\"t\")+COUNTIF(CZ39:CZ54,\"u\"),COUNTIF(CC45:CR45,\"t\")+COUNTIF(CI39:CI54,\"u\"),COUNTIF(CT45:DI45,\"t\")+COUNTIF(CZ39:CZ54,\"u\"),COUNTIF(CC45:CR45,\"t\")+COUNTIF(CT45:DI45,\"t\"),COUNTIF(CI39:CI54,\"u\")+COUNTIF(CZ39:CZ54,\"u\"))","v":16},{"$f":"CHOOSE(StandBer,COUNTIF(CC45:CR45,\"u\")+COUNTIF(CI39:CI54,\"t\")+COUNTIF(CT45:DI45,\"u\")+COUNTIF(CZ39:CZ54,\"t\"),COUNTIF(CC45:CR45,\"u\")+COUNTIF(CI39:CI54,\"t\"),COUNTIF(CT45:DI45,\"u\")+COUNTIF(CZ39:CZ54,\"t\"),COUNTIF(CC45:CR45,\"u\")+COUNTIF(CT45:DI45,\"u\"),COUNTIF(CI39:CI54,\"t\")+COUNTIF(CZ39:CZ54,\"t\"))+BX11","v":11},{"$f":"CHOOSE(StandBer,COUNTIF(CC45:CR45,\"g\")+COUNTIF(CI39:CI54,\"g\")+COUNTIF(CT45:DI45,\"g\")+COUNTIF(CZ39:CZ54,\"g\"),COUNTIF(CC45:CR45,\"g\")+COUNTIF(CI39:CI54,\"g\"),COUNTIF(CT45:DI45,\"g\")+COUNTIF(CZ39:CZ54,\"g\"),COUNTIF(CC45:CR45,\"g\")+COUNTIF(CT45:DI45,\"g\"),COUNTIF(CI39:CI54,\"g\")+COUNTIF(CZ39:CZ54,\"g\"))","v":3},{"$f":"CHOOSE(StandBer,SUM(CC11:CR11)+SUM(CI22:CI37)+SUM(CT11:DI11)+SUM(CZ22:CZ37),SUM(CC11:CR11)+SUM(CI22:CI37),SUM(CT11:DI11)+SUM(CZ22:CZ37),SUM(CC11:CR11)+SUM(CT11:DI11),SUM(CI22:CI37)+SUM(CZ22:CZ37))-5*BX11","v":54},{"$f":"CHOOSE(StandBer,SUM(CI5:CI20)+SUM(CC28:CR28)+SUM(CZ5:CZ20)+SUM(CT28:DI28),SUM(CI5:CI20)+SUM(CC28:CR28),SUM(CZ5:CZ20)+SUM(CT28:DI28),SUM(CI5:CI20)+SUM(CZ5:CZ20),SUM(CC28:CR28)+SUM(CT28:DI28))","v":35},19,{"$f":"CHOOSE(StandBer,COUNTIF(CC45:CR45,\"ff\")+COUNTIF(CI39:CI54,\"ff\")+COUNTIF(CT45:DI45,\"ff\")+COUNTIF(CZ39:CZ54,\"ff\"),COUNTIF(CC45:CR45,\"ff\")+COUNTIF(CI39:CI54,\"ff\"),COUNTIF(CT45:DI45,\"ff\")+COUNTIF(CZ39:CZ54,\"ff\"),COUNTIF(CC45:CR45,\"ff\")+COUNTIF(CT45:DI45,\"ff\"),COUNTIF(CI39:CI54,\"ff\")+COUNTIF(CZ39:CZ54,\"ff\"))","v":0},7,{"$f":"SMALL(BN5:BN20,7)","v":6.0701070499999998},null,null,2,"","","",1,"",null,"",1,2,3,0,2,2,"","",null,"",1,0,2,"",2,null,3,"","","","","","",6,3]
[null,null,{"$f":"IF(RANK(E12,E5:E20,0)>RANK(E11,E5:E20,0),RANK(E12,E5:E20,0),\"\")","v":8},"Lokeren",42,30,{"$f":"REPT(IF(F12-MODE(F5:F20)<0,\"-\",\"+\"),ABS(F12-MODE(F5:F20)))","v":""},10,8,12,38,32,6,48,null,"KV Mechelen","1-1","1-1","0-0","3-1","3-1","0-0","1-2",null,"2-1","0-1","1-0","0-0","1-0","2-0","5-2","1-1",11,15,25,5,1,19,3,null,27,23,21,17,29,9,7,13,"2014-10-18","2014-11-08","2015-02-07","2014-08-24","2014-07-27","2014-12-12","2014-08-09",null,"2015-02-21","2015-01-24","2014-12-26","2014-11-29","2015-03-07","2014-09-27","2014-09-13","2014-10-28",null,9.0901090799999995,"KV Mechelen",41,30,{"$f":"CHOOSE(StandBer,COUNTIF(CC46:CR46,\"t\")+COUNTIF(CJ39:CJ54,\"u\")+COUNTIF(CT46:DI46,\"t\")+COUNTIF(DA39:DA54,\"u\"),COUNTIF(CC46:CR46,\"t\")+COUNTIF(CJ39:CJ54,\"u\"),COUNTIF(CT46:DI46,\"t\")+COUNTIF(DA39:DA54,\"u\"),COUNTIF(CC46:CR46,\"t\")+COUNTIF(CT46:DI46,\"t\"),COUNTIF(CJ39:CJ54,\"u\")+COUNTIF(DA39:DA54,\"u\"))","v":10},{"$f":"CHOOSE(StandBer,COUNTIF(CC46:CR46,\"u\")+COUNTIF(CJ39:CJ54,\"t\")+COUNTIF(CT46:DI46,\"u\")+COUNTIF(DA39:DA54,\"t\"),COUNTIF(CC46:CR46,\"u\")+COUNTIF(CJ39:CJ54,\"t\"),COUNTIF(CT46:DI46,\"u\")+COUNTIF(DA39:DA54,\"t\"),COUNTIF(CC46:CR46,\"u\")+COUNTIF(CT46:DI46,\"u\"),COUNTIF(CJ39:CJ54,\"t\")+COUNTIF(DA39:DA54,\"t\"))+BX12","v":9},{"$f":"CHOOSE(StandBer,COUNTIF(CC46:CR46,\"g\")+COUNTIF(CJ39:CJ54,\"g\")+COUNTIF(CT46:DI46,\"g\")+COUNTIF(DA39:DA54,\"g\"),COUNTIF(CC46:CR46,\"g\")+COUNTIF(CJ39:CJ54,\"g\"),COUNTIF(CT46:DI46,\"g\")+COUNTIF(DA39:DA54,\"g\"),COUNTIF(CC46:CR46,\"g\")+COUNTIF(CT46:DI46,\"g\"),COUNTIF(CJ39:CJ54,\"g\")+COUNTIF(DA39:DA54,\"g\"))","v":11},{"$f":"CHOOSE(StandBer,SUM(CC12:CR12)+SUM(CJ22:CJ37)+SUM(CT12:DI12)+SUM(DA22:DA37),SUM(CC12:CR12)+SUM(CJ22:CJ37),SUM(CT12:DI12)+SUM(DA22:DA37),SUM(CC12:CR12)+SUM(CT12:DI12),SUM(CJ22:CJ37)+SUM(DA22:DA37))-5*BX12","v":36},{"$f":"CHOOSE(StandBer,SUM(CJ5:CJ20)+SUM(CC29:CR29)+SUM(DA5:DA20)+SUM(CT29:DI29),SUM(CJ5:CJ20)+SUM(CC29:CR29),SUM(DA5:DA20)+SUM(CT29:DI29),SUM(CJ5:CJ20)+SUM(DA5:DA20),SUM(CC29:CR29)+SUM(CT29:DI29))","v":38},-2,{"$f":"CHOOSE(StandBer,COUNTIF(CC46:CR46,\"ff\")+COUNTIF(CJ39:CJ54,\"ff\")+COUNTIF(CT46:DI46,\"ff\")+COUNTIF(DA39:DA54,\"ff\"),COUNTIF(CC46:CR46,\"ff\")+COUNTIF(CJ39:CJ54,\"ff\"),COUNTIF(CT46:DI46,\"ff\")+COUNTIF(DA39:DA54,\"ff\"),COUNTIF(CC46:CR46,\"ff\")+COUNTIF(CT46:DI46,\"ff\"),COUNTIF(CJ39:CJ54,\"ff\")+COUNTIF(DA39:DA54,\"ff\"))","v":0},8,{"$f":"SMALL(BN5:BN20,8)","v":8.0901080999999984},null,null,1,1,"",3,3,"",1,null,"","","","","",2,5,1,null,"","",0,"","",0,"",null,2,0,1,0,1,"","",""]
[null,null,{"$f":"IF(RANK(E13,E5:E20,0)>RANK(E12,E5:E20,0),RANK(E13,E5:E20,0),\"\")","v":9},"KV Mechelen",41,30,{"$f":"REPT(IF(F13-MODE(F5:F20)<0,\"-\",\"+\"),ABS(F13-MODE(F5:F20)))","v":""},10,9,11,36,38,-2,49,null,"Lierse","2-2","2-1","0-2","0-6","0-2","0-1","0-0","0-1",null,"1-1","2-2","2-0","2-3","1-1","3-3","3-1",7,26,5,21,28,14,30,12,null,17,3,1,24,23,19,10,"2014-09-13","2015-02-14","2014-08-23","2014-12-26","2015-02-28","2014-11-02","2015-03-14","2014-10-24",null,"2014-11-29","2014-08-09","2014-07-26","2015-01-31","2015-01-24","2014-12-13","2014-10-04",null,16.160116089999999,"Lierse",22,30,{"$f":"CHOOSE(StandBer,COUNTIF(CC47:CR47,\"t\")+COUNTIF(CK39:CK54,\"u\")+COUNTIF(CT47:DI47,\"t\")+COUNTIF(DB39:DB54,\"u\"),COUNTIF(CC47:CR47,\"t\")+COUNTIF(CK39:CK54,\"u\"),COUNTIF(CT47:DI47,\"t\")+COUNTIF(DB39:DB54,\"u\"),COUNTIF(CC47:CR47,\"t\")+COUNTIF(CT47:DI47,\"t\"),COUNTIF(CK39:CK54,\"u\")+COUNTIF(DB39:DB54,\"u\"))","v":5},{"$f":"CHOOSE(StandBer,COUNTIF(CC47:CR47,\"u\")+COUNTIF(CK39:CK54,\"t\")+COUNTIF(CT47:DI47,\"u\")+COUNTIF(DB39:DB54,\"t\"),COUNTIF(CC47:CR47,\"u\")+COUNTIF(CK39:CK54,\"t\"),COUNTIF(CT47:DI47,\"u\")+COUNTIF(DB39:DB54,\"t\"),COUNTIF(CC47:CR47,\"u\")+COUNTIF(CT47:DI47,\"u\"),COUNTIF(CK39:CK54,\"t\")+COUNTIF(DB39:DB54,\"t\"))+BX13","v":18},{"$f":"CHOOSE(StandBer,COUNTIF(CC47:CR47,\"g\")+COUNTIF(CK39:CK54,\"g\")+COUNTIF(CT47:DI47,\"g\")+COUNTIF(DB39:DB54,\"g\"),COUNTIF(CC47:CR47,\"g\")+COUNTIF(CK39:CK54,\"g\"),COUNTIF(CT47:DI47,\"g\")+COUNTIF(DB39:DB54,\"g\"),COUNTIF(CC47:CR47,\"g\")+COUNTIF(CT47:DI47,\"g\"),COUNTIF(CK39:CK54,\"g\")+COUNTIF(DB39:DB54,\"g\"))","v":7},{"$f":"CHOOSE(StandBer,SUM(CC13:CR13)+SUM(CK22:CK37)+SUM(CT13:DI13)+SUM(DB22:DB37),SUM(CC13:CR13)+SUM(CK22:CK37),SUM(CT13:DI13)+SUM(DB22:DB37),SUM(CC13:CR13)+SUM(CT13:DI13),SUM(CK22:CK37)+SUM(DB22:DB37))-5*BX13","v":30},{"$f":"CHOOSE(StandBer,SUM(CK5:CK20)+SUM(CC30:CR30)+SUM(DB5:DB20)+SUM(CT30:DI30),SUM(CK5:CK20)+SUM(CC30:CR30),SUM(DB5:DB20)+SUM(CT30:DI30),SUM(CK5:CK20)+SUM(DB5:DB20),SUM(CC30:CR30)+SUM(CT30:DI30))","v":63},-33,{"$f":"CHOOSE(StandBer,COUNTIF(CC47:CR47,\"ff\")+COUNTIF(CK39:CK54,\"ff\")+COUNTIF(CT47:DI47,\"ff\")+COUNTIF(DB39:DB54,\"ff\"),COUNTIF(CC47:CR47,\"ff\")+COUNTIF(CK39:CK54,\"ff\"),COUNTIF(CT47:DI47,\"ff\")+COUNTIF(DB39:DB54,\"ff\"),COUNTIF(CC47:CR47,\"ff\")+COUNTIF(CT47:DI47,\"ff\"),COUNTIF(CK39:CK54,\"ff\")+COUNTIF(DB39:DB54,\"ff\"))","v":0},9,{"$f":"SMALL(BN5:BN20,9)","v":9.0901090799999995},null,null,2,"",0,"","",0,"",0,null,"",2,2,"","","",3,null,"",2,"",0,0,"",0,"",null,1,"","",2,1,3,""]
[null,null,{"$f":"IF(RANK(E14,E5:E20,0)>RANK(E13,E5:E20,0),RANK(E14,E5:E20,0),\"\")","v":10},"Oostende",38,30,{"$f":"REPT(IF(F14-MODE(F5:F20)<0,\"-\",\"+\"),ABS(F14-MODE(F5:F20)))","v":""},11,14,5,40,50,-10,52,null,"Lokeren","1-2","0-0","5-2","1-3","1-1","3-3","1-2","3-2","2-0",null,"1-0","3-1","1-1","3-0","0-0","2-1",29,18,13,11,22,24,20,8,4,null,27,10,6,15,16,2,"2015-03-07","2014-12-06","2014-10-29","2014-10-19","2015-01-18","2015-01-31","2014-12-21","2014-09-21","2014-08-16",null,"2015-02-21","2014-10-05","2014-08-31","2014-11-09","2014-11-22","2014-08-03",null,8.0901080999999984,"Lokeren",42,30,{"$f":"CHOOSE(StandBer,COUNTIF(CC48:CR48,\"t\")+COUNTIF(CL39:CL54,\"u\")+COUNTIF(CT48:DI48,\"t\")+COUNTIF(DC39:DC54,\"u\"),COUNTIF(CC48:CR48,\"t\")+COUNTIF(CL39:CL54,\"u\"),COUNTIF(CT48:DI48,\"t\")+COUNTIF(DC39:DC54,\"u\"),COUNTIF(CC48:CR48,\"t\")+COUNTIF(CT48:DI48,\"t\"),COUNTIF(CL39:CL54,\"u\")+COUNTIF(DC39:DC54,\"u\"))","v":10},{"$f":"CHOOSE(StandBer,COUNTIF(CC48:CR48,\"u\")+COUNTIF(CL39:CL54,\"t\")+COUNTIF(CT48:DI48,\"u\")+COUNTIF(DC39:DC54,\"t\"),COUNTIF(CC48:CR48,\"u\")+COUNTIF(CL39:CL54,\"t\"),COUNTIF(CT48:DI48,\"u\")+COUNTIF(DC39:DC54,\"t\"),COUNTIF(CC48:CR48,\"u\")+COUNTIF(CT48:DI48,\"u\"),COUNTIF(CL39:CL54,\"t\")+COUNTIF(DC39:DC54,\"t\"))+BX14","v":8},{"$f":"CHOOSE(StandBer,COUNTIF(CC48:CR48,\"g\")+COUNTIF(CL39:CL54,\"g\")+COUNTIF(CT48:DI48,\"g\")+COUNTIF(DC39:DC54,\"g\"),COUNTIF(CC48:CR48,\"g\")+COUNTIF(CL39:CL54,\"g\"),COUNTIF(CT48:DI48,\"g\")+COUNTIF(DC39:DC54,\"g\"),COUNTIF(CC48:CR48,\"g\")+COUNTIF(CT48:DI48,\"g\"),COUNTIF(CL39:CL54,\"g\")+COUNTIF(DC39:DC54,\"g\"))","v":12},{"$f":"CHOOSE(StandBer,SUM(CC14:CR14)+SUM(CL22:CL37)+SUM(CT14:DI14)+SUM(DC22:DC37),SUM(CC14:CR14)+SUM(CL22:CL37),SUM(CT14:DI14)+SUM(DC22:DC37),SUM(CC14:CR14)+SUM(CT14:DI14),SUM(CL22:CL37)+SUM(DC22:DC37))-5*BX14","v":38},{"$f":"CHOOSE(StandBer,SUM(CL5:CL20)+SUM(CC31:CR31)+SUM(DC5:DC20)+SUM(CT31:DI31),SUM(CL5:CL20)+SUM(CC31:CR31),SUM(DC5:DC20)+SUM(CT31:DI31),SUM(CL5:CL20)+SUM(DC5:DC20),SUM(CC31:CR31)+SUM(CT31:DI31))","v":32},6,{"$f":"CHOOSE(StandBer,COUNTIF(CC48:CR48,\"ff\")+COUNTIF(CL39:CL54,\"ff\")+COUNTIF(CT48:DI48,\"ff\")+COUNTIF(DC39:DC54,\"ff\"),COUNTIF(CC48:CR48,\"ff\")+COUNTIF(CL39:CL54,\"ff\"),COUNTIF(CT48:DI48,\"ff\")+COUNTIF(DC39:DC54,\"ff\"),COUNTIF(CC48:CR48,\"ff\")+COUNTIF(CT48:DI48,\"ff\"),COUNTIF(CL39:CL54,\"ff\")+COUNTIF(DC39:DC54,\"ff\"))","v":0},10,{"$f":"SMALL(BN5:BN20,10)","v":10.080110119999999},null,null,"","",5,1,"","","",3,2,null,"",3,1,3,"",2,null,1,0,"","",1,3,1,"","",null,1,"","","",0,""]
[null,null,{"$f":"IF(RANK(E15,E5:E20,0)>RANK(E14,E5:E20,0),RANK(E15,E5:E20,0),\"\")","v":11},"Westerlo",33,30,{"$f":"REPT(IF(F15-MODE(F5:F20)<0,\"-\",\"+\"),ABS(F15-MODE(F5:F20)))","v":""},8,13,9,40,63,-23,57,null,"Moeskroen-Peruwelz","4-2","4-0","0-2","1-4","1-2","1-3","0-3","0-0","2-1","2-2",null,"0-1","5-2","1-0","1-0","0-1",18,6,15,13,8,22,24,10,16,12,null,26,4,2,29,20,"2014-12-06","2014-08-30","2014-11-08","2014-10-30","2014-09-20","2015-01-17","2015-01-31","2014-10-04","2014-11-22","2014-10-26",null,"2015-02-14","2014-08-15","2014-08-02","2015-03-07","2014-12-20",null,13.130112110000001,"Moeskroen-Peruwelz",26,30,{"$f":"CHOOSE(StandBer,COUNTIF(CC49:CR49,\"t\")+COUNTIF(CM39:CM54,\"u\")+COUNTIF(CT49:DI49,\"t\")+COUNTIF(DD39:DD54,\"u\"),COUNTIF(CC49:CR49,\"t\")+COUNTIF(CM39:CM54,\"u\"),COUNTIF(CT49:DI49,\"t\")+COUNTIF(DD39:DD54,\"u\"),COUNTIF(CC49:CR49,\"t\")+COUNTIF(CT49:DI49,\"t\"),COUNTIF(CM39:CM54,\"u\")+COUNTIF(DD39:DD54,\"u\"))","v":7},{"$f":"CHOOSE(StandBer,COUNTIF(CC49:CR49,\"u\")+COUNTIF(CM39:CM54,\"t\")+COUNTIF(CT49:DI49,\"u\")+COUNTIF(DD39:DD54,\"t\"),COUNTIF(CC49:CR49,\"u\")+COUNTIF(CM39:CM54,\"t\"),COUNTIF(CT49:DI49,\"u\")+COUNTIF(DD39:DD54,\"t\"),COUNTIF(CC49:CR49,\"u\")+COUNTIF(CT49:DI49,\"u\"),COUNTIF(CM39:CM54,\"t\")+COUNTIF(DD39:DD54,\"t\"))+BX15","v":18},{"$f":"CHOOSE(StandBer,COUNTIF(CC49:CR49,\"g\")+COUNTIF(CM39:CM54,\"g\")+COUNTIF(CT49:DI49,\"g\")+COUNTIF(DD39:DD54,\"g\"),COUNTIF(CC49:CR49,\"g\")+COUNTIF(CM39:CM54,\"g\"),COUNTIF(CT49:DI49,\"g\")+COUNTIF(DD39:DD54,\"g\"),COUNTIF(CC49:CR49,\"g\")+COUNTIF(CT49:DI49,\"g\"),COUNTIF(CM39:CM54,\"g\")+COUNTIF(DD39:DD54,\"g\"))","v":5},{"$f":"CHOOSE(StandBer,SUM(CC15:CR15)+SUM(CM22:CM37)+SUM(CT15:DI15)+SUM(DD22:DD37),SUM(CC15:CR15)+SUM(CM22:CM37),SUM(CT15:DI15)+SUM(DD22:DD37),SUM(CC15:CR15)+SUM(CT15:DI15),SUM(CM22:CM37)+SUM(DD22:DD37))-5*BX15","v":31},{"$f":"CHOOSE(StandBer,SUM(CM5:CM20)+SUM(CC32:CR32)+SUM(DD5:DD20)+SUM(CT32:DI32),SUM(CM5:CM20)+SUM(CC32:CR32),SUM(DD5:DD20)+SUM(CT32:DI32),SUM(CM5:CM20)+SUM(DD5:DD20),SUM(CC32:CR32)+SUM(CT32:DI32))","v":50},-19,{"$f":"CHOOSE(StandBer,COUNTIF(CC49:CR49,\"ff\")+COUNTIF(CM39:CM54,\"ff\")+COUNTIF(CT49:DI49,\"ff\")+COUNTIF(DD39:DD54,\"ff\"),COUNTIF(CC49:CR49,\"ff\")+COUNTIF(CM39:CM54,\"ff\"),COUNTIF(CT49:DI49,\"ff\")+COUNTIF(DD39:DD54,\"ff\"),COUNTIF(CC49:CR49,\"ff\")+COUNTIF(CT49:DI49,\"ff\"),COUNTIF(CM39:CM54,\"ff\")+COUNTIF(DD39:DD54,\"ff\"))","v":0},11,{"$f":"SMALL(BN5:BN20,11)","v":11.110114149999999},null,null,"",4,0,1,1,"","",0,"",2,null,"",5,1,"","",null,4,"","","","",1,0,"",2,"",null,0,"","",1,0]
[null,null,{"$f":"IF(RANK(E16,E5:E20,0)>RANK(E15,E5:E20,0),RANK(E16,E5:E20,0),\"\")","v":12},"Zulte-Waregem",31,30,{"$f":"REPT(IF(F16-MODE(F5:F20)<0,\"-\",\"+\"),ABS(F16-MODE(F5:F20)))","v":""},8,15,7,41,54,-13,59,null,"Oostende","0-2","2-0","1-3","2-2","1-1","1-3","1-7","2-0","2-1","0-1","0-0",null,"3-2","4-3","4-0","1-3",2,20,27,9,6,8,22,4,18,25,11,null,16,29,13,15,"2014-08-01","2014-12-20","2015-02-21","2014-09-28","2014-08-30","2014-09-20","2015-01-17","2014-08-16","2014-12-06","2015-02-07","2014-10-18",null,"2014-11-23","2015-03-07","2014-10-29","2014-11-07",null,10.080110119999999,"Oostende",38,30,{"$f":"CHOOSE(StandBer,COUNTIF(CC50:CR50,\"t\")+COUNTIF(CN39:CN54,\"u\")+COUNTIF(CT50:DI50,\"t\")+COUNTIF(DE39:DE54,\"u\"),COUNTIF(CC50:CR50,\"t\")+COUNTIF(CN39:CN54,\"u\"),COUNTIF(CT50:DI50,\"t\")+COUNTIF(DE39:DE54,\"u\"),COUNTIF(CC50:CR50,\"t\")+COUNTIF(CT50:DI50,\"t\"),COUNTIF(CN39:CN54,\"u\")+COUNTIF(DE39:DE54,\"u\"))","v":11},{"$f":"CHOOSE(StandBer,COUNTIF(CC50:CR50,\"u\")+COUNTIF(CN39:CN54,\"t\")+COUNTIF(CT50:DI50,\"u\")+COUNTIF(DE39:DE54,\"t\"),COUNTIF(CC50:CR50,\"u\")+COUNTIF(CN39:CN54,\"t\"),COUNTIF(CT50:DI50,\"u\")+COUNTIF(DE39:DE54,\"t\"),COUNTIF(CC50:CR50,\"u\")+COUNTIF(CT50:DI50,\"u\"),COUNTIF(CN39:CN54,\"t\")+COUNTIF(DE39:DE54,\"t\"))+BX16","v":14},{"$f":"CHOOSE(StandBer,COUNTIF(CC50:CR50,\"g\")+COUNTIF(CN39:CN54,\"g\")+COUNTIF(CT50:DI50,\"g\")+COUNTIF(DE39:DE54,\"g\"),COUNTIF(CC50:CR50,\"g\")+COUNTIF(CN39:CN54,\"g\"),COUNTIF(CT50:DI50,\"g\")+COUNTIF(DE39:DE54,\"g\"),COUNTIF(CC50:CR50,\"g\")+COUNTIF(CT50:DI50,\"g\"),COUNTIF(CN39:CN54,\"g\")+COUNTIF(DE39:DE54,\"g\"))","v":5},{"$f":"CHOOSE(StandBer,SUM(CC16:CR16)+SUM(CN22:CN37)+SUM(CT16:DI16)+SUM(DE22:DE37),SUM(CC16:CR16)+SUM(CN22:CN37),SUM(CT16:DI16)+SUM(DE22:DE37),SUM(CC16:CR16)+SUM(CT16:DI16),SUM(CN22:CN37)+SUM(DE22:DE37))-5*BX16","v":40},{"$f":"CHOOSE(StandBer,SUM(CN5:CN20)+SUM(CC33:CR33)+SUM(DE5:DE20)+SUM(CT33:DI33),SUM(CN5:CN20)+SUM(CC33:CR33),SUM(DE5:DE20)+SUM(CT33:DI33),SUM(CN5:CN20)+SUM(DE5:DE20),SUM(CC33:CR33)+SUM(CT33:DI33))","v":50},-10,{"$f":"CHOOSE(StandBer,COUNTIF(CC50:CR50,\"ff\")+COUNTIF(CN39:CN54,\"ff\")+COUNTIF(CT50:DI50,\"ff\")+COUNTIF(DE39:DE54,\"ff\"),COUNTIF(CC50:CR50,\"ff\")+COUNTIF(CN39:CN54,\"ff\"),COUNTIF(CT50:DI50,\"ff\")+COUNTIF(DE39:DE54,\"ff\"),COUNTIF(CC50:CR50,\"ff\")+COUNTIF(CT50:DI50,\"ff\"),COUNTIF(CN39:CN54,\"ff\")+COUNTIF(DE39:DE54,\"ff\"))","v":0},12,{"$f":"SMALL(BN5:BN20,12)","v":12.110111160000001},null,null,0,"","",2,1,1,"",2,"","",0,null,"","",4,1,null,"",2,1,"","","",1,"",2,0,"",null,3,4,"",""]
[null,null,{"$f":"IF(RANK(E17,E5:E20,0)>RANK(E16,E5:E20,0),RANK(E17,E5:E20,0),\"\")","v":13},"Moeskroen-Peruwelz",26,30,{"$f":"REPT(IF(F17-MODE(F5:F20)<0,\"-\",\"+\"),ABS(F17-MODE(F5:F20)))","v":""},7,18,5,31,50,-19,64,null,"Standard","2-0","1-0","3-0","1-3","1-0","0-1","0-2","2-0","2-2","2-0","3-0","3-5",null,"3-2","2-2","1-2",23,28,1,19,30,3,17,14,9,21,25,7,null,27,5,11,"2015-01-24","2015-02-27","2014-07-25","2014-12-14","2015-03-14","2014-08-10","2014-11-29","2014-11-01","2014-09-28","2014-12-27","2015-02-06","2014-09-13",null,"2015-02-21","2014-08-23","2014-10-19",null,4.0201061299999994,"Standard",53,30,{"$f":"CHOOSE(StandBer,COUNTIF(CC51:CR51,\"t\")+COUNTIF(CO39:CO54,\"u\")+COUNTIF(CT51:DI51,\"t\")+COUNTIF(DF39:DF54,\"u\"),COUNTIF(CC51:CR51,\"t\")+COUNTIF(CO39:CO54,\"u\"),COUNTIF(CT51:DI51,\"t\")+COUNTIF(DF39:DF54,\"u\"),COUNTIF(CC51:CR51,\"t\")+COUNTIF(CT51:DI51,\"t\"),COUNTIF(CO39:CO54,\"u\")+COUNTIF(DF39:DF54,\"u\"))","v":16},{"$f":"CHOOSE(StandBer,COUNTIF(CC51:CR51,\"u\")+COUNTIF(CO39:CO54,\"t\")+COUNTIF(CT51:DI51,\"u\")+COUNTIF(DF39:DF54,\"t\"),COUNTIF(CC51:CR51,\"u\")+COUNTIF(CO39:CO54,\"t\"),COUNTIF(CT51:DI51,\"u\")+COUNTIF(DF39:DF54,\"t\"),COUNTIF(CC51:CR51,\"u\")+COUNTIF(CT51:DI51,\"u\"),COUNTIF(CO39:CO54,\"t\")+COUNTIF(DF39:DF54,\"t\"))+BX17","v":9},{"$f":"CHOOSE(StandBer,COUNTIF(CC51:CR51,\"g\")+COUNTIF(CO39:CO54,\"g\")+COUNTIF(CT51:DI51,\"g\")+COUNTIF(DF39:DF54,\"g\"),COUNTIF(CC51:CR51,\"g\")+COUNTIF(CO39:CO54,\"g\"),COUNTIF(CT51:DI51,\"g\")+COUNTIF(DF39:DF54,\"g\"),COUNTIF(CC51:CR51,\"g\")+COUNTIF(CT51:DI51,\"g\"),COUNTIF(CO39:CO54,\"g\")+COUNTIF(DF39:DF54,\"g\"))","v":5},{"$f":"CHOOSE(StandBer,SUM(CC17:CR17)+SUM(CO22:CO37)+SUM(CT17:DI17)+SUM(DF22:DF37),SUM(CC17:CR17)+SUM(CO22:CO37),SUM(CT17:DI17)+SUM(DF22:DF37),SUM(CC17:CR17)+SUM(CT17:DI17),SUM(CO22:CO37)+SUM(DF22:DF37))-5*BX17","v":49},{"$f":"CHOOSE(StandBer,SUM(CO5:CO20)+SUM(CC34:CR34)+SUM(DF5:DF20)+SUM(CT34:DI34),SUM(CO5:CO20)+SUM(CC34:CR34),SUM(DF5:DF20)+SUM(CT34:DI34),SUM(CO5:CO20)+SUM(DF5:DF20),SUM(CC34:CR34)+SUM(CT34:DI34))","v":39},10,{"$f":"CHOOSE(StandBer,COUNTIF(CC51:CR51,\"ff\")+COUNTIF(CO39:CO54,\"ff\")+COUNTIF(CT51:DI51,\"ff\")+COUNTIF(DF39:DF54,\"ff\"),COUNTIF(CC51:CR51,\"ff\")+COUNTIF(CO39:CO54,\"ff\"),COUNTIF(CT51:DI51,\"ff\")+COUNTIF(DF39:DF54,\"ff\"),COUNTIF(CC51:CR51,\"ff\")+COUNTIF(CT51:DI51,\"ff\"),COUNTIF(CO39:CO54,\"ff\")+COUNTIF(DF39:DF54,\"ff\"))","v":0},13,{"$f":"SMALL(BN5:BN20,13)","v":13.130112110000001},null,null,"","",3,"","",0,"",2,2,"","",3,null,"",2,1,null,2,1,"",1,1,"",0,"","",2,3,"",null,3,"",""]
[null,null,{"$f":"IF(RANK(E18,E5:E20,0)>RANK(E17,E5:E20,0),RANK(E18,E5:E20,0),\"\")","v":""},"Waasland-Beveren",26,30,{"$f":"REPT(IF(F18-MODE(F5:F20)<0,\"-\",\"+\"),ABS(F18-MODE(F5:F20)))","v":""},7,18,5,30,49,-19,64,null,"Waasland-Beveren","0-2","1-0","1-3","0-2","0-1","0-1","1-0","2-2","2-0","0-0","2-1","1-0","0-2",null,"1-1","1-3",20,10,19,1,12,28,26,24,6,30,17,14,8,null,3,22,"2014-12-20","2014-10-04","2014-12-13","2014-07-26","2014-10-25","2015-03-01","2015-02-14","2015-01-31","2014-08-30","2015-03-14","2014-11-29","2014-11-01","2014-09-21",null,"2014-08-09","2015-01-17",null,13.13011214,"Waasland-Beveren",26,30,{"$f":"CHOOSE(StandBer,COUNTIF(CC52:CR52,\"t\")+COUNTIF(CP39:CP54,\"u\")+COUNTIF(CT52:DI52,\"t\")+COUNTIF(DG39:DG54,\"u\"),COUNTIF(CC52:CR52,\"t\")+COUNTIF(CP39:CP54,\"u\"),COUNTIF(CT52:DI52,\"t\")+COUNTIF(DG39:DG54,\"u\"),COUNTIF(CC52:CR52,\"t\")+COUNTIF(CT52:DI52,\"t\"),COUNTIF(CP39:CP54,\"u\")+COUNTIF(DG39:DG54,\"u\"))","v":7},{"$f":"CHOOSE(StandBer,COUNTIF(CC52:CR52,\"u\")+COUNTIF(CP39:CP54,\"t\")+COUNTIF(CT52:DI52,\"u\")+COUNTIF(DG39:DG54,\"t\"),COUNTIF(CC52:CR52,\"u\")+COUNTIF(CP39:CP54,\"t\"),COUNTIF(CT52:DI52,\"u\")+COUNTIF(DG39:DG54,\"t\"),COUNTIF(CC52:CR52,\"u\")+COUNTIF(CT52:DI52,\"u\"),COUNTIF(CP39:CP54,\"t\")+COUNTIF(DG39:DG54,\"t\"))+BX18","v":18},{"$f":"CHOOSE(StandBer,COUNTIF(CC52:CR52,\"g\")+COUNTIF(CP39:CP54,\"g\")+COUNTIF(CT52:DI52,\"g\")+COUNTIF(DG39:DG54,\"g\"),COUNTIF(CC52:CR52,\"g\")+COUNTIF(CP39:CP54,\"g\"),COUNTIF(CT52:DI52,\"g\")+COUNTIF(DG39:DG54,\"g\"),COUNTIF(CC52:CR52,\"g\")+COUNTIF(CT52:DI52,\"g\"),COUNTIF(CP39:CP54,\"g\")+COUNTIF(DG39:DG54,\"g\"))","v":5},{"$f":"CHOOSE(StandBer,SUM(CC18:CR18)+SUM(CP22:CP37)+SUM(CT18:DI18)+SUM(DG22:DG37),SUM(CC18:CR18)+SUM(CP22:CP37),SUM(CT18:DI18)+SUM(DG22:DG37),SUM(CC18:CR18)+SUM(CT18:DI18),SUM(CP22:CP37)+SUM(DG22:DG37))-5*BX18","v":30},{"$f":"CHOOSE(StandBer,SUM(CP5:CP20)+SUM(CC35:CR35)+SUM(DG5:DG20)+SUM(CT35:DI35),SUM(CP5:CP20)+SUM(CC35:CR35),SUM(DG5:DG20)+SUM(CT35:DI35),SUM(CP5:CP20)+SUM(DG5:DG20),SUM(CC35:CR35)+SUM(CT35:DI35))","v":49},-19,{"$f":"CHOOSE(StandBer,COUNTIF(CC52:CR52,\"ff\")+COUNTIF(CP39:CP54,\"ff\")+COUNTIF(CT52:DI52,\"ff\")+COUNTIF(DG39:DG54,\"ff\"),COUNTIF(CC52:CR52,\"ff\")+COUNTIF(CP39:CP54,\"ff\"),COUNTIF(CT52:DI52,\"ff\")+COUNTIF(DG39:DG54,\"ff\"),COUNTIF(CC52:CR52,\"ff\")+COUNTIF(CT52:DI52,\"ff\"),COUNTIF(CP39:CP54,\"ff\")+COUNTIF(DG39:DG54,\"ff\"))","v":0},14,{"$f":"SMALL(BN5:BN20,14)","v":13.13011214},null,null,"",1,"",0,0,"","","",2,"","",1,0,null,1,"",null,0,"",1,"","",0,1,2,"",0,2,"","",null,"",1]
[null,null,{"$f":"IF(RANK(E19,E5:E20,0)>RANK(E18,E5:E20,0),RANK(E19,E5:E20,0),\"\")","v":15},"Cercle Brugge",24,30,{"$f":"REPT(IF(F19-MODE(F5:F20)<0,\"-\",\"+\"),ABS(F19-MODE(F5:F20)))","v":""},6,18,6,21,45,-24,66,null,"Westerlo","2-2","1-0","2-3","1-3","1-2","0-0","2-1","1-1","6-1","1-0","1-3","1-0","1-1","1-2",null,"2-2",4,24,17,30,26,10,12,20,8,1,14,28,22,18,null,6,"2014-08-17","2015-01-31","2014-11-29","2015-03-14","2015-02-13","2014-10-03","2014-10-25","2014-12-20","2014-09-20","2014-07-26","2014-11-02","2015-02-28","2015-01-18","2014-12-05",null,"2014-08-30",null,11.110114149999999,"Westerlo",33,30,{"$f":"CHOOSE(StandBer,COUNTIF(CC53:CR53,\"t\")+COUNTIF(CQ39:CQ54,\"u\")+COUNTIF(CT53:DI53,\"t\")+COUNTIF(DH39:DH54,\"u\"),COUNTIF(CC53:CR53,\"t\")+COUNTIF(CQ39:CQ54,\"u\"),COUNTIF(CT53:DI53,\"t\")+COUNTIF(DH39:DH54,\"u\"),COUNTIF(CC53:CR53,\"t\")+COUNTIF(CT53:DI53,\"t\"),COUNTIF(CQ39:CQ54,\"u\")+COUNTIF(DH39:DH54,\"u\"))","v":8},{"$f":"CHOOSE(StandBer,COUNTIF(CC53:CR53,\"u\")+COUNTIF(CQ39:CQ54,\"t\")+COUNTIF(CT53:DI53,\"u\")+COUNTIF(DH39:DH54,\"t\"),COUNTIF(CC53:CR53,\"u\")+COUNTIF(CQ39:CQ54,\"t\"),COUNTIF(CT53:DI53,\"u\")+COUNTIF(DH39:DH54,\"t\"),COUNTIF(CC53:CR53,\"u\")+COUNTIF(CT53:DI53,\"u\"),COUNTIF(CQ39:CQ54,\"t\")+COUNTIF(DH39:DH54,\"t\"))+BX19","v":13},{"$f":"CHOOSE(StandBer,COUNTIF(CC53:CR53,\"g\")+COUNTIF(CQ39:CQ54,\"g\")+COUNTIF(CT53:DI53,\"g\")+COUNTIF(DH39:DH54,\"g\"),COUNTIF(CC53:CR53,\"g\")+COUNTIF(CQ39:CQ54,\"g\"),COUNTIF(CT53:DI53,\"g\")+COUNTIF(DH39:DH54,\"g\"),COUNTIF(CC53:CR53,\"g\")+COUNTIF(CT53:DI53,\"g\"),COUNTIF(CQ39:CQ54,\"g\")+COUNTIF(DH39:DH54,\"g\"))","v":9},{"$f":"CHOOSE(StandBer,SUM(CC19:CR19)+SUM(CQ22:CQ37)+SUM(CT19:DI19)+SUM(DH22:DH37),SUM(CC19:CR19)+SUM(CQ22:CQ37),SUM(CT19:DI19)+SUM(DH22:DH37),SUM(CC19:CR19)+SUM(CT19:DI19),SUM(CQ22:CQ37)+SUM(DH22:DH37))-5*BX19","v":40},{"$f":"CHOOSE(StandBer,SUM(CQ5:CQ20)+SUM(CC36:CR36)+SUM(DH5:DH20)+SUM(CT36:DI36),SUM(CQ5:CQ20)+SUM(CC36:CR36),SUM(DH5:DH20)+SUM(CT36:DI36),SUM(CQ5:CQ20)+SUM(DH5:DH20),SUM(CC36:CR36)+SUM(CT36:DI36))","v":63},-23,{"$f":"CHOOSE(StandBer,COUNTIF(CC53:CR53,\"ff\")+COUNTIF(CQ39:CQ54,\"ff\")+COUNTIF(CT53:DI53,\"ff\")+COUNTIF(DH39:DH54,\"ff\"),COUNTIF(CC53:CR53,\"ff\")+COUNTIF(CQ39:CQ54,\"ff\"),COUNTIF(CT53:DI53,\"ff\")+COUNTIF(DH39:DH54,\"ff\"),COUNTIF(CC53:CR53,\"ff\")+COUNTIF(CT53:DI53,\"ff\"),COUNTIF(CQ39:CQ54,\"ff\")+COUNTIF(DH39:DH54,\"ff\"))","v":0},15,{"$f":"SMALL(BN5:BN20,15)","v":15.150115019999999},null,null,2,"","","","",0,2,"",6,1,1,"","","",null,2,null,"",1,2,1,1,"","",1,"","","",1,1,1,null,""]
[null,null,{"$f":"IF(RANK(E20,E5:E20,0)>RANK(E19,E5:E20,0),RANK(E20,E5:E20,0),\"\")","v":16},"Lierse",22,30,{"$f":"REPT(IF(F20-MODE(F5:F20)<0,\"-\",\"+\"),ABS(F20-MODE(F5:F20)))","v":""},5,18,7,30,63,-33,68,null,"Zulte-Waregem","0-2","1-2","1-3","1-1","2-0","2-1","2-0","2-3","2-3","1-0","1-1","1-4","1-1","1-4","1-3",null,9,12,21,3,14,17,1,28,25,19,5,30,26,7,23,null,"2014-09-27","2014-10-25","2014-12-26","2014-08-10","2014-10-31","2014-11-29","2014-07-27","2015-02-28","2015-02-07","2014-12-14","2014-08-23","2015-03-14","2015-02-14","2014-09-13","2015-01-24",null,null,12.110111160000001,"Zulte-Waregem",31,30,{"$f":"CHOOSE(StandBer,COUNTIF(CC54:CR54,\"t\")+COUNTIF(CR39:CR54,\"u\")+COUNTIF(CT54:DI54,\"t\")+COUNTIF(DI39:DI54,\"u\"),COUNTIF(CC54:CR54,\"t\")+COUNTIF(CR39:CR54,\"u\"),COUNTIF(CT54:DI54,\"t\")+COUNTIF(DI39:DI54,\"u\"),COUNTIF(CC54:CR54,\"t\")+COUNTIF(CT54:DI54,\"t\"),COUNTIF(CR39:CR54,\"u\")+COUNTIF(DI39:DI54,\"u\"))","v":8},{"$f":"CHOOSE(StandBer,COUNTIF(CC54:CR54,\"u\")+COUNTIF(CR39:CR54,\"t\")+COUNTIF(CT54:DI54,\"u\")+COUNTIF(DI39:DI54,\"t\"),COUNTIF(CC54:CR54,\"u\")+COUNTIF(CR39:CR54,\"t\"),COUNTIF(CT54:DI54,\"u\")+COUNTIF(DI39:DI54,\"t\"),COUNTIF(CC54:CR54,\"u\")+COUNTIF(CT54:DI54,\"u\"),COUNTIF(CR39:CR54,\"t\")+COUNTIF(DI39:DI54,\"t\"))+BX20","v":15},{"$f":"CHOOSE(StandBer,COUNTIF(CC54:CR54,\"g\")+COUNTIF(CR39:CR54,\"g\")+COUNTIF(CT54:DI54,\"g\")+COUNTIF(DI39:DI54,\"g\"),COUNTIF(CC54:CR54,\"g\")+COUNTIF(CR39:CR54,\"g\"),COUNTIF(CT54:DI54,\"g\")+COUNTIF(DI39:DI54,\"g\"),COUNTIF(CC54:CR54,\"g\")+COUNTIF(CT54:DI54,\"g\"),COUNTIF(CR39:CR54,\"g\")+COUNTIF(DI39:DI54,\"g\"))","v":7},{"$f":"CHOOSE(StandBer,SUM(CC20:CR20)+SUM(CR22:CR37)+SUM(CT20:DI20)+SUM(DI22:DI37),SUM(CC20:CR20)+SUM(CR22:CR37),SUM(CT20:DI20)+SUM(DI22:DI37),SUM(CC20:CR20)+SUM(CT20:DI20),SUM(CR22:CR37)+SUM(DI22:DI37))-5*BX20","v":41},{"$f":"CHOOSE(StandBer,SUM(CR5:CR20)+SUM(CC37:CR37)+SUM(DI5:DI20)+SUM(CT37:DI37),SUM(CR5:CR20)+SUM(CC37:CR37),SUM(DI5:DI20)+SUM(CT37:DI37),SUM(CR5:CR20)+SUM(DI5:DI20),SUM(CC37:CR37)+SUM(CT37:DI37))","v":54},-13,{"$f":"CHOOSE(StandBer,COUNTIF(CC54:CR54,\"ff\")+COUNTIF(CR39:CR54,\"ff\")+COUNTIF(CT54:DI54,\"ff\")+COUNTIF(DI39:DI54,\"ff\"),COUNTIF(CC54:CR54,\"ff\")+COUNTIF(CR39:CR54,\"ff\"),COUNTIF(CT54:DI54,\"ff\")+COUNTIF(DI39:DI54,\"ff\"),COUNTIF(CC54:CR54,\"ff\")+COUNTIF(CT54:DI54,\"ff\"),COUNTIF(CR39:CR54,\"ff\")+COUNTIF(DI39:DI54,\"ff\"))","v":0},16,{"$f":"SMALL(BN5:BN20,16)","v":16.160116089999999},null,null,0,1,"",1,2,"",2,"","","",1,"","",1,"",null,null,"","",1,"","",2,"",2,2,1,"",1,1,"",1]
[null,null,null,null,null,null,null,null,null,null,null,null,null,null,null,null,null,"* regeling forfaits"]
[null,null,null,null,null,null,null,null,null,null,null,null,null,null,null,null,null,null,null,null,null,null,null,null,null,null,null,null,null,null,null,null,null,null,null,null,null,null,null,null,null,null,null,null,null,null,null,null,null,null,null,null,null,null,null,null,null,null,null,null,null,null,null,null,null,null,null,null,null,null,null,null,null,null,null,null,null,null,null,null,null,{"$f":"IF(OR(ISERROR(FIND(\"-\",R5)),AH5>15),\"\",IF(RIGHT(R5)=\"*\",5,MID(R5,FIND(\"-\",R5)+1,LEN(R5)-FIND(\"-\",R5))-0))","v":2},{"$f":"IF(OR(ISERROR(FIND(\"-\",S5)),AI5>15),\"\",IF(RIGHT(S5)=\"*\",5,MID(S5,FIND(\"-\",S5)+1,LEN(S5)-FIND(\"-\",S5))-0))","v":0},{"$f":"IF(OR(ISERROR(FIND(\"-\",T5)),AJ5>15),\"\",IF(RIGHT(T5)=\"*\",5,MID(T5,FIND(\"-\",T5)+1,LEN(T5)-FIND(\"-\",T5))-0))","v":""},{"$f":"IF(OR(ISERROR(FIND(\"-\",U5)),AK5>15),\"\",IF(RIGHT(U5)=\"*\",5,MID(U5,FIND(\"-\",U5)+1,LEN(U5)-FIND(\"-\",U5))-0))","v":0},{"$f":"IF(OR(ISERROR(FIND(\"-\",V5)),AL5>15),\"\",IF(RIGHT(V5)=\"*\",5,MID(V5,FIND(\"-\",V5)+1,LEN(V5)-FIND(\"-\",V5))-0))","v":""},{"$f":"IF(OR(ISERROR(FIND(\"-\",W5)),AM5>15),\"\",IF(RIGHT(W5)=\"*\",5,MID(W5,FIND(\"-\",W5)+1,LEN(W5)-FIND(\"-\",W5))-0))","v":""},{"$f":"IF(OR(ISERROR(FIND(\"-\",X5)),AN5>15),\"\",IF(RIGHT(X5)=\"*\",5,MID(X5,FIND(\"-\",X5)+1,LEN(X5)-FIND(\"-\",X5))-0))","v":""},{"$f":"IF(OR(ISERROR(FIND(\"-\",Y5)),AO5>15),\"\",IF(RIGHT(Y5)=\"*\",5,MID(Y5,FIND(\"-\",Y5)+1,LEN(Y5)-FIND(\"-\",Y5))-0))","v":""},{"$f":"IF(OR(ISERROR(FIND(\"-\",Z5)),AP5>15),\"\",IF(RIGHT(Z5)=\"*\",5,MID(Z5,FIND(\"-\",Z5)+1,LEN(Z5)-FIND(\"-\",Z5))-0))","v":1},{"$f":"IF(OR(ISERROR(FIND(\"-\",AA5)),AQ5>15),\"\",IF(RIGHT(AA5)=\"*\",5,MID(AA5,FIND(\"-\",AA5)+1,LEN(AA5)-FIND(\"-\",AA5))-0))","v":1},{"$f":"IF(OR(ISERROR(FIND(\"-\",AB5)),AR5>15),\"\",IF(RIGHT(AB5)=\"*\",5,MID(AB5,FIND(\"-\",AB5)+1,LEN(AB5)-FIND(\"-\",AB5))-0))","v":""},{"$f":"IF(OR(ISERROR(FIND(\"-\",AC5)),AS5>15),\"\",IF(RIGHT(AC5)=\"*\",5,MID(AC5,FIND(\"-\",AC5)+1,LEN(AC5)-FIND(\"-\",AC5))-0))","v":2},{"$f":"IF(OR(ISERROR(FIND(\"-\",AD5)),AT5>15),\"\",IF(RIGHT(AD5)=\"*\",5,MID(AD5,FIND(\"-\",AD5)+1,LEN(AD5)-FIND(\"-\",AD5))-0))","v":0},{"$f":"IF(OR(ISERROR(FIND(\"-\",AE5)),AU5>15),\"\",IF(RIGHT(AE5)=\"*\",5,MID(AE5,FIND(\"-\",AE5)+1,LEN(AE5)-FIND(\"-\",AE5))-0))","v":""},{"$f":"IF(OR(ISERROR(FIND(\"-\",AF5)),AV5>15),\"\",IF(RIGHT(AF5)=\"*\",5,MID(AF5,FIND(\"-\",AF5)+1,LEN(AF5)-FIND(\"-\",AF5))-0))","v":""},null,null,{"$f":"IF(OR(ISERROR(FIND(\"-\",R5)),AH5<=15),\"\",IF(RIGHT(R5)=\"*\",5,MID(R5,FIND(\"-\",R5)+1,LEN(R5)-FIND(\"-\",R5))-0))","v":""},{"$f":"IF(OR(ISERROR(FIND(\"-\",S5)),AI5<=15),\"\",IF(RIGHT(S5)=\"*\",5,MID(S5,FIND(\"-\",S5)+1,LEN(S5)-FIND(\"-\",S5))-0))","v":""},{"$f":"IF(OR(ISERROR(FIND(\"-\",T5)),AJ5<=15),\"\",IF(RIGHT(T5)=\"*\",5,MID(T5,FIND(\"-\",T5)+1,LEN(T5)-FIND(\"-\",T5))-0))","v":2},{"$f":"IF(OR(ISERROR(FIND(\"-\",U5)),AK5<=15),\"\",IF(RIGHT(U5)=\"*\",5,MID(U5,FIND(\"-\",U5)+1,LEN(U5)-FIND(\"-\",U5))-0))","v":""},{"$f":"IF(OR(ISERROR(FIND(\"-\",V5)),AL5<=15),\"\",IF(RIGHT(V5)=\"*\",5,MID(V5,FIND(\"-\",V5)+1,LEN(V5)-FIND(\"-\",V5))-0))","v":2},{"$f":"IF(OR(ISERROR(FIND(\"-\",W5)),AM5<=15),\"\",IF(RIGHT(W5)=\"*\",5,MID(W5,FIND(\"-\",W5)+1,LEN(W5)-FIND(\"-\",W5))-0))","v":0},{"$f":"IF(OR(ISERROR(FIND(\"-\",X5)),AN5<=15),\"\",IF(RIGHT(X5)=\"*\",5,MID(X5,FIND(\"-\",X5)+1,LEN(X5)-FIND(\"-\",X5))-0))","v":1},{"$f":"IF(OR(ISERROR(FIND(\"-\",Y5)),AO5<=15),\"\",IF(RIGHT(Y5)=\"*\",5,MID(Y5,FIND(\"-\",Y5)+1,LEN(Y5)-FIND(\"-\",Y5))-0))","v":0},{"$f":"IF(OR(ISERROR(FIND(\"-\",Z5)),AP5<=15),\"\",IF(RIGHT(Z5)=\"*\",5,MID(Z5,FIND(\"-\",Z5)+1,LEN(Z5)-FIND(\"-\",Z5))-0))","v":""},{"$f":"IF(OR(ISERROR(FIND(\"-\",AA5)),AQ5<=15),\"\",IF(RIGHT(AA5)=\"*\",5,MID(AA5,FIND(\"-\",AA5)+1,LEN(AA5)-FIND(\"-\",AA5))-0))","v":""},{"$f":"IF(OR(ISERROR(FIND(\"-\",AB5)),AR5<=15),\"\",IF(RIGHT(AB5)=\"*\",5,MID(AB5,FIND(\"-\",AB5)+1,LEN(AB5)-FIND(\"-\",AB5))-0))","v":0},{"$f":"IF(OR(ISERROR(FIND(\"-\",AC5)),AS5<=15),\"\",IF(RIGHT(AC5)=\"*\",5,MID(AC5,FIND(\"-\",AC5)+1,LEN(AC5)-FIND(\"-\",AC5))-0))","v":""},{"$f":"IF(OR(ISERROR(FIND(\"-\",AD5)),AT5<=15),\"\",IF(RIGHT(AD5)=\"*\",5,MID(AD5,FIND(\"-\",AD5)+1,LEN(AD5)-FIND(\"-\",AD5))-0))","v":""},{"$f":"IF(OR(ISERROR(FIND(\"-\",AE5)),AU5<=15),\"\",IF(RIGHT(AE5)=\"*\",5,MID(AE5,FIND(\"-\",AE5)+1,LEN(AE5)-FIND(\"-\",AE5))-0))","v":0},{"$f":"IF(OR(ISERROR(FIND(\"-\",AF5)),AV5<=15),\"\",IF(RIGHT(AF5)=\"*\",5,MID(AF5,FIND(\"-\",AF5)+1,LEN(AF5)-FIND(\"-\",AF5))-0))","v":0}]
[null,null,null,null,{"$f":"'export html'!V1","v":"Recentste duels op "},"2015-03-15",null,null,null,null,null,null,null,null,null,null,"Topschutters:",null,null,null,null,null,null,null,null,null,null,null,null,null,null,null,null,null,null,null,null,null,null,null,null,null,null,null,null,null,null,null,null,null,null,null,null,null,null,null,null,null,null,null,null,null,null,null,null,null,null,null,null,null,null,null,null,null,null,null,null,null,null,null,{"$f":"IF(OR(ISERROR(FIND(\"-\",Q6)),AG6>15),\"\",IF(RIGHT(Q6)=\"*\",5,MID(Q6,FIND(\"-\",Q6)+1,LEN(Q6)-FIND(\"-\",Q6))-0))","v":""},null,0,"","",0,4,"",2,0,"",1,1,"",2,"",null,{"$f":"IF(OR(ISERROR(FIND(\"-\",Q6)),AG6<=15),\"\",IF(RIGHT(Q6)=\"*\",5,MID(Q6,FIND(\"-\",Q6)+1,LEN(Q6)-FIND(\"-\",Q6))-0))","v":2},null,"",3,1,"","",3,"","",1,"","",0,"",2]
[null,null,null,null,null,null,null,null,null,null,null,null,null,null,null,null,null,null,null,null,null,null,null,null,null,null,null,null,null,null,null,null,null,null,null,null,null,null,null,null,null,null,null,null,null,null,null,null,null,null,null,null,null,null,null,null,null,null,null,null,null,null,null,null,null,null,null,null,null,null,null,null,null,null,null,null,null,null,null,null,"","",null,0,"","",2,0,"","","",0,"",2,3,1,null,1,2,null,"",0,0,"","",0,0,0,"",1,"","",""]
[null,null,null,{"$f":"IF('export html'!$T3=\"\",\"\",'export html'!T3)","v":"2015-03-14"},{"$f":"IF('export html'!$U3=\"\",\"\",'export html'!U3)","v":30},{"$f":"IF('export html'!$V3=\"\",\"\",'export html'!V3)","v":"Lierse - Kortrijk"},null,null,null,null,null,null,null,{"$f":"IF('export html'!$W3=\"\",\"\",'export html'!W3)","v":"0-0"},null,null,{"$f":"'export html'!AG3","v":5},{"$f":"'export html'!AF3","v":"Keita Alhassane"},null,null,null,null,null,null,null,null,null,null,null,null,null,null,null,null,null,null,null,null,null,null,null,null,null,null,null,null,null,null,null,null,null,null,null,null,null,null,null,null,null,null,null,null,null,null,null,null,null,null,null,null,null,null,null,null,null,null,null,null,null,null,2,1,"",null,"",2,0,"",0,"","","",0,"",0,"",null,"","",0,null,1,"","",1,"",1,0,0,"",2,"",1]
[null,null,null,{"$f":"IF('export html'!$T4=\"\",\"\",'export html'!T4)","v":"2015-03-07"},{"$f":"IF('export html'!$U4=\"\",\"\",'export html'!U4)","v":29},{"$f":"IF('export html'!$V4=\"\",\"\",'export html'!V4)","v":"Gent - Lierse"},null,null,null,null,null,null,null,{"$f":"IF('export html'!$W4=\"\",\"\",'export html'!W4)","v":"2-1"},null,null,{"$f":"'export html'!AG4","v":4},{"$f":"'export html'!AF4","v":"Kasmi Faisel"},null,null,null,null,null,null,null,null,null,null,null,null,null,null,null,null,null,null,null,null,null,null,null,null,null,null,null,null,null,null,null,null,null,null,null,null,null,null,null,null,null,null,null,null,null,null,null,null,null,null,null,null,null,null,null,null,null,null,null,null,null,null,"",1,1,1,null,2,"","",0,0,"","",2,"",1,"",null,2,"","","",null,"",0,0,"","",0,1,"",0,"",2]
[null,null,null,{"$f":"IF('export html'!$T5=\"\",\"\",'export html'!T5)","v":"2015-02-28"},{"$f":"IF('export html'!$U5=\"\",\"\",'export html'!U5)","v":28},{"$f":"IF('export html'!$V5=\"\",\"\",'export html'!V5)","v":"Lierse - Genk"},null,null,null,null,null,null,null,{"$f":"IF('export html'!$W5=\"\",\"\",'export html'!W5)","v":"0-2"},null,null,{"$f":"'export html'!AG5","v":2},{"$f":"'export html'!AF5","v":"Bourabia Rachid"},null,null,null,null,null,null,null,null,null,null,null,null,null,null,null,null,null,null,null,null,null,null,null,null,null,null,null,null,null,null,null,null,null,null,null,null,null,null,null,null,null,null,null,null,null,null,null,null,null,null,null,null,null,null,null,null,null,null,null,null,null,null,2,"",2,"","",null,1,1,"",1,0,"","",1,"",1,null,"",0,"",1,0,null,"","",1,"","",1,2,"",0,""]
[null,null,null,{"$f":"IF('export html'!$T6=\"\",\"\",'export html'!T6)","v":"2015-02-21"},{"$f":"IF('export html'!$U6=\"\",\"\",'export html'!U6)","v":27},{"$f":"IF('export html'!$V6=\"\",\"\",'export html'!V6)","v":"KV Mechelen - Lierse"},null,null,null,null,null,null,null,{"$f":"IF('export html'!$W6=\"\",\"\",'export html'!W6)","v":"2-1"},null,null,{"$f":"'export html'!AG6","v":2},{"$f":"'export html'!AF6","v":"Kouemaha Dorge"},null,null,null,null,null,null,null,null,null,null,null,null,null,null,null,null,null,null,null,null,null,null,null,null,null,null,null,null,null,null,null,null,null,null,null,null,null,null,null,null,null,null,null,null,null,null,null,null,null,null,null,null,null,null,null,null,null,null,null,null,null,null,3,"","","",1,"",null,"",0,3,0,2,3,1,"","",null,"",0,0,0,"",3,null,0,"","","","","","",0,1]
[null,null,null,{"$f":"IF('export html'!$T7=\"\",\"\",'export html'!T7)","v":"2015-02-14"},{"$f":"IF('export html'!$U7=\"\",\"\",'export html'!U7)","v":26},{"$f":"IF('export html'!$V7=\"\",\"\",'export html'!V7)","v":"Lierse - Cercle Brugge"},null,null,null,null,null,null,null,{"$f":"IF('export html'!$W7=\"\",\"\",'export html'!W7)","v":"2-1"},null,null,{"$f":"'export html'!AG7","v":2},{"$f":"'export html'!AF7","v":"Ngawa Pierre-Yves"},null,null,null,null,null,null,null,null,null,null,null,null,null,null,null,null,null,null,null,null,null,null,null,null,null,null,null,null,null,null,null,null,null,null,null,null,null,null,null,null,null,null,null,null,null,null,null,null,null,null,null,null,null,null,null,null,null,null,null,null,null,null,1,1,"",1,1,"",2,null,"","","","","",0,2,1,null,"","",0,"","",0,"",null,1,1,0,0,0,"","",""]
[null,null,null,null,null,null,null,null,null,null,null,null,null,null,null,null,null,null,null,null,null,null,null,null,null,null,null,null,null,null,null,null,null,null,null,null,null,null,null,null,null,null,null,null,null,null,null,null,null,null,null,null,null,null,null,null,null,null,null,null,null,null,null,null,null,null,null,null,null,null,null,null,null,null,null,null,null,null,null,null,2,"",2,"","",1,"",1,null,"",2,0,"","","",1,null,"",1,"",6,2,"",0,"",null,1,"","",3,1,3,""]
[null,null,null,{"$f":"'export html'!C2","v":"Matchen van speeldag 30"},null,30,null,null,null,null,null,null,null,null,null,null,null,null,null,null,null,null,null,null,null,null,null,null,null,null,null,null,null,null,null,null,null,null,null,null,null,null,null,null,null,null,null,null,null,null,null,null,null,null,null,null,null,null,null,null,null,null,null,null,null,null,null,null,null,null,null,null,null,null,null,null,null,null,null,null,"","",2,3,"","","",2,0,null,"",1,1,0,"",1,null,2,0,"","",1,3,2,"","",null,0,"","","",0,""]
[null,null,null,null,null,null,null,null,null,null,null,null,null,null,null,null,null,null,null,null,null,null,null,null,null,null,null,null,null,null,null,null,null,null,null,null,null,null,null,null,null,null,null,null,null,null,null,null,null,null,null,null,null,null,null,null,null,null,null,null,null,null,null,null,null,null,null,null,null,null,null,null,null,null,null,null,null,null,null,null,"",0,2,4,2,"","",0,"",2,null,"",2,0,"","",null,2,"","","","",3,3,"",1,"",null,1,"","",0,1]
[null,null,null,{"$f":"IF('export html'!A3=\"\",\"\",'export html'!A3)","v":"2015-03-14"},{"$f":"IF('export html'!B3=\"\",\"\",'export html'!B3)","v":30},{"$f":"IF('export html'!C3=\"\",\"\",'export html'!C3)","v":"Anderlecht - Gent"},null,null,null,null,null,null,null,{"$f":"IF('export html'!D3=\"\",\"\",'export html'!D3)","v":"1-2"},null,null,null,null,null,null,null,null,null,null,null,null,null,null,null,null,null,null,null,null,null,null,null,null,null,null,null,null,null,null,null,null,null,null,null,null,null,null,null,null,null,null,null,null,null,null,null,null,null,null,null,null,null,null,null,null,null,null,null,null,null,null,null,null,null,null,2,"","",2,1,3,"",0,"","",0,null,"","",0,3,null,"",0,3,"","","",7,"",1,1,"",null,2,3,"",""]
[null,null,null,{"$f":"IF('export html'!A4=\"\",\"\",'export html'!A4)","v":"2015-03-14"},{"$f":"IF('export html'!B4=\"\",\"\",'export html'!B4)","v":30},{"$f":"IF('export html'!C4=\"\",\"\",'export html'!C4)","v":"Cercle Brugge - KV Mechelen"},null,null,null,null,null,null,null,{"$f":"IF('export html'!D4=\"\",\"\",'export html'!D4)","v":"2-3"},null,null,null,null,null,null,null,null,null,null,null,null,null,null,null,null,null,null,null,null,null,null,null,null,null,null,null,null,null,null,null,null,null,null,null,null,null,null,null,null,null,null,null,null,null,null,null,null,null,null,null,null,null,null,null,null,null,null,null,null,null,null,null,null,null,null,"","",0,"","",1,"",0,2,"","",5,null,"",2,2,null,0,0,"",3,0,"",2,"","",0,0,"",null,2,"",""]
[null,null,null,{"$f":"IF('export html'!A5=\"\",\"\",'export html'!A5)","v":"2015-03-14"},{"$f":"IF('export html'!B5=\"\",\"\",'export html'!B5)","v":30},{"$f":"IF('export html'!C5=\"\",\"\",'export html'!C5)","v":"Charleroi - Moeskroen-Peruwelz"},null,null,null,null,null,null,null,{"$f":"IF('export html'!D5=\"\",\"\",'export html'!D5)","v":"2-0"},null,null,null,null,null,null,null,null,null,null,null,null,null,null,null,null,null,null,null,null,null,null,null,null,null,null,null,null,null,null,null,null,null,null,null,null,null,null,null,null,null,null,null,null,null,null,null,null,null,null,null,null,null,null,null,null,null,null,null,null,null,null,null,null,null,null,"",0,"",2,1,"","","",0,"","",0,2,null,1,"",null,2,"",3,"","",1,0,2,"",0,1,"","",null,"",3]
[null,null,null,{"$f":"IF('export html'!A6=\"\",\"\",'export html'!A6)","v":"2015-03-14"},{"$f":"IF('export html'!B6=\"\",\"\",'export html'!B6)","v":30},{"$f":"IF('export html'!C6=\"\",\"\",'export html'!C6)","v":"Lierse - Kortrijk"},null,null,null,null,null,null,null,{"$f":"IF('export html'!D6=\"\",\"\",'export html'!D6)","v":"0-0"},null,null,null,null,null,null,null,null,null,null,null,null,null,null,null,null,null,null,null,null,null,null,null,null,null,null,null,null,null,null,null,null,null,null,null,null,null,null,null,null,null,null,null,null,null,null,null,null,null,null,null,null,null,null,null,null,null,null,null,null,null,null,null,null,null,null,2,"","","","",0,1,"",1,0,3,"","","",null,2,null,"",0,3,3,2,"","",1,"","","",0,1,2,null,""]
[null,null,null,{"$f":"IF('export html'!A7=\"\",\"\",'export html'!A7)","v":"2015-03-14"},{"$f":"IF('export html'!B7=\"\",\"\",'export html'!B7)","v":30},{"$f":"IF('export html'!C7=\"\",\"\",'export html'!C7)","v":"Standard - Genk"},null,null,null,null,null,null,null,{"$f":"IF('export html'!D7=\"\",\"\",'export html'!D7)","v":"1-0"},null,null,null,null,null,null,null,null,null,null,null,null,null,null,null,null,null,null,null,null,null,null,null,null,null,null,null,null,null,null,null,null,null,null,null,null,null,null,null,null,null,null,null,null,null,null,null,null,null,null,null,null,null,null,null,null,null,null,null,null,null,null,null,null,null,null,2,2,"",1,0,"",0,"","","",1,"","",4,"",null,null,"","",3,"","",1,"",3,3,0,"",4,1,"",3]
[null,null,null,{"$f":"IF('export html'!A8=\"\",\"\",'export html'!A8)","v":"2015-03-14"},{"$f":"IF('export html'!B8=\"\",\"\",'export html'!B8)","v":30},{"$f":"IF('export html'!C8=\"\",\"\",'export html'!C8)","v":"Waasland-Beveren - Lokeren"},null,null,null,null,null,null,null,{"$f":"IF('export html'!D8=\"\",\"\",'export html'!D8)","v":"0-0"}]
[null,null,null,{"$f":"IF('export html'!A9=\"\",\"\",'export html'!A9)","v":"2015-03-14"},{"$f":"IF('export html'!B9=\"\",\"\",'export html'!B9)","v":30},{"$f":"IF('export html'!C9=\"\",\"\",'export html'!C9)","v":"Westerlo - Club Brugge"},null,null,null,null,null,null,null,{"$f":"IF('export html'!D9=\"\",\"\",'export html'!D9)","v":"1-3"},null,null,null,null,null,null,null,null,null,null,null,null,null,null,null,null,null,null,null,null,null,null,null,null,null,null,null,null,null,null,null,null,null,null,null,null,null,null,null,null,null,null,null,null,null,null,null,null,null,null,null,null,null,null,null,null,null,null,null,null,null,null,null,null,null,null,null,{"$f":"IF(OR(ISERROR(FIND(\"-\",R5)),AH5>15),\"\",IF(AND(LEFT(R5)=\"*\",RIGHT(R5)=\"*\"),\"ff\",IF(CD5>CD22,\"t\",IF(CD5<CD22,\"u\",\"g\"))))","v":"t"},{"$f":"IF(OR(ISERROR(FIND(\"-\",S5)),AI5>15),\"\",IF(AND(LEFT(S5)=\"*\",RIGHT(S5)=\"*\"),\"ff\",IF(CE5>CE22,\"t\",IF(CE5<CE22,\"u\",\"g\"))))","v":"t"},{"$f":"IF(OR(ISERROR(FIND(\"-\",T5)),AJ5>15),\"\",IF(AND(LEFT(T5)=\"*\",RIGHT(T5)=\"*\"),\"ff\",IF(CF5>CF22,\"t\",IF(CF5<CF22,\"u\",\"g\"))))","v":""},{"$f":"IF(OR(ISERROR(FIND(\"-\",U5)),AK5>15),\"\",IF(AND(LEFT(U5)=\"*\",RIGHT(U5)=\"*\"),\"ff\",IF(CG5>CG22,\"t\",IF(CG5<CG22,\"u\",\"g\"))))","v":"g"},{"$f":"IF(OR(ISERROR(FIND(\"-\",V5)),AL5>15),\"\",IF(AND(LEFT(V5)=\"*\",RIGHT(V5)=\"*\"),\"ff\",IF(CH5>CH22,\"t\",IF(CH5<CH22,\"u\",\"g\"))))","v":""},{"$f":"IF(OR(ISERROR(FIND(\"-\",W5)),AM5>15),\"\",IF(AND(LEFT(W5)=\"*\",RIGHT(W5)=\"*\"),\"ff\",IF(CI5>CI22,\"t\",IF(CI5<CI22,\"u\",\"g\"))))","v":""},{"$f":"IF(OR(ISERROR(FIND(\"-\",X5)),AN5>15),\"\",IF(AND(LEFT(X5)=\"*\",RIGHT(X5)=\"*\"),\"ff\",IF(CJ5>CJ22,\"t\",IF(CJ5<CJ22,\"u\",\"g\"))))","v":""},{"$f":"IF(OR(ISERROR(FIND(\"-\",Y5)),AO5>15),\"\",IF(AND(LEFT(Y5)=\"*\",RIGHT(Y5)=\"*\"),\"ff\",IF(CK5>CK22,\"t\",IF(CK5<CK22,\"u\",\"g\"))))","v":""},{"$f":"IF(OR(ISERROR(FIND(\"-\",Z5)),AP5>15),\"\",IF(AND(LEFT(Z5)=\"*\",RIGHT(Z5)=\"*\"),\"ff\",IF(CL5>CL22,\"t\",IF(CL5<CL22,\"u\",\"g\"))))","v":"g"},{"$f":"IF(OR(ISERROR(FIND(\"-\",AA5)),AQ5>15),\"\",IF(AND(LEFT(AA5)=\"*\",RIGHT(AA5)=\"*\"),\"ff\",IF(CM5>CM22,\"t\",IF(CM5<CM22,\"u\",\"g\"))))","v":"t"},{"$f":"IF(OR(ISERROR(FIND(\"-\",AB5)),AR5>15),\"\",IF(AND(LEFT(AB5)=\"*\",RIGHT(AB5)=\"*\"),\"ff\",IF(CN5>CN22,\"t\",IF(CN5<CN22,\"u\",\"g\"))))","v":""},{"$f":"IF(OR(ISERROR(FIND(\"-\",AC5)),AS5>15),\"\",IF(AND(LEFT(AC5)=\"*\",RIGHT(AC5)=\"*\"),\"ff\",IF(CO5>CO22,\"t\",IF(CO5<CO22,\"u\",\"g\"))))","v":"u"},{"$f":"IF(OR(ISERROR(FIND(\"-\",AD5)),AT5>15),\"\",IF(AND(LEFT(AD5)=\"*\",RIGHT(AD5)=\"*\"),\"ff\",IF(CP5>CP22,\"t\",IF(CP5<CP22,\"u\",\"g\"))))","v":"t"},{"$f":"IF(OR(ISERROR(FIND(\"-\",AE5)),AU5>15),\"\",IF(AND(LEFT(AE5)=\"*\",RIGHT(AE5)=\"*\"),\"ff\",IF(CQ5>CQ22,\"t\",IF(CQ5<CQ22,\"u\",\"g\"))))","v":""},{"$f":"IF(OR(ISERROR(FIND(\"-\",AF5)),AV5>15),\"\",IF(AND(LEFT(AF5)=\"*\",RIGHT(AF5)=\"*\"),\"ff\",IF(CR5>CR22,\"t\",IF(CR5<CR22,\"u\",\"g\"))))","v":""},null,null,{"$f":"IF(OR(ISERROR(FIND(\"-\",R5)),AH5<=15),\"\",IF(AND(LEFT(R5)=\"*\",RIGHT(R5)=\"*\"),\"ff\",IF(CU5>CU22,\"t\",IF(CU5<CU22,\"u\",\"g\"))))","v":""},{"$f":"IF(OR(ISERROR(FIND(\"-\",S5)),AI5<=15),\"\",IF(AND(LEFT(S5)=\"*\",RIGHT(S5)=\"*\"),\"ff\",IF(CV5>CV22,\"t\",IF(CV5<CV22,\"u\",\"g\"))))","v":""},{"$f":"IF(OR(ISERROR(FIND(\"-\",T5)),AJ5<=15),\"\",IF(AND(LEFT(T5)=\"*\",RIGHT(T5)=\"*\"),\"ff\",IF(CW5>CW22,\"t\",IF(CW5<CW22,\"u\",\"g\"))))","v":"g"},{"$f":"IF(OR(ISERROR(FIND(\"-\",U5)),AK5<=15),\"\",IF(AND(LEFT(U5)=\"*\",RIGHT(U5)=\"*\"),\"ff\",IF(CX5>CX22,\"t\",IF(CX5<CX22,\"u\",\"g\"))))","v":""},{"$f":"IF(OR(ISERROR(FIND(\"-\",V5)),AL5<=15),\"\",IF(AND(LEFT(V5)=\"*\",RIGHT(V5)=\"*\"),\"ff\",IF(CY5>CY22,\"t\",IF(CY5<CY22,\"u\",\"g\"))))","v":"u"},{"$f":"IF(OR(ISERROR(FIND(\"-\",W5)),AM5<=15),\"\",IF(AND(LEFT(W5)=\"*\",RIGHT(W5)=\"*\"),\"ff\",IF(CZ5>CZ22,\"t\",IF(CZ5<CZ22,\"u\",\"g\"))))","v":"t"},{"$f":"IF(OR(ISERROR(FIND(\"-\",X5)),AN5<=15),\"\",IF(AND(LEFT(X5)=\"*\",RIGHT(X5)=\"*\"),\"ff\",IF(DA5>DA22,\"t\",IF(DA5<DA22,\"u\",\"g\"))))","v":"g"},{"$f":"IF(OR(ISERROR(FIND(\"-\",Y5)),AO5<=15),\"\",IF(AND(LEFT(Y5)=\"*\",RIGHT(Y5)=\"*\"),\"ff\",IF(DB5>DB22,\"t\",IF(DB5<DB22,\"u\",\"g\"))))","v":"t"},{"$f":"IF(OR(ISERROR(FIND(\"-\",Z5)),AP5<=15),\"\",IF(AND(LEFT(Z5)=\"*\",RIGHT(Z5)=\"*\"),\"ff\",IF(DC5>DC22,\"t\",IF(DC5<DC22,\"u\",\"g\"))))","v":""},{"$f":"IF(OR(ISERROR(FIND(\"-\",AA5)),AQ5<=15),\"\",IF(AND(LEFT(AA5)=\"*\",RIGHT(AA5)=\"*\"),\"ff\",IF(DD5>DD22,\"t\",IF(DD5<DD22,\"u\",\"g\"))))","v":""},{"$f":"IF(OR(ISERROR(FIND(\"-\",AB5)),AR5<=15),\"\",IF(AND(LEFT(AB5)=\"*\",RIGHT(AB5)=\"*\"),\"ff\",IF(DE5>DE22,\"t\",IF(DE5<DE22,\"u\",\"g\"))))","v":"t"},{"$f":"IF(OR(ISERROR(FIND(\"-\",AC5)),AS5<=15),\"\",IF(AND(LEFT(AC5)=\"*\",RIGHT(AC5)=\"*\"),\"ff\",IF(DF5>DF22,\"t\",IF(DF5<DF22,\"u\",\"g\"))))","v":""},{"$f":"IF(OR(ISERROR(FIND(\"-\",AD5)),AT5<=15),\"\",IF(AND(LEFT(AD5)=\"*\",RIGHT(AD5)=\"*\"),\"ff\",IF(DG5>DG22,\"t\",IF(DG5<DG22,\"u\",\"g\"))))","v":""},{"$f":"IF(OR(ISERROR(FIND(\"-\",AE5)),AU5<=15),\"\",IF(AND(LEFT(AE5)=\"*\",RIGHT(AE5)=\"*\"),\"ff\",IF(DH5>DH22,\"t\",IF(DH5<DH22,\"u\",\"g\"))))","v":"t"},{"$f":"IF(OR(ISERROR(FIND(\"-\",AF5)),AV5<=15),\"\",IF(AND(LEFT(AF5)=\"*\",RIGHT(AF5)=\"*\"),\"ff\",IF(DI5>DI22,\"t\",IF(DI5<DI22,\"u\",\"g\"))))","v":"g"}]
[null,null,null,{"$f":"IF('export html'!A10=\"\",\"\",'export html'!A10)","v":"2015-03-14"},{"$f":"IF('export html'!B10=\"\",\"\",'export html'!B10)","v":30},{"$f":"IF('export html'!C10=\"\",\"\",'export html'!C10)","v":"Zulte-Waregem - Oostende"},null,null,null,null,null,null,null,{"$f":"IF('export html'!D10=\"\",\"\",'export html'!D10)","v":"1-4"},null,null,null,null,null,null,null,null,null,null,null,null,null,null,null,null,null,null,null,null,null,null,null,null,null,null,null,null,null,null,null,null,null,null,null,null,null,null,null,null,null,null,null,null,null,null,null,null,null,null,null,null,null,null,null,null,null,null,null,null,null,null,null,null,null,null,{"$f":"IF(OR(ISERROR(FIND(\"-\",Q6)),AG6>15),\"\",IF(AND(LEFT(Q6)=\"*\",RIGHT(Q6)=\"*\"),\"ff\",IF(CC6>CC23,\"t\",IF(CC6<CC23,\"u\",\"g\"))))","v":""},null,"t","","","g","u","","u","t","","u","u","","u","",null,{"$f":"IF(OR(ISERROR(FIND(\"-\",Q6)),AG6<=15),\"\",IF(AND(LEFT(Q6)=\"*\",RIGHT(Q6)=\"*\"),\"ff\",IF(CT6>CT23,\"t\",IF(CT6<CT23,\"u\",\"g\"))))","v":"u"},null,"","u","u","","","u","","","t","","","t","","g"]
[null,null,null,{"$f":"IF('export html'!A11=\"\",\"\",'export html'!A11)","v":""},{"$f":"IF('export html'!B11=\"\",\"\",'export html'!B11)","v":""},{"$f":"IF('export html'!C11=\"\",\"\",'export html'!C11)","v":""},null,null,null,null,null,null,null,{"$f":"IF('export html'!D11=\"\",\"\",'export html'!D11)","v":""},null,null,null,null,null,null,null,null,null,null,null,null,null,null,null,null,null,null,null,null,null,null,null,null,null,null,null,null,null,null,null,null,null,null,null,null,null,null,null,null,null,null,null,null,null,null,null,null,null,null,null,null,null,null,null,null,null,null,null,null,null,null,null,null,null,null,"","",null,"g","","","u","t","","","","t","","g","u","t",null,"t","u",null,"","t","g","","","t","t","t","","u","","",""]
[null,null,null,null,null,null,null,null,null,null,null,null,null,null,null,null,null,null,null,null,null,null,null,null,null,null,null,null,null,null,null,null,null,null,null,null,null,null,null,null,null,null,null,null,null,null,null,null,null,null,null,null,null,null,null,null,null,null,null,null,null,null,null,null,null,null,null,null,null,null,null,null,null,null,null,null,null,null,null,null,"g","g","",null,"","g","t","","t","","","","t","","t","",null,"","","t",null,"t","","","g","","g","t","t","","t","","t"]
[null,null,null,null,null,null,null,null,null,null,null,null,null,null,null,null,null,null,null,null,null,null,null,null,null,null,null,null,null,null,null,null,null,null,null,null,null,null,null,null,null,null,null,null,null,null,null,null,null,null,null,null,null,null,null,null,null,null,null,null,null,null,null,null,null,null,null,null,null,null,null,null,null,null,null,null,null,null,null,null,"","g","g","g",null,"t","","","t","g","","","u","","t","",null,"u","","","",null,"","t","t","","","t","g","","t","","t"]
[null,null,null,null,null,null,null,null,null,null,null,null,null,null,null,null,null,null,null,null,null,null,null,null,null,null,null,null,null,null,null,null,null,null,null,null,null,null,null,null,null,null,null,null,null,null,null,null,null,null,null,null,null,null,null,null,null,null,null,null,null,null,null,null,null,null,null,null,null,null,null,null,null,null,null,null,null,null,null,null,"u","","g","","",null,"u","t","","g","t","","","t","","t",null,"","t","","t","g",null,"","","t","","","t","u","","t",""]
[null,null,null,null,null,null,null,null,null,null,null,null,null,null,null,null,null,null,null,null,null,null,null,null,null,null,null,null,null,null,null,null,null,null,null,null,null,null,null,null,null,null,null,null,null,null,null,null,null,null,null,null,null,null,null,null,null,null,null,null,null,null,null,null,null,null,null,null,null,null,null,null,null,null,null,null,null,null,null,null,"u","","","","g","",null,"","t","u","t","u","u","t","","",null,"","t","g","t","","u",null,"t","","","","","","","t","t"]
[null,null,null,null,null,null,null,null,null,null,null,null,null,null,null,null,null,null,null,null,null,null,null,null,null,null,null,null,null,null,null,null,null,null,null,null,null,null,null,null,null,null,null,null,null,null,null,null,null,null,null,null,null,null,null,null,null,null,null,null,null,null,null,null,null,null,null,null,null,null,null,null,null,null,null,null,null,null,null,null,"g","g","","t","t","","u",null,"","","","","","t","t","g",null,"","","g","","","g","",null,"t","u","t","g","t","","",""]
[null,null,null,null,null,null,null,null,null,null,null,null,null,null,null,null,null,null,null,null,null,null,null,null,null,null,null,null,null,null,null,null,null,null,null,null,null,null,null,null,null,null,null,null,null,null,null,null,null,null,null,null,null,null,null,null,null,null,null,null,null,null,null,null,null,null,null,null,null,null,null,null,null,null,null,null,null,null,null,null,"g","","u","","","u","","u",null,"","g","t","","","","t",null,"","t","","u","u","","g","",null,"g","","","u","g","g",""]
[null,null,null,null,null,null,null,null,null,null,null,null,null,null,null,null,null,null,null,null,null,null,null,null,null,null,null,null,null,null,null,null,null,null,null,null,null,null,null,null,null,null,null,null,null,null,null,null,null,null,null,null,null,null,null,null,null,null,null,null,null,null,null,null,null,null,null,null,null,null,null,null,null,null,null,null,null,null,null,null,"","","t","u","","","","t","t",null,"","t","g","t","","t",null,"u","g","","","g","g","u","","",null,"t","","","","g",""]
[null,null,null,null,null,null,null,null,null,null,null,null,null,null,null,null,null,null,null,null,null,null,null,null,null,null,null,null,null,null,null,null,null,null,null,null,null,null,null,null,null,null,null,null,null,null,null,null,null,null,null,null,null,null,null,null,null,null,null,null,null,null,null,null,null,null,null,null,null,null,null,null,null,null,null,null,null,null,null,null,"","t","u","u","u","","","g","","g",null,"","t","t","","",null,"t","","","","","u","u","","t","",null,"u","","","t","u"]
[null,null,null,null,null,null,null,null,null,null,null,null,null,null,null,null,null,null,null,null,null,null,null,null,null,null,null,null,null,null,null,null,null,null,null,null,null,null,null,null,null,null,null,null,null,null,null,null,null,null,null,null,null,null,null,null,null,null,null,null,null,null,null,null,null,null,null,null,null,null,null,null,null,null,null,null,null,null,null,null,"u","","","g","g","u","","t","","","g",null,"","","t","u",null,"","t","u","","","","u","","t","u","",null,"t","t","",""]
[null,null,null,null,null,null,null,null,null,null,null,null,null,null,null,null,null,null,null,null,null,null,null,null,null,null,null,null,null,null,null,null,null,null,null,null,null,null,null,null,null,null,null,null,null,null,null,null,null,null,null,null,null,null,null,null,null,null,null,null,null,null,null,null,null,null,null,null,null,null,null,null,null,null,null,null,null,null,null,null,"","","t","","","u","","t","g","","","u",null,"","g","u",null,"t","t","","u","t","","u","","","t","t","",null,"t","",""]
[null,null,null,null,null,null,null,null,null,null,null,null,null,null,null,null,null,null,null,null,null,null,null,null,null,null,null,null,null,null,null,null,null,null,null,null,null,null,null,null,null,null,null,null,null,null,null,null,null,null,null,null,null,null,null,null,null,null,null,null,null,null,null,null,null,null,null,null,null,null,null,null,null,null,null,null,null,null,null,null,"","t","","u","u","","","","t","","","t","u",null,"g","",null,"u","","u","","","u","t","g","","g","t","","",null,"","u"]
[null,null,null,null,null,null,null,null,null,null,null,null,null,null,null,null,null,null,null,null,null,null,null,null,null,null,null,null,null,null,null,null,null,null,null,null,null,null,null,null,null,null,null,null,null,null,null,null,null,null,null,null,null,null,null,null,null,null,null,null,null,null,null,null,null,null,null,null,null,null,null,null,null,null,null,null,null,null,null,null,"g","","","","","g","t","","t","t","u","","","",null,"g",null,"","t","u","u","u","","","g","","","","t","g","u",null,""]
[null,null,null,null,null,null,null,null,null,null,null,null,null,null,null,null,null,null,null,null,null,null,null,null,null,null,null,null,null,null,null,null,null,null,null,null,null,null,null,null,null,null,null,null,null,null,null,null,null,null,null,null,null,null,null,null,null,null,null,null,null,null,null,null,null,null,null,null,null,null,null,null,null,null,null,null,null,null,null,null,"u","u","","g","t","","t","","","","g","","","u","",null,null,"","","u","","","t","","u","u","t","","u","g","","u"]

{"sheet":"export html","index":1,"n_rows":32,"n_cols":62,"rows_kept":32,"cut":false,"hidden":true,"merged":[]}
[{"$f":"MAX(1,COUNTA(A3:A20))","v":8},null,null,null,"hulp: thuis","hulp: uit","hulp: uitslag",null,{"$f":"MAX(1,COUNT(I3:I20))","v":1},null,null,null,"hulp: thuis","hulp: uit","hulp: uitslag",null,null,null,null,{"$f":"MAX(1,COUNT(T3:T20))","v":5},null,"Recentste duels op ","uitslag",null,null,null,null,null,null,null,null,{"$f":"MAX(1,MIN(5,COUNTIF(spelersstatistieken!$B$2:$B$19,\">0\")))","v":5},null,"Hulp: # goals",null,{"$f":"MAX(1,COUNTA(AJ3:AJ20))","v":2},null,null,null,null,null,null,null,{"$f":"COUNTIF('rooster en stand'!AW5:BL5,\"=?\")+COUNTBLANK('rooster en stand'!AW5:BL5)+COUNTIF('rooster en stand'!AW5:AW20,\"=?\")+COUNTBLANK('rooster en stand'!AW5:AW20)-2","v":0},"# ongekende datums",null,{"$f":"MAX(1,COUNTA(AU3:AU20))","v":1},null,null,null,null,null,null,null,null,null,{"$f":"MAX(1,COUNT(BE3:BE32))","v":30},null,null,null,"hulp: thuis","hulp: uit"]
["Datum","Speeldag",{"$f":"\"Matchen van \" & IF('rooster en stand'!$J$31=0,\"speeldag \"&'rooster en stand'!$F$31,TEXT('rooster en stand'!$J$31,\"dd/mm/jjjj\"))","v":"Matchen van speeldag 30"},"Uitslag",null,null,null,null,"Datum","Speeldag",{"$f":"\"Matchen van \" & IF('rooster en stand'!$J$31=0,\"speeldag \" & 'rooster en stand'!$F$31+1,TEXT('rooster en stand'!$J$31+'rooster en stand'!$K$31,\"dd/mm/jjjj\"))","v":"Matchen van speeldag 31"},"Uitslag / Plaatsen",null,null,null,null,null,null,null,"Datum","Speeldag",{"$f":"V1 & TEXT('rooster en stand'!$F$23,\"dd/mm/jjjj\")","v":"Recentste duels op 15/03/2015"},null,null,null,null,null,null,null,null,null,"Top-5","Goals",null,null,"Ronde","Datum","Uur","Match","Uitslag",null,null,null,1,"berekening stand",null,"Jaar",{"$f":"\"Uit het verleden... (\" & AU1 & \"x)\"","v":"Uit het verleden... (1x)"},"Uitslag","Datum","Speeldag",null,null,null,null,null,"Datum","Speeldag","Kalender","Uitslag"]
["2015-03-14",30,"Anderlecht - Gent",{"$f":"IF(G3=0,\"\",G3)","v":"1-2"},"Anderlecht","Gent","1-2",null,null,null,null,{"$f":"IF(O3=0,\"nr. \" & MATCH($M3,'rooster en stand'!$D$5:$D$20,0) & \" - nr. \" & MATCH($N3,'rooster en stand'!$D$5:$D$20,0),O3)","v":{"$error":"#N/A"}},null,null,null,null,null,null,null,"2015-03-14",30,"Lierse - Kortrijk","0-0",null,null,null,null,null,null,null,{"$f":"IF($AF$1>=1,1,0)","v":1},{"$f":"IF(OR($AE3=0,$AG3=\"\"),\"(Niemand)\",INDEX(tbl_Spelers[Naam],MATCH(SMALL(tbl_Spelers[Rang],AE3),tbl_Spelers[Rang],0)))","v":"Keita Alhassane"},{"$f":"IF($AE3=0,\"\",IF(AH3=0,\"\",AH3))","v":5},{"$f":"INDEX(tbl_Spelers[Goals],MATCH(SMALL(tbl_Spelers[Rang],AE3),tbl_Spelers[Rang],0))","v":5},null,1,"2014-09-24",null,"Lierse - STVV","4-0",null,null,null,"00:00:00","VO kleurtje speeldag",null,null,"Geen wedstrijden voor LIERSE",null,null,null,null,null,null,null,null,"2014-07-26",1,"Lierse - Oostende","2-0","Lierse","Oostende"]
["2015-03-14",30,"Cercle Brugge - KV Mechelen",{"$f":"IF(G4=0,\"\",G4)","v":"2-3"},"Cercle Brugge","KV Mechelen","2-3",null,null,null,null,{"$f":"IF(O4=0,\"nr. \" & MATCH($M4,'rooster en stand'!$D$5:$D$20,0) & \" - nr. \" & MATCH($N4,'rooster en stand'!$D$5:$D$20,0),O4)","v":{"$error":"#N/A"}},null,null,null,null,null,null,null,"2015-03-07",29,"Gent - Lierse","2-1",null,null,null,null,null,null,null,{"$f":"IF($AF$1>=2,2,0)","v":2},{"$f":"IF(OR($AE4=0,$AG4=\"\"),\"\",INDEX(tbl_Spelers[Naam],MATCH(SMALL(tbl_Spelers[Rang],AE4),tbl_Spelers[Rang],0)))","v":"Kasmi Faisel"},{"$f":"IF($AE4=0,\"\",IF(AH4=0,\"\",AH4))","v":4},{"$f":"INDEX(tbl_Spelers[Goals],MATCH(SMALL(tbl_Spelers[Rang],AE4),tbl_Spelers[Rang],0))","v":4},null,2,"2014-12-03",null,"Zulte-Waregem - Lierse","2-1 nv",null,null,null,{"$f":"COUNTA('rooster en stand'!BO5:BO20)","v":16},"aantal ploegen",null,null,null,null,null,null,null,null,null,null,null,"2014-08-03",2,"Club Brugge - Lierse","1-0","Club Brugge","Lierse"]
["2015-03-14",30,"Charleroi - Moeskroen-Peruwelz","2-0","Charleroi","Moeskroen-Peruwelz","2-0",null,null,null,null,{"$f":"IF(O5=0,\"nr. \" & MATCH($M5,'rooster en stand'!$D$5:$D$20,0) & \" - nr. \" & MATCH($N5,'rooster en stand'!$D$5:$D$20,0),O5)","v":{"$error":"#N/A"}},null,null,null,null,null,null,null,"2015-02-28",28,"Lierse - Genk","0-2",null,null,null,null,null,null,null,{"$f":"IF($AF$1>=3,3,0)","v":3},{"$f":"IF(OR($AE5=0,$AG5=\"\"),\"\",INDEX(tbl_Spelers[Naam],MATCH(SMALL(tbl_Spelers[Rang],AE5),tbl_Spelers[Rang],0)))","v":"Bourabia Rachid"},{"$f":"IF($AE5=0,\"\",IF(AH5=0,\"\",AH5))","v":2},{"$f":"INDEX(tbl_Spelers[Goals],MATCH(SMALL(tbl_Spelers[Rang],AE5),tbl_Spelers[Rang],0))","v":2},null,null,null,null,null,null,null,null,null,{"$f":"2*(AR4-1)","v":30},"aantal matchen / ploeg",null,null,null,null,null,null,null,null,null,null,null,"2014-08-09",3,"Lierse - Moeskroen-Peruwelz","2-2","Lierse","Moeskroen-Peruwelz"]
["2015-03-14",30,"Lierse - Kortrijk","0-0","Lierse","Kortrijk","0-0",null,null,null,null,{"$f":"IF(O6=0,\"nr. \" & MATCH($M6,'rooster en stand'!$D$5:$D$20,0) & \" - nr. \" & MATCH($N6,'rooster en stand'!$D$5:$D$20,0),O6)","v":{"$error":"#N/A"}},null,null,null,null,null,null,null,"2015-02-21",27,"KV Mechelen - Lierse","2-1",null,null,null,null,null,null,null,{"$f":"IF($AF$1>=4,4,0)","v":4},{"$f":"IF(OR($AE6=0,$AG6=\"\"),\"\",INDEX(tbl_Spelers[Naam],MATCH(SMALL(tbl_Spelers[Rang],AE6),tbl_Spelers[Rang],0)))","v":"Kouemaha Dorge"},{"$f":"IF($AE6=0,\"\",IF(AH6=0,\"\",AH6))","v":2},{"$f":"INDEX(tbl_Spelers[Goals],MATCH(SMALL(tbl_Spelers[Rang],AE6),tbl_Spelers[Rang],0))","v":2},null,null,null,null,null,null,null,null,null,{"$f":"COUNTA(tbl_Spelers[Naam])","v":18},"aantal spelers",null,null,null,null,null,null,null,null,null,null,null,"2014-08-16",4,"Lokeren - Lierse","2-0","Lokeren","Lierse"]
["2015-03-14",30,"Standard - Genk","1-0","Standard","Genk","1-0",null,null,null,null,{"$f":"IF(O7=0,\"nr. \" & MATCH($M7,'rooster en stand'!$D$5:$D$20,0) & \" - nr. \" & MATCH($N7,'rooster en stand'!$D$5:$D$20,0),O7)","v":{"$error":"#N/A"}},null,null,null,null,null,null,null,"2015-02-14",26,"Lierse - Cercle Brugge","2-1",null,null,null,null,null,null,null,{"$f":"IF($AF$1>=5,5,0)","v":5},{"$f":"IF(OR($AE7=0,$AG7=\"\"),\"\",INDEX(tbl_Spelers[Naam],MATCH(SMALL(tbl_Spelers[Rang],AE7),tbl_Spelers[Rang],0)))","v":"Ngawa Pierre-Yves"},{"$f":"IF($AE7=0,\"\",IF(AH7=0,\"\",AH7))","v":2},{"$f":"INDEX(tbl_Spelers[Goals],MATCH(SMALL(tbl_Spelers[Rang],AE7),tbl_Spelers[Rang],0))","v":2},null,null,null,null,null,null,null,null,null,null,null,null,null,null,null,null,null,null,null,null,null,null,"2014-08-23",5,"Lierse - Charleroi","0-2","Lierse","Charleroi"]
["2015-03-14",30,"Waasland-Beveren - Lokeren","0-0","Waasland-Beveren","Lokeren","0-0",null,null,null,null,{"$f":"IF(O8=0,\"nr. \" & MATCH($M8,'rooster en stand'!$D$5:$D$20,0) & \" - nr. \" & MATCH($N8,'rooster en stand'!$D$5:$D$20,0),O8)","v":{"$error":"#N/A"}},null,null,null,null,null,null,null,null,null,null,null,null,null,null,null,null,null,null,null,null,null,null,null,null,null,null,null,null,null,null,null,null,null,null,null,null,null,null,null,null,null,null,null,null,"2014-08-30",6,"Waasland-Beveren - Lierse","2-0","Waasland-Beveren","Lierse"]
["2015-03-14",30,"Westerlo - Club Brugge","1-3","Westerlo","Club Brugge","1-3",null,null,null,null,{"$f":"IF(O9=0,\"nr. \" & MATCH($M9,'rooster en stand'!$D$5:$D$20,0) & \" - nr. \" & MATCH($N9,'rooster en stand'!$D$5:$D$20,0),O9)","v":{"$error":"#N/A"}},null,null,null,null,null,null,null,null,null,null,null,null,null,null,null,null,null,null,null,null,null,null,null,null,null,null,null,null,null,null,null,null,null,null,null,null,null,null,null,null,null,null,null,null,"2014-09-13",7,"Lierse - Anderlecht","2-2","Lierse","Anderlecht"]
["2015-03-14",30,"Zulte-Waregem - Oostende","1-4","Zulte-Waregem","Oostende","1-4",null,null,null,null,{"$f":"IF(O10=0,\"nr. \" & MATCH($M10,'rooster en stand'!$D$5:$D$20,0) & \" - nr. \" & MATCH($N10,'rooster en stand'!$D$5:$D$20,0),O10)","v":{"$error":"#N/A"}},null,null,null,null,null,null,null,null,null,null,null,null,null,null,null,null,null,null,null,null,null,null,null,null,null,null,null,null,null,null,null,null,null,null,null,null,null,null,null,null,null,null,null,null,"2014-09-20",8,"Westerlo - Lierse","6-1","Westerlo","Lierse"]
[null,null,null,null,null,null,null,null,null,null,null,null,null,null,null,null,null,null,null,null,null,null,null,null,null,null,null,null,null,null,null,null,null,null,null,null,null,null,null,null,null,null,null,null,null,null,null,null,null,null,null,null,null,null,null,null,"2014-09-28",9,"Standard - Lierse","2-2","Standard","Lierse"]
[null,null,null,null,null,null,null,null,null,null,null,null,null,null,null,null,null,null,null,null,null,null,null,null,null,null,null,null,null,null,null,null,null,null,null,null,null,null,null,null,null,null,null,null,null,null,null,null,null,null,null,null,null,null,null,null,"2014-10-04",10,"Lierse - Zulte-Waregem","3-1","Lierse","Zulte-Waregem"]
[null,null,null,null,null,null,null,null,null,null,null,null,null,null,null,null,null,null,null,null,null,null,null,null,null,null,null,null,null,null,null,null,null,null,null,null,null,null,null,null,null,null,null,null,null,null,null,null,null,null,null,null,null,null,null,null,"2014-10-18",11,"Cercle Brugge - Lierse","1-2","Cercle Brugge","Lierse"]
[null,null,null,null,null,null,null,null,null,null,null,null,null,null,null,null,null,null,null,null,null,null,null,null,null,null,null,null,null,null,null,null,null,null,null,null,null,null,null,null,null,null,null,null,null,null,null,null,null,null,null,null,null,null,null,null,"2014-10-24",12,"Lierse - KV Mechelen","0-1","Lierse","KV Mechelen"]
[null,null,null,null,null,null,null,null,null,null,null,null,null,null,null,null,null,null,null,null,null,null,null,null,null,null,null,null,null,null,null,null,null,null,null,null,null,null,null,null,null,null,null,null,null,null,null,null,null,null,null,null,null,null,null,null,"2014-10-28",13,"Genk - Lierse","3-0","Genk","Lierse"]
[null,null,null,null,null,null,null,null,null,null,null,null,null,null,null,null,null,null,null,null,null,null,null,null,null,null,null,null,null,null,null,null,null,null,null,null,null,null,null,null,null,null,null,null,null,null,null,null,null,null,null,null,null,null,null,null,"2014-11-02",14,"Lierse - Gent","0-1","Lierse","Gent"]
[null,null,null,null,null,null,null,null,null,null,null,null,null,null,null,null,null,null,null,null,null,null,null,null,null,null,null,null,null,null,null,null,null,null,null,null,null,null,null,null,null,null,null,null,null,null,null,null,null,null,null,null,null,null,null,null,"2014-11-08",15,"Kortrijk - Lierse","1-0","Kortrijk","Lierse"]
[null,null,null,null,null,null,null,null,null,null,null,null,null,null,null,null,null,null,null,null,null,null,null,null,null,null,null,null,null,null,null,null,null,null,null,null,null,null,null,null,null,null,null,null,null,null,null,null,null,null,null,null,null,null,null,null,"2014-11-22",16,"Moeskroen-Peruwelz - Lierse","2-1","Moeskroen-Peruwelz","Lierse"]
[null,null,null,null,null,null,null,null,null,null,null,null,null,null,null,null,null,null,null,null,null,null,null,null,null,null,null,null,null,null,null,null,null,null,null,null,null,null,null,null,null,null,null,null,null,null,null,null,null,null,null,null,null,null,null,null,"2014-11-29",17,"Lierse - Lokeren","1-1","Lierse","Lokeren"]
[null,null,null,null,null,null,null,null,null,null,null,null,null,null,null,null,null,null,null,null,null,null,null,null,null,null,null,null,null,null,null,null,null,null,null,null,null,null,null,null,null,null,null,null,null,null,null,null,null,null,null,null,null,null,null,null,"2014-12-06",18,"Oostende - Lierse","2-1","Oostende","Lierse"]
[null,null,null,null,null,null,null,null,null,null,null,null,null,null,null,null,null,null,null,null,null,null,null,null,null,null,null,null,null,null,null,null,null,null,null,null,null,null,null,null,null,null,null,null,null,null,null,null,null,null,null,null,null,null,null,null,"2014-12-13",19,"Lierse - Westerlo","3-3","Lierse","Westerlo"]
[null,null,null,null,null,null,null,null,null,null,null,null,null,null,null,null,null,null,null,null,null,null,null,null,null,null,null,null,null,null,null,null,null,null,null,null,null,null,null,null,null,null,null,null,null,null,null,null,null,null,null,null,null,null,null,null,"2014-12-20",20,"Charleroi - Lierse","6-0","Charleroi","Lierse"]
[null,null,null,null,null,null,null,null,null,null,null,null,null,null,null,null,null,null,null,null,null,null,null,null,null,null,null,null,null,null,null,null,null,null,null,null,null,null,null,null,null,null,null,null,null,null,null,null,null,null,null,null,null,null,null,null,"2014-12-26",21,"Lierse - Club Brugge","0-6","Lierse","Club Brugge"]
[null,null,null,null,null,null,null,null,null,null,null,null,null,null,null,null,null,null,null,null,null,null,null,null,null,null,null,null,null,null,null,null,null,null,null,null,null,null,null,null,null,null,null,null,null,null,null,null,null,null,null,null,null,null,null,null,"2015-01-18",22,"Anderlecht - Lierse","3-0","Anderlecht","Lierse"]
[null,null,null,null,null,null,null,null,null,null,null,null,null,null,null,null,null,null,null,null,null,null,null,null,null,null,null,null,null,null,null,null,null,null,null,null,null,null,null,null,null,null,null,null,null,null,null,null,null,null,null,null,null,null,null,null,"2015-01-24",23,"Lierse - Waasland-Beveren","1-1","Lierse","Waasland-Beveren"]
[null,null,null,null,null,null,null,null,null,null,null,null,null,null,null,null,null,null,null,null,null,null,null,null,null,null,null,null,null,null,null,null,null,null,null,null,null,null,null,null,null,null,null,null,null,null,null,null,null,null,null,null,null,null,null,null,"2015-01-31",24,"Lierse - Standard","2-3","Lierse","Standard"]
[null,null,null,null,null,null,null,null,null,null,null,null,null,null,null,null,null,null,null,null,null,null,null,null,null,null,null,null,null,null,null,null,null,null,null,null,null,null,null,null,null,null,null,null,null,null,null,null,null,null,null,null,null,null,null,null,"2015-02-07",25,"Zulte-Waregem - Lierse","2-3","Zulte-Waregem","Lierse"]
[null,null,null,null,null,null,null,null,null,null,null,null,null,null,null,null,null,null,null,null,null,null,null,null,null,null,null,null,null,null,null,null,null,null,null,null,null,null,null,null,null,null,null,null,null,null,null,null,null,null,null,null,null,null,null,null,"2015-02-14",26,"Lierse - Cercle Brugge","2-1","Lierse","Cercle Brugge"]
[null,null,null,null,null,null,null,null,null,null,null,null,null,null,null,null,null,null,null,null,null,null,null,null,null,null,null,null,null,null,null,null,null,null,null,null,null,null,null,null,null,null,null,null,null,null,null,null,null,null,null,null,null,null,null,null,"2015-02-21",27,"KV Mechelen - Lierse","2-1","KV Mechelen","Lierse"]
[null,null,null,null,null,null,null,null,null,null,null,null,null,null,null,null,null,null,null,null,null,null,null,null,null,null,null,null,null,null,null,null,null,null,null,null,null,null,null,null,null,null,null,null,null,null,null,null,null,null,null,null,null,null,null,null,"2015-02-28",28,"Lierse - Genk","0-2","Lierse","Genk"]
[null,null,null,null,null,null,null,null,null,null,null,null,null,null,null,null,null,null,null,null,null,null,null,null,null,null,null,null,null,null,null,null,null,null,null,null,null,null,null,null,null,null,null,null,null,null,null,null,null,null,null,null,null,null,null,null,"2015-03-07",29,"Gent - Lierse","2-1","Gent","Lierse"]
[null,null,null,null,null,null,null,null,null,null,null,null,null,null,null,null,null,null,null,null,null,null,null,null,null,null,null,null,null,null,null,null,null,null,null,null,null,null,null,null,null,null,null,null,null,null,null,null,null,null,null,null,null,null,null,null,"2015-03-14",30,"Lierse - Kortrijk","0-0","Lierse","Kortrijk"]

{"sheet":"kalender","index":2,"n_rows":32,"n_cols":7,"rows_kept":32,"cut":false,"hidden":false,"merged":[]}
[]
[null,"Spd.","Datum","Thuisploeg",null,"Uitploeg"]
["Competitie",{"$f":"'export html'!BF3","v":1},{"$f":"'export html'!BE3","v":"2014-07-26"},{"$f":"'export html'!BI3","v":"Lierse"},"-",{"$f":"'export html'!BJ3","v":"Oostende"},{"$f":"IF(LEN('export html'!BH3),'export html'!BH3,\"\")","v":"2-0"}]
[null,{"$f":"'export html'!BF4","v":2},{"$f":"'export html'!BE4","v":"2014-08-03"},{"$f":"'export html'!BI4","v":"Club Brugge"},"-",{"$f":"'export html'!BJ4","v":"Lierse"},{"$f":"IF(LEN('export html'!BH4),'export html'!BH4,\"\")","v":"1-0"}]
[null,{"$f":"'export html'!BF5","v":3},{"$f":"'export html'!BE5","v":"2014-08-09"},{"$f":"'export html'!BI5","v":"Lierse"},"-",{"$f":"'export html'!BJ5","v":"Moeskroen-Peruwelz"},{"$f":"IF(LEN('export html'!BH5),'export html'!BH5,\"\")","v":"2-2"}]
[null,{"$f":"'export html'!BF6","v":4},{"$f":"'export html'!BE6","v":"2014-08-16"},{"$f":"'export html'!BI6","v":"Lokeren"},"-",{"$f":"'export html'!BJ6","v":"Lierse"},{"$f":"IF(LEN('export html'!BH6),'export html'!BH6,\"\")","v":"2-0"}]
[null,{"$f":"'export html'!BF7","v":5},{"$f":"'export html'!BE7","v":"2014-08-23"},{"$f":"'export html'!BI7","v":"Lierse"},"-",{"$f":"'export html'!BJ7","v":"Charleroi"},{"$f":"IF(LEN('export html'!BH7),'export html'!BH7,\"\")","v":"0-2"}]
[null,{"$f":"'export html'!BF8","v":6},{"$f":"'export html'!BE8","v":"2014-08-30"},{"$f":"'export html'!BI8","v":"Waasland-Beveren"},"-",{"$f":"'export html'!BJ8","v":"Lierse"},{"$f":"IF(LEN('export html'!BH8),'export html'!BH8,\"\")","v":"2-0"}]
[null,{"$f":"'export html'!BF9","v":7},{"$f":"'export html'!BE9","v":"2014-09-13"},{"$f":"'export html'!BI9","v":"Lierse"},"-",{"$f":"'export html'!BJ9","v":"Anderlecht"},{"$f":"IF(LEN('export html'!BH9),'export html'!BH9,\"\")","v":"2-2"}]
[null,{"$f":"'export html'!BF10","v":8},{"$f":"'export html'!BE10","v":"2014-09-20"},{"$f":"'export html'!BI10","v":"Westerlo"},"-",{"$f":"'export html'!BJ10","v":"Lierse"},{"$f":"IF(LEN('export html'!BH10),'export html'!BH10,\"\")","v":"6-1"}]
[null,{"$f":"'export html'!BF11","v":9},{"$f":"'export html'!BE11","v":"2014-09-28"},{"$f":"'export html'!BI11","v":"Standard"},"-",{"$f":"'export html'!BJ11","v":"Lierse"},{"$f":"IF(LEN('export html'!BH11),'export html'!BH11,\"\")","v":"2-2"}]
[null,{"$f":"'export html'!BF12","v":10},{"$f":"'export html'!BE12","v":"2014-10-04"},{"$f":"'export html'!BI12","v":"Lierse"},"-",{"$f":"'export html'!BJ12","v":"Zulte-Waregem"},{"$f":"IF(LEN('export html'!BH12),'export html'!BH12,\"\")","v":"3-1"}]
[null,{"$f":"'export html'!BF13","v":11},{"$f":"'export html'!BE13","v":"2014-10-18"},{"$f":"'export html'!BI13","v":"Cercle Brugge"},"-",{"$f":"'export html'!BJ13","v":"Lierse"},{"$f":"IF(LEN('export html'!BH13),'export html'!BH13,\"\")","v":"1-2"}]
[null,{"$f":"'export html'!BF14","v":12},{"$f":"'export html'!BE14","v":"2014-10-24"},{"$f":"'export html'!BI14","v":"Lierse"},"-",{"$f":"'export html'!BJ14","v":"KV Mechelen"},{"$f":"IF(LEN('export html'!BH14),'export html'!BH14,\"\")","v":"0-1"}]
[null,{"$f":"'export html'!BF15","v":13},{"$f":"'export html'!BE15","v":"2014-10-28"},{"$f":"'export html'!BI15","v":"Genk"},"-",{"$f":"'export html'!BJ15","v":"Lierse"},{"$f":"IF(LEN('export html'!BH15),'export html'!BH15,\"\")","v":"3-0"}]
[null,{"$f":"'export html'!BF16","v":14},{"$f":"'export html'!BE16","v":"2014-11-02"},{"$f":"'export html'!BI16","v":"Lierse"},"-",{"$f":"'export html'!BJ16","v":"Gent"},{"$f":"IF(LEN('export html'!BH16),'export html'!BH16,\"\")","v":"0-1"}]
[null,{"$f":"'export html'!BF17","v":15},{"$f":"'export html'!BE17","v":"2014-11-08"},{"$f":"'export html'!BI17","v":"Kortrijk"},"-",{"$f":"'export html'!BJ17","v":"Lierse"},{"$f":"IF(LEN('export html'!BH17),'export html'!BH17,\"\")","v":"1-0"}]
[null,{"$f":"'export html'!BF18","v":16},{"$f":"'export html'!BE18","v":"2014-11-22"},{"$f":"'export html'!BI18","v":"Moeskroen-Peruwelz"},"-",{"$f":"'export html'!BJ18","v":"Lierse"},{"$f":"IF(LEN('export html'!BH18),'export html'!BH18,\"\")","v":"2-1"}]
[null,{"$f":"'export html'!BF19","v":17},{"$f":"'export html'!BE19","v":"2014-11-29"},{"$f":"'export html'!BI19","v":"Lierse"},"-",{"$f":"'export html'!BJ19","v":"Lokeren"},{"$f":"IF(LEN('export html'!BH19),'export html'!BH19,\"\")","v":"1-1"}]
[null,{"$f":"'export html'!BF20","v":18},{"$f":"'export html'!BE20","v":"2014-12-06"},{"$f":"'export html'!BI20","v":"Oostende"},"-",{"$f":"'export html'!BJ20","v":"Lierse"},{"$f":"IF(LEN('export html'!BH20),'export html'!BH20,\"\")","v":"2-1"}]
[null,{"$f":"'export html'!BF21","v":19},{"$f":"'export html'!BE21","v":"2014-12-13"},{"$f":"'export html'!BI21","v":"Lierse"},"-",{"$f":"'export html'!BJ21","v":"Westerlo"},{"$f":"IF(LEN('export html'!BH21),'export html'!BH21,\"\")","v":"3-3"}]
[null,{"$f":"'export html'!BF22","v":20},{"$f":"'export html'!BE22","v":"2014-12-20"},{"$f":"'export html'!BI22","v":"Charleroi"},"-",{"$f":"'export html'!BJ22","v":"Lierse"},{"$f":"IF(LEN('export html'!BH22),'export html'!BH22,\"\")","v":"6-0"}]
[null,{"$f":"'export html'!BF23","v":21},{"$f":"'export html'!BE23","v":"2014-12-26"},{"$f":"'export html'!BI23","v":"Lierse"},"-",{"$f":"'export html'!BJ23","v":"Club Brugge"},{"$f":"IF(LEN('export html'!BH23),'export html'!BH23,\"\")","v":"0-6"}]
[null,{"$f":"'export html'!BF24","v":22},{"$f":"'export html'!BE24","v":"2015-01-18"},{"$f":"'export html'!BI24","v":"Anderlecht"},"-",{"$f":"'export html'!BJ24","v":"Lierse"},{"$f":"IF(LEN('export html'!BH24),'export html'!BH24,\"\")","v":"3-0"}]
[null,{"$f":"'export html'!BF25","v":23},{"$f":"'export html'!BE25","v":"2015-01-24"},{"$f":"'export html'!BI25","v":"Lierse"},"-",{"$f":"'export html'!BJ25","v":"Waasland-Beveren"},{"$f":"IF(LEN('export html'!BH25),'export html'!BH25,\"\")","v":"1-1"}]
[null,{"$f":"'export html'!BF26","v":24},{"$f":"'export html'!BE26","v":"2015-01-31"},{"$f":"'export html'!BI26","v":"Lierse"},"-",{"$f":"'export html'!BJ26","v":"Standard"},{"$f":"IF(LEN('export html'!BH26),'export html'!BH26,\"\")","v":"2-3"}]
[null,{"$f":"'export html'!BF27","v":25},{"$f":"'export html'!BE27","v":"2015-02-07"},{"$f":"'export html'!BI27","v":"Zulte-Waregem"},"-",{"$f":"'export html'!BJ27","v":"Lierse"},{"$f":"IF(LEN('export html'!BH27),'export html'!BH27,\"\")","v":"2-3"}]
[null,{"$f":"'export html'!BF28","v":26},{"$f":"'export html'!BE28","v":"2015-02-14"},{"$f":"'export html'!BI28","v":"Lierse"},"-",{"$f":"'export html'!BJ28","v":"Cercle Brugge"},{"$f":"IF(LEN('export html'!BH28),'export html'!BH28,\"\")","v":"2-1"}]
[null,{"$f":"'export html'!BF29","v":27},{"$f":"'export html'!BE29","v":"2015-02-21"},{"$f":"'export html'!BI29","v":"KV Mechelen"},"-",{"$f":"'export html'!BJ29","v":"Lierse"},{"$f":"IF(LEN('export html'!BH29),'export html'!BH29,\"\")","v":"2-1"}]
[null,{"$f":"'export html'!BF30","v":28},{"$f":"'export html'!BE30","v":"2015-02-28"},{"$f":"'export html'!BI30","v":"Lierse"},"-",{"$f":"'export html'!BJ30","v":"Genk"},{"$f":"IF(LEN('export html'!BH30),'export html'!BH30,\"\")","v":"0-2"}]
[null,{"$f":"'export html'!BF31","v":29},{"$f":"'export html'!BE31","v":"2015-03-07"},{"$f":"'export html'!BI31","v":"Gent"},"-",{"$f":"'export html'!BJ31","v":"Lierse"},{"$f":"IF(LEN('export html'!BH31),'export html'!BH31,\"\")","v":"2-1"}]
[null,{"$f":"'export html'!BF32","v":30},{"$f":"'export html'!BE32","v":"2015-03-14"},{"$f":"'export html'!BI32","v":"Lierse"},"-",{"$f":"'export html'!BJ32","v":"Kortrijk"},{"$f":"IF(LEN('export html'!BH32),'export html'!BH32,\"\")","v":"0-0"}]

{"sheet":"spelersstatistieken","index":3,"n_rows":23,"n_cols":3,"rows_kept":23,"cut":false,"hidden":false,"merged":[]}
["Naam","Goals","Rang"]
["Bourabia Rachid",2,{"$f":"RANK(tbl_Spelers[[#This Row],[Goals]],tbl_Spelers[Goals])+ROW()/10^4","v":3.0002}]
["Hafez Karim",1,{"$f":"RANK(tbl_Spelers[[#This Row],[Goals]],tbl_Spelers[Goals])+ROW()/10^4","v":9.0002999999999993}]
["Hassan Ahmed",1,{"$f":"RANK(tbl_Spelers[[#This Row],[Goals]],tbl_Spelers[Goals])+ROW()/10^4","v":9.0004000000000008}]
["Kasmi Faisel",4,{"$f":"RANK(tbl_Spelers[[#This Row],[Goals]],tbl_Spelers[Goals])+ROW()/10^4","v":2.0005000000000002}]
["Keita Alhassane",5,{"$f":"RANK(tbl_Spelers[[#This Row],[Goals]],tbl_Spelers[Goals])+ROW()/10^4","v":1.0005999999999999}]
["Kouemaha Dorge",2,{"$f":"RANK(tbl_Spelers[[#This Row],[Goals]],tbl_Spelers[Goals])+ROW()/10^4","v":3.0007000000000001}]
["Losada Hernan",1,{"$f":"RANK(tbl_Spelers[[#This Row],[Goals]],tbl_Spelers[Goals])+ROW()/10^4","v":9.0007999999999999}]
["Masika Ajub",1,{"$f":"RANK(tbl_Spelers[[#This Row],[Goals]],tbl_Spelers[Goals])+ROW()/10^4","v":9.0008999999999997}]
["Matoukou Eric",1,{"$f":"RANK(tbl_Spelers[[#This Row],[Goals]],tbl_Spelers[Goals])+ROW()/10^4","v":9.0009999999999994}]
["Mojsov Daniel",1,{"$f":"RANK(tbl_Spelers[[#This Row],[Goals]],tbl_Spelers[Goals])+ROW()/10^4","v":9.0010999999999992}]
["Ngawa Pierre-Yves",2,{"$f":"RANK(tbl_Spelers[[#This Row],[Goals]],tbl_Spelers[Goals])+ROW()/10^4","v":3.0011999999999999}]
["Nwofor Uche",2,{"$f":"RANK(tbl_Spelers[[#This Row],[Goals]],tbl_Spelers[Goals])+ROW()/10^4","v":3.0013000000000001}]
["Sayed Ahmed",2,{"$f":"RANK(tbl_Spelers[[#This Row],[Goals]],tbl_Spelers[Goals])+ROW()/10^4","v":3.0013999999999998}]
["Traore Hamary",1,{"$f":"RANK(tbl_Spelers[[#This Row],[Goals]],tbl_Spelers[Goals])+ROW()/10^4","v":9.0015000000000001}]
["Velikonja Etien",2,{"$f":"RANK(tbl_Spelers[[#This Row],[Goals]],tbl_Spelers[Goals])+ROW()/10^4","v":3.0015999999999998}]
["Vellios Apostolos",1,{"$f":"RANK(tbl_Spelers[[#This Row],[Goals]],tbl_Spelers[Goals])+ROW()/10^4","v":9.0016999999999996}]
["Wanderson",1,{"$f":"RANK(tbl_Spelers[[#This Row],[Goals]],tbl_Spelers[Goals])+ROW()/10^4","v":9.0017999999999994}]
["Wils Thomas",0,{"$f":"RANK(tbl_Spelers[[#This Row],[Goals]],tbl_Spelers[Goals])+ROW()/10^4","v":18.001899999999999}]
[]
["Own-goals",0]
["Forfait goals",0]
["TOTAAL",{"$f":"IF(SUM(B2:B22)=0,\"\",SUM(B2:B22))","v":30}]