{"text_format":"1","workbook":"xlsx","n_sheets":4,"sheets":["rooster en stand","export html","kalender","spelersstatistieken"],"not_rendered":{"charts":0,"images":13,"macros":1,"external_links":0,"defined_names":11,"comments":0,"pivot_tables":0},"unopened":[],"bounds":{"document_bytes":16777216,"sheet_cells":100000,"rows_first":2000,"rows_last":500,"rows_between":2000,"halvings":0,"cell_chars":16384,"cell_head_chars":4096},"cells_cut":0,"cells_raw":0,"read":"whole","date_system":"1900"}

{"sheet":"rooster en stand","index":0,"n_rows":54,"n_cols":113,"rows_kept":54,"cut":false,"hidden":false,"merged":[[2,41,3,41],[2,42,3,42],[2,45,3,45],[2,46,3,46],[2,25,3,25],[2,39,3,39],[2,40,3,40],[2,17,3,17],[2,18,3,18],[2,38,3,38],[2,31,3,31],[2,28,3,28],[2,29,3,29],[2,34,3,34],[2,35,3,35],[2,37,3,37],[2,36,3,36],[2,24,3,24],[2,26,3,26],[2,27,3,27],[2,19,3,19],[2,20,3,20],[2,21,3,21],[2,2,2,7],[3,5,3,6],[2,15,3,15],[2,16,3,16],[22,5,22,7],[2,48,3,48],[2,49,3,49],[2,50,3,50],[2,63,3,63],[2,59,3,59],[2,60,3,60],[2,61,3,61],[2,62,3,62],[2,22,3,22],[2,23,3,23],[2,58,3,58],[2,30,3,30],[2,47,3,47],[2,43,3,43],[2,32,3,32],[2,33,3,33],[2,56,3,56],[2,57,3,57],[2,51,3,51],[2,52,3,52],[2,44,3,44],[2,55,3,55],[2,53,3,53],[2,54,3,54]]}
[]
[null,null,"Updated:","2015-03-15T21:37:14",null,"© 2014/2015 - Wim Gielis - wim.gielis@gmail.com - http://www.wimgielis.be"]
[null,null,"Lierse",null,null,null,null,null,null,null,null,null,null,null,null,null,{"$f":"P5","v":"Anderlecht"},{"$f":"P6","v":"Cercle Brugge"},{"$f":"P7","v":"Charleroi"},{"$f":"P8","v":"Club Brugge"},{"$f":"P9","v":"Genk"},{"$f":"P10","v":"Gent"},{"$f":"P11","v":"Kortrijk"},{"$f":"P12","v":"KV Mechelen"},{"$f":"P13","v":"Lierse"},{"$f":"P14","v":"Lokeren"},{"$f":"P15","v":"Moeskroen-Peruwelz"},{"$f":"P16","v":"Oostende"},{"$f":"P17","v":"Standard"},{"$f":"P18","v":"Waasland-Beveren"},{"$f":"P19","v":"Westerlo"},{"$f":"P20","v":"Zulte-Waregem"},{"$f":"P5","v":"Anderlecht"},{"$f":"P6","v":"Cercle Brugge"},{"$f":"P7","v":"Charleroi"},{"$f":"P8","v":"Club Brugge"},{"$f":"P9","v":"Genk"},{"$f":"P10","v":"Gent"},{"$f":"P11","v":"Kortrijk"},{"$f":"P12","v":"KV Mechelen"},{"$f":"P13","v":"Lierse"},{"$f":"P14","v":"Lokeren"},{"$f":"P15","v":"Moeskroen-Peruwelz"},{"$f":"P16","v":"Oostende"},{"$f":"P17","v":"Standard"},{"$f":"P18","v":"Waasland-Beveren"},{"$f":"P19","v":"Westerlo"},{"$f":"P20","v":"Zulte-Waregem"},{"$f":"P5","v":"Anderlecht"},{"$f":"P6","v":"Cercle Brugge"},{"$f":"P7","v":"Charleroi"},{"$f":"P8","v":"Club Brugge"},{"$f":"P9","v":"Genk"},{"$f":"P10","v":"Gent"},{"$f":"P11","v":"Kortrijk"},{"$f":"P12","v":"KV Mechelen"},{"$f":"P13","v":"Lierse"},{"$f":"P14","v":"Lokeren"},{"$f":"P15","v":"Moeskroen-Peruwelz"},{"$f":"P16","v":"Oostende"},{"$f":"P17","v":"Standard"},{"$f":"P18","v":"Waasland-Beveren"},{"$f":"P19","v":"Westerlo"},{"$f":"P20","v":"Zulte-Waregem"}]
[null,null,null,"Ploeg","P","M",null,"W","V","G","+","-","S","VP"]
[null,null,1,{"$f":"VLOOKUP(BZ5,HulpberekeningenStand,2,FALSE)","v":"Club Brugge"},{"$f":"3*H5+J5","v":61},{"$f":"SUM(H5:J5)","v":30},{"$f":"REPT(IF(F5-MODE(F5:F20)<0,\"-\",\"+\"),ABS(F5-MODE(F5:F20)))","v":""},{"$f":"VLOOKUP(BZ5,HulpberekeningenStand,5,FALSE)","v":17},{"$f":"VLOOKUP(BZ5,HulpberekeningenStand,6,FALSE)","v":3},{"$f":"VLOOKUP(BZ5,HulpberekeningenStand,7,FALSE)","v":10},{"$f":"VLOOKUP(BZ5,HulpberekeningenStand,8,FALSE)","v":69},{"$f":"VLOOKUP(BZ5,HulpberekeningenStand,9,FALSE)","v":28},{"$f":"K5-L5","v":41},{"$f":"3*F5-E5","v":29},null,"Anderlecht",null,"3-2","1-0","2-2","0-0","1-2","2-0","1-1","3-0","1-1","3-1","3-0","0-2","1-0","4-0","0-0",null,8,3,17,10,30,28,26,22,14,1,19,12,5,21,24,null,"2014-09-20","2014-08-10","2014-11-29","2014-10-05","2015-03-14","2015-03-01","2015-02-15","2015-01-18","2014-11-01","2014-07-27","2014-12-14","2014-10-26","2014-08-24","2014-12-26","2015-01-31",null,{"$f":"RANK(BP5,$BP$5:$BP$20,0)+RANK(BR5,$BR$5:$BR$20,0)/10^2+RANK(BQ5,$BQ$5:$BQ$20,1)/10^4+RANK(BW5,$BW$5:$BW$20,0)/10^6+BY5/10^8","v":2.0201030100000001},{"$f":"P5","v":"Anderlecht"},{"$f":"3*BR5+BT5","v":57},{"$f":"SUM(BR5:BT5)","v":30},{"$f":"CHOOSE(StandBer,COUNTIF(CC39:CR39,\"t\")+COUNTIF(CC39:CC54,\"u\")+COUNTIF(CT39:DI39,\"t\")+COUNTIF(CT39:CT54,\"u\"),COUNTIF(CC39:CR39,\"t\")+COUNTIF(CC39:CC54,\"u\"),COUNTIF(CT39:DI39,\"t\")+COUNTIF(CT39:CT54,\"u\"),COUNTIF(CC39:CR39,\"t\")+COUNTIF(CT39:DI39,\"t\"),COUNTIF(CC39:CC54,\"u\")+COUNTIF(CT39:CT54,\"u\"))","v":16},{"$f":"CHOOSE(StandBer,COUNTIF(CC39:CR39,\"u\")+COUNTIF(CC39:CC54,\"t\")+COUNTIF(CT39:DI39,\"u\")+COUNTIF(CT39:CT54,\"t\"),COUNTIF(CC39:CR39,\"u\")+COUNTIF(CC39:CC54,\"t\"),COUNTIF(CT39:DI39,\"u\")+COUNTIF(CT39:CT54,\"t\"),COUNTIF(CC39:CR39,\"u\")+COUNTIF(CT39:DI39,\"u\"),COUNTIF(CC39:CC54,\"t\")+COUNTIF(CT39:CT54,\"t\"))+BX5","v":5},{"$f":"CHOOSE(StandBer,COUNTIF(CC39:CR39,\"g\")+COUNTIF(CC39:CC54,\"g\")+COUNTIF(CT39:DI39,\"g\")+COUNTIF(CT39:CT54,\"g\"),COUNTIF(CC39:CR39,\"g\")+COUNTIF(CC39:CC54,\"g\"),COUNTIF(CT39:DI39,\"g\")+COUNTIF(CT39:CT54,\"g\"),COUNTIF(CC39:CR39,\"g\")+COUNTIF(CT39:DI39,\"g\"),COUNTIF(CC39:CC54,\"g\")+COUNTIF(CT39:CT54,\"g\"))","v":9},{"$f":"CHOOSE(StandBer,SUM(CC5:CR5)+SUM(CC22:CC37)+SUM(CT5:DI5)+SUM(CT22:CT37),SUM(CC5:CR5)+SUM(CC22:CC37),SUM(CT5:DI5)+SUM(CT22:CT37),SUM(CC5:CR5)+SUM(CT5:DI5),SUM(CC22:CC37)+SUM(CT22:CT37))-5*BX5","v":52},{"$f":"CHOOSE(StandBer,SUM(CC5:CC20)+SUM(CC22:CR22)+SUM(CT5:CT20)+SUM(CT22:DI22),SUM(CC5:CC20)+SUM(CC22:CR22),SUM(CT5:CT20)+SUM(CT22:DI22),SUM(CC5:CC20)+SUM(CT5:CT20),SUM(CC22:CR22)+SUM(CT22:DI22))","v":30},{"$f":"BU5-BV5","v":22},{"$f":"CHOOSE(StandBer,COUNTIF(CC39:CR39,\"ff\")+COUNTIF(CC39:CC54,\"ff\")+COUNTIF(CT39:DI39,\"ff\")+COUNTIF(CT39:CT54,\"ff\"),COUNTIF(CC39:CR39,\"ff\")+COUNTIF(CC39:CC54,\"ff\"),COUNTIF(CT39:DI39,\"ff\")+COUNTIF(CT39:CT54,\"ff\"),COUNTIF(CC39:CR39,\"ff\")+COUNTIF(CT39:DI39,\"ff\"),COUNTIF(CC39:CC54,\"ff\")+COUNTIF(CT39:CT54,\"ff\"))","v":0},1,{"$f":"SMALL(BN5:BN20,1)","v":1.0101010399999999},null,null,null,{"$f":"IF(OR(ISERROR(FIND(\"-\",R5)),AH5>15),\"\",IF(LEFT(R5)=\"*\",5,MID(R5,1,FIND(\"-\",R5)-1)-0))","v":3},{"$f":"IF(OR(ISERROR(FIND(\"-\",S5)),AI5>15),\"\",IF(LEFT(S5)=\"*\",5,MID(S5,1,FIND(\"-\",S5)-1)-0))","v":1},{"$f":"IF(OR(ISERROR(FIND(\"-\",T5)),AJ5>15),\"\",IF(LEFT(T5)=\"*\",5,MID(T5,1,FIND(\"-\",T5)-1)-0))","v":""},{"$f":"IF(OR(ISERROR(FIND(\"-\",U5)),AK5>15),\"\",IF(LEFT(U5)=\"*\",5,MID(U5,1,FIND(\"-\",U5)-1)-0))","v":0},{"$f":"IF(OR(ISERROR(FIND(\"-\",V5)),AL5>15),\"\",IF(LEFT(V5)=\"*\",5,MID(V5,1,FIND(\"-\",V5)-1)-0))","v":""},{"$f":"IF(OR(ISERROR(FIND(\"-\",W5)),AM5>15),\"\",IF(LEFT(W5)=\"*\",5,MID(W5,1,FIND(\"-\",W5)-1)-0))","v":""},{"$f":"IF(OR(ISERROR(FIND(\"-\",X5)),AN5>15),\"\",IF(LEFT(X5)=\"*\",5,MID(X5,1,FIND(\"-\",X5)-1)-0))","v":""},{"$f":"IF(OR(ISERROR(FIND(\"-\",Y5)),AO5>15),\"\",IF(LEFT(Y5)=\"*\",5,MID(Y5,1,FIND(\"-\",Y5)-1)-0))","v":""},{"$f":"IF(OR(ISERROR(FIND(\"-\",Z5)),AP5>15),\"\",IF(LEFT(Z5)=\"*\",5,MID(Z5,1,FIND(\"-\",Z5)-1)-0))","v":1},{"$f":"IF(OR(ISERROR(FIND(\"-\",AA5)),AQ5>15),\"\",IF(LEFT(AA5)=\"*\",5,MID(AA5,1,FIND(\"-\",AA5)-1)-0))","v":3},{"$f":"IF(OR(ISERROR(FIND(\"-\",AB5)),AR5>15),\"\",IF(LEFT(AB5)=\"*\",5,MID(AB5,1,FIND(\"-\",AB5)-1)-0))","v":""},{"$f":"IF(OR(ISERROR(FIND(\"-\",AC5)),AS5>15),\"\",IF(LEFT(AC5)=\"*\",5,MID(AC5,1,FIND(\"-\",AC5)-1)-0))","v":0},{"$f":"IF(OR(ISERROR(FIND(\"-\",AD5)),AT5>15),\"\",IF(LEFT(AD5)=\"*\",5,MID(AD5,1,FIND(\"-\",AD5)-1)-0))","v":1},{"$f":"IF(OR(ISERROR(FIND(\"-\",AE5)),AU5>15),\"\",IF(LEFT(AE5)=\"*\",5,MID(AE5,1,FIND(\"-\",AE5)-1)-0))","v":""},{"$f":"IF(OR(ISERROR(FIND(\"-\",AF5)),AV5>15),\"\",IF(LEFT(AF5)=\"*\",5,MID(AF5,1,FIND(\"-\",AF5)-1)-0))","v":""},null,null,{"$f":"IF(OR(ISERROR(FIND(\"-\",R5)),AH5<=15),\"\",IF(LEFT(R5)=\"*\",5,MID(R5,1,FIND(\"-\",R5)-1)-0))","v":""},{"$f":"IF(OR(ISERROR(FIND(\"-\",S5)),AI5<=15),\"\",IF(LEFT(S5)=\"*\",5,MID(S5,1,FIND(\"-\",S5)-1)-0))","v":""},{"$f":"IF(OR(ISERROR(FIND(\"-\",T5)),AJ5<=15),\"\",IF(LEFT(T5)=\"*\",5,MID(T5,1,FIND(\"-\",T5)-1)-0))","v":2},{"$f":"IF(OR(ISERROR(FIND(\"-\",U5)),AK5<=15),\"\",IF(LEFT(U5)=\"*\",5,MID(U5,1,FIND(\"-\",U5)-1)-0))","v":""},{"$f":"IF(OR(ISERROR(FIND(\"-\",V5)),AL5<=15),\"\",IF(LEFT(V5)=\"*\",5,MID(V5,1,FIND(\"-\",V5)-1)-0))","v":1},{"$f":"IF(OR(ISERROR(FIND(\"-\",W5)),AM5<=15),\"\",IF(LEFT(W5)=\"*\",5,MID(W5,1,FIND(\"-\",W5)-1)-0))","v":2},{"$f":"IF(OR(ISERROR(FIND(\"-\",X5)),AN5<=15),\"\",IF(LEFT(X5)=\"*\",5,MID(X5,1,FIND(\"-\",X5)-1)-0))","v":1},{"$f":"IF(OR(ISERROR(FIND(\"-\",Y5)),AO5<=15),\"\",IF(LEFT(Y5)=\"*\",5,MID(Y5,1,FIND(\"-\",Y5)-1)-0))","v":3},{"$f":"IF(OR(ISERROR(FIND(\"-\",Z5)),AP5<=15),\"\",IF(LEFT(Z5)=\"*\",5,MID(Z5,1,FIND(\"-\",Z5)-1)-0))","v":""},{"$f":"IF(OR(ISERROR(FIND(\"-\",AA5)),AQ5<=15),\"\",IF(LEFT(AA5)=\"*\",5,MID(AA5,1,FIND(\"-\",AA5)-1)-0))","v":""},{"$f":"IF(OR(ISERROR(FIND(\"-\",AB5)),AR5<=15),\"\",IF(LEFT(AB5)=\"*\",5,MID(AB5,1,FIND(\"-\",AB5)-1)-0))","v":3},{"$f":"IF(OR(ISERROR(FIND(\"-\",AC5)),AS5<=15),\"\",IF(LEFT(AC5)=\"*\",5,MID(AC5,1,FIND(\"-\",AC5)-1)-0))","v":""},{"$f":"IF(OR(ISERROR(FIND(\"-\",AD5)),AT5<=15),\"\",IF(LEFT(AD5)=\"*\",5,MID(AD5,1,FIND(\"-\",AD5)-1)-0))","v":""},{"$f":"IF(OR(ISERROR(FIND(\"-\",AE5)),AU5<=15),\"\",IF(LEFT(AE5)=\"*\",5,MID(AE5,1,FIND(\"-\",AE5)-1)-0))","v":4},{"$f":"IF(OR(ISERROR(FIND(\"-\",AF5)),AV5<=15),\"\",IF(LEFT(AF5)=\"*\",5,MID(AF5,1,FIND(\"-\",AF5)-1)-0))","v":0}]
[null,null,{"$f":"IF(RANK(E6,E5:E20,0)>RANK(E5,E5:E20,0),RANK(E6,E5:E20,0),\"\")","v":2},"Gent",57,30,{"$f":"REPT(IF(F6-MODE(F5:F20)<0,\"-\",\"+\"),ABS(F6-MODE(F5:F20)))","v":""},16,5,9,52,29,23,33,null,"Cercle Brugge","0-2",null,"1-0","0-3","0-1","0-0","0-4","2-3","1-2","1-0","2-1","0-1","0-1","1-0","1-2","2-2",25,null,7,23,17,1,14,30,11,5,19,3,13,21,9,27,"2015-02-08",null,"2014-09-13","2015-01-24","2014-11-29","2014-07-26","2014-11-01","2015-03-14","2014-10-18","2014-08-24","2014-12-13","2014-08-09","2014-10-29","2014-12-27","2014-09-27","2015-02-21",null,{"$f":"RANK(BP6,$BP$5:$BP$20,0)+RANK(BR6,$BR$5:$BR$20,0)/10^2+RANK(BQ6,$BQ$5:$BQ$20,1)/10^4+RANK(BW6,$BW$5:$BW$20,0)/10^6+BY6/10^8","v":15.150115019999999},"Cercle Brugge",24,30,{"$f":"CHOOSE(StandBer,COUNTIF(CC40:CR40,\"t\")+COUNTIF(CD39:CD54,\"u\")+COUNTIF(CT40:DI40,\"t\")+COUNTIF(CU39:CU54,\"u\"),COUNTIF(CC40:CR40,\"t\")+COUNTIF(CD39:CD54,\"u\"),COUNTIF(CT40:DI40,\"t\")+COUNTIF(CU39:CU54,\"u\"),COUNTIF(CC40:CR40,\"t\")+COUNTIF(CT40:DI40,\"t\"),COUNTIF(CD39:CD54,\"u\")+COUNTIF(CU39:CU54,\"u\"))","v":6},{"$f":"CHOOSE(StandBer,COUNTIF(CC40:CR40,\"u\")+COUNTIF(CD39:CD54,\"t\")+COUNTIF(CT40:DI40,\"u\")+COUNTIF(CU39:CU54,\"t\"),COUNTIF(CC40:CR40,\"u\")+COUNTIF(CD39:CD54,\"t\"),COUNTIF(CT40:DI40,\"u\")+COUNTIF(CU39:CU54,\"t\"),COUNTIF(CC40:CR40,\"u\")+COUNTIF(CT40:DI40,\"u\"),COUNTIF(CD39:CD54,\"t\")+COUNTIF(CU39:CU54,\"t\"))+BX6","v":18},{"$f":"CHOOSE(StandBer,COUNTIF(CC40:CR40,\"g\")+COUNTIF(CD39:CD54,\"g\")+COUNTIF(CT40:DI40,\"g\")+COUNTIF(CU39:CU54,\"g\"),COUNTIF(CC40:CR40,\"g\")+COUNTIF(CD39:CD54,\"g\"),COUNTIF(CT40:DI40,\"g\")+COUNTIF(CU39:CU54,\"g\"),COUNTIF(CC40:CR40,\"g\")+COUNTIF(CT40:DI40,\"g\"),COUNTIF(CD39:CD54,\"g\")+COUNTIF(CU39:CU54,\"g\"))","v":6},{"$f":"CHOOSE(StandBer,SUM(CC6:CR6)+SUM(CD22:CD37)+SUM(CT6:DI6)+SUM(CU22:CU37),SUM(CC6:CR6)+SUM(CD22:CD37),SUM(CT6:DI6)+SUM(CU22:CU37),SUM(CC6:CR6)+SUM(CT6:DI6),SUM(CD22:CD37)+SUM(CU22:CU37))-5*BX6","v":21},{"$f":"CHOOSE(StandBer,SUM(CD5:CD20)+SUM(CC23:CR23)+SUM(CU5:CU20)+SUM(CT23:DI23),SUM(CD5:CD20)+SUM(CC23:CR23),SUM(CU5:CU20)+SUM(CT23:DI23),SUM(CD5:CD20)+SUM(CU5:CU20),SUM(CC23:CR23)+SUM(CT23:DI23))","v":45},-24,{"$f":"CHOOSE(StandBer,COUNTIF(CC40:CR40,\"ff\")+COUNTIF(CD39:CD54,\"ff\")+COUNTIF(CT40:DI40,\"ff\")+COUNTIF(CU39:CU54,\"ff\"),COUNTIF(CC40:CR40,\"ff\")+COUNTIF(CD39:CD54,\"ff\"),COUNTIF(CT40:DI40,\"ff\")+COUNTIF(CU39:CU54,\"ff\"),COUNTIF(CC40:CR40,\"ff\")+COUNTIF(CT40:DI40,\"ff\"),COUNTIF(CD39:CD54,\"ff\")+COUNTIF(CU39:CU54,\"ff\"))","v":0},2,{"$f":"SMALL(BN5:BN20,2)","v":2.0201020600000001},null,null,{"$f":"IF(OR(ISERROR(FIND(\"-\",Q6)),AG6>15),\"\",IF(LEFT(Q6)=\"*\",5,MID(Q6,1,FIND(\"-\",Q6)-1)-0))","v":""},null,1,"","",0,0,"",1,1,"",0,0,"",1,"",null,{"$f":"IF(OR(ISERROR(FIND(\"-\",Q6)),AG6<=15),\"\",IF(LEFT(Q6)=\"*\",5,MID(Q6,1,FIND(\"-\",Q6)-1)-0))","v":0},null,"",0,0,"","",2,"","",2,"","",1,"",2]
{"$rows_left_out":49}
{"sheet":"export html","index":1,"n_rows":32,"n_cols":62,"rows_kept":32,"cut":false,"hidden":true,"merged":[]}
[{"$f":"MAX(1,COUNTA(A3:A20))","v":8},null,null,null,"hulp: thuis","hulp: uit","hulp: uitslag",null,{"$f":"MAX(1,COUNT(I3:I20))","v":1},null,null,null,"hulp: thuis","hulp: uit","hulp: uitslag",null,null,null,null,{"$f":"MAX(1,COUNT(T3:T20))","v":5},null,"Recentste duels op ","uitslag",null,null,null,null,null,null,null,null,{"$f":"MAX(1,MIN(5,COUNTIF(spelersstatistieken!$B$2:$B$19,\">0\")))","v":5},null,"Hulp: # goals",null,{"$f":"MAX(1,COUNTA(AJ3:AJ20))","v":2},null,null,null,null,null,null,null,{"$f":"COUNTIF('rooster en stand'!AW5:BL5,\"=?\")+COUNTBLANK('rooster en stand'!AW5:BL5)+COUNTIF('rooster en stand'!AW5:AW20,\"=?\")+COUNTBLANK('rooster en stand'!AW5:AW20)-2","v":0},"# ongekende datums",null,{"$f":"MAX(1,COUNTA(AU3:AU20))","v":1},null,null,null,null,null,null,null,null,null,{"$f":"MAX(1,COUNT(BE3:BE32))","v":30},null,null,null,"hulp: thuis","hulp: uit"]
["Datum","Speeldag",{"$f":"\"Matchen van \" & IF('rooster en stand'!$J$31=0,\"speeldag \"&'rooster en stand'!$F$31,TEXT('rooster en stand'!$J$31,\"dd/mm/jjjj\"))","v":"Matchen van speeldag 30"},"Uitslag",null,null,null,null,"Datum","Speeldag",{"$f":"\"Matchen van \" & IF('rooster en stand'!$J$31=0,\"speeldag \" & 'rooster en stand'!$F$31+1,TEXT('rooster en stand'!$J$31+'rooster en stand'!$K$31,\"dd/mm/jjjj\"))","v":"Matchen van speeldag 31"},"Uitslag / Plaatsen",null,null,null,null,null,null,null,"Datum","Speeldag",{"$f":"V1 & TEXT('rooster en stand'!$F$23,\"dd/mm/jjjj\")","v":"Recentste duels op 15/03/2015"},null,null,null,null,null,null,null,null,null,"Top-5","Goals",null,null,"Ronde","Datum","Uur","Match","Uitslag",null,null,null,1,"berekening stand",null,"Jaar",{"$f":"\"Uit het verleden... (\" & AU1 & \"x)\"","v":"Uit het verleden... (1x)"},"Uitslag","Datum","Speeldag",null,null,null,null,null,"Datum","Speeldag","Kalender","Uitslag"]
["2015-03-14",30,"Anderlecht - Gent",{"$f":"IF(G3=0,\"\",G3)","v":"1-2"},"Anderlecht","Gent","1-2",null,null,null,null,{"$f":"IF(O3=0,\"nr. \" & MATCH($M3,'rooster en stand'!$D$5:$D$20,0) & \" - nr. \" & MATCH($N3,'rooster en stand'!$D$5:$D$20,0),O3)","v":{"$error":"#N/A"}},null,null,null,null,null,null,null,"2015-03-14",30,"Lierse - Kortrijk","0-0",null,null,null,null,null,null,null,{"$f":"IF($AF$1>=1,1,0)","v":1},{"$f":"IF(OR($AE3=0,$AG3=\"\"),\"(Niemand)\",INDEX(tbl_Spelers[Naam],MATCH(SMALL(tbl_Spelers[Rang],AE3),tbl_Spelers[Rang],0)))","v":"Keita Alhassane"},{"$f":"IF($AE3=0,\"\",IF(AH3=0,\"\",AH3))","v":5},{"$f":"INDEX(tbl_Spelers[Goals],MATCH(SMALL(tbl_Spelers[Rang],AE3),tbl_Spelers[Rang],0))","v":5},null,1,"2014-09-24",null,"Lierse - STVV","4-0",null,null,null,"00:00:00","VO kleurtje speeldag",null,null,"Geen wedstrijden voor LIERSE",null,null,null,null,null,null,null,null,"2014-07-26",1,"Lierse - Oostende","2-0","Lierse","Oostende"]
["2015-03-14",30,"Cercle Brugge - KV Mechelen",{"$f":"IF(G4=0,\"\",G4)","v":"2-3"},"Cercle Brugge","KV Mechelen","2-3",null,null,null,null,{"$f":"IF(O4=0,\"nr. \" & MATCH($M4,'rooster en stand'!$D$5:$D$20,0) & \" - nr. \" & MATCH($N4,'rooster en stand'!$D$5:$D$20,0),O4)","v":{"$error":"#N/A"}},null,null,null,null,null,null,null,"2015-03-07",29,"Gent - Lierse","2-1",null,null,null,null,null,null,null,{"$f":"IF($AF$1>=2,2,0)","v":2},{"$f":"IF(OR($AE4=0,$AG4=\"\"),\"\",INDEX(tbl_Spelers[Naam],MATCH(SMALL(tbl_Spelers[Rang],AE4),tbl_Spelers[Rang],0)))","v":"Kasmi Faisel"},{"$f":"IF($AE4=0,\"\",IF(AH4=0,\"\",AH4))","v":4},{"$f":"INDEX(tbl_Spelers[Goals],MATCH(SMALL(tbl_Spelers[Rang],AE4),tbl_Spelers[Rang],0))","v":4},null,2,"2014-12-03",null,"Zulte-Waregem - Lierse","2-1 nv",null,null,null,{"$f":"COUNTA('rooster en stand'!BO5:BO20)","v":16},"aantal ploegen",null,null,null,null,null,null,null,null,null,null,null,"2014-08-03",2,"Club Brugge - Lierse","1-0","Club Brugge","Lierse"]
["2015-03-14",30,"Charleroi - Moeskroen-Peruwelz","2-0","Charleroi","Moeskroen-Peruwelz","2-0",null,null,null,null,{"$f":"IF(O5=0,\"nr. \" & MATCH($M5,'rooster en stand'!$D$5:$D$20,0) & \" - nr. \" & MATCH($N5,'rooster en stand'!$D$5:$D$20,0),O5)","v":{"$error":"#N/A"}},null,null,null,null,null,null,null,"2015-02-28",28,"Lierse - Genk","0-2",null,null,null,null,null,null,null,{"$f":"IF($AF$1>=3,3,0)","v":3},{"$f":"IF(OR($AE5=0,$AG5=\"\"),\"\",INDEX(tbl_Spelers[Naam],MATCH(SMALL(tbl_Spelers[Rang],AE5),tbl_Spelers[Rang],0)))","v":"Bourabia Rachid"},{"$f":"IF($AE5=0,\"\",IF(AH5=0,\"\",AH5))","v":2},{"$f":"INDEX(tbl_Spelers[Goals],MATCH(SMALL(tbl_Spelers[Rang],AE5),tbl_Spelers[Rang],0))","v":2},null,null,null,null,null,null,null,null,null,{"$f":"2*(AR4-1)","v":30},"aantal matchen / ploeg",null,null,null,null,null,null,null,null,null,null,null,"2014-08-09",3,"Lierse - Moeskroen-Peruwelz","2-2","Lierse","Moeskroen-Peruwelz"]
["2015-03-14",30,"Lierse - Kortrijk","0-0","Lierse","Kortrijk","0-0",null,null,null,null,{"$f":"IF(O6=0,\"nr. \" & MATCH($M6,'rooster en stand'!$D$5:$D$20,0) & \" - nr. \" & MATCH($N6,'rooster en stand'!$D$5:$D$20,0),O6)","v":{"$error":"#N/A"}},null,null,null,null,null,null,null,"2015-02-21",27,"KV Mechelen - Lierse","2-1",null,null,null,null,null,null,null,{"$f":"IF($AF$1>=4,4,0)","v":4},{"$f":"IF(OR($AE6=0,$AG6=\"\"),\"\",INDEX(tbl_Spelers[Naam],MATCH(SMALL(tbl_Spelers[Rang],AE6),tbl_Spelers[Rang],0)))","v":"Kouemaha Dorge"},{"$f":"IF($AE6=0,\"\",IF(AH6=0,\"\",AH6))","v":2},{"$f":"INDEX(tbl_Spelers[Goals],MATCH(SMALL(tbl_Spelers[Rang],AE6),tbl_Spelers[Rang],0))","v":2},null,null,null,null,null,null,null,null,null,{"$f":"COUNTA(tbl_Spelers[Naam])","v":18},"aantal spelers",null,null,null,null,null,null,null,null,null,null,null,"2014-08-16",4,"Lokeren - Lierse","2-0","Lokeren","Lierse"]
{"$rows_left_out":27}
{"sheet":"kalender","index":2,"n_rows":32,"n_cols":7,"rows_kept":32,"cut":false,"hidden":false,"merged":[]}
[]
[null,"Spd.","Datum","Thuisploeg",null,"Uitploeg"]
["Competitie",{"$f":"'export html'!BF3","v":1},{"$f":"'export html'!BE3","v":"2014-07-26"},{"$f":"'export html'!BI3","v":"Lierse"},"-",{"$f":"'export html'!BJ3","v":"Oostende"},{"$f":"IF(LEN('export html'!BH3),'export html'!BH3,\"\")","v":"2-0"}]
[null,{"$f":"'export html'!BF4","v":2},{"$f":"'export html'!BE4","v":"2014-08-03"},{"$f":"'export html'!BI4","v":"Club Brugge"},"-",{"$f":"'export html'!BJ4","v":"Lierse"},{"$f":"IF(LEN('export html'!BH4),'export html'!BH4,\"\")","v":"1-0"}]
[null,{"$f":"'export html'!BF5","v":3},{"$f":"'export html'!BE5","v":"2014-08-09"},{"$f":"'export html'!BI5","v":"Lierse"},"-",{"$f":"'export html'!BJ5","v":"Moeskroen-Peruwelz"},{"$f":"IF(LEN('export html'!BH5),'export html'!BH5,\"\")","v":"2-2"}]
[null,{"$f":"'export html'!BF6","v":4},{"$f":"'export html'!BE6","v":"2014-08-16"},{"$f":"'export html'!BI6","v":"Lokeren"},"-",{"$f":"'export html'!BJ6","v":"Lierse"},{"$f":"IF(LEN('export html'!BH6),'export html'!BH6,\"\")","v":"2-0"}]
{"$rows_left_out":27}
{"sheet":"spelersstatistieken","index":3,"n_rows":23,"n_cols":3,"rows_kept":23,"cut":false,"hidden":false,"merged":[]}
["Naam","Goals","Rang"]
["Bourabia Rachid",2,{"$f":"RANK(tbl_Spelers[[#This Row],[Goals]],tbl_Spelers[Goals])+ROW()/10^4","v":3.0002}]
["Hafez Karim",1,{"$f":"RANK(tbl_Spelers[[#This Row],[Goals]],tbl_Spelers[Goals])+ROW()/10^4","v":9.0002999999999993}]
["Hassan Ahmed",1,{"$f":"RANK(tbl_Spelers[[#This Row],[Goals]],tbl_Spelers[Goals])+ROW()/10^4","v":9.0004000000000008}]
["Kasmi Faisel",4,{"$f":"RANK(tbl_Spelers[[#This Row],[Goals]],tbl_Spelers[Goals])+ROW()/10^4","v":2.0005000000000002}]
["Keita Alhassane",5,{"$f":"RANK(tbl_Spelers[[#This Row],[Goals]],tbl_Spelers[Goals])+ROW()/10^4","v":1.0005999999999999}]
{"$rows_left_out":17}