{"text_format":"1","workbook":"xlsx","n_sheets":2,"sheets":["Blad1","Blad2"],"not_rendered":{"charts":0,"images":0,"macros":1,"external_links":0,"defined_names":0,"comments":0,"pivot_tables":0},"unopened":[],"bounds":{"document_bytes":16777216,"sheet_cells":100000,"rows_first":2000,"rows_last":500,"rows_between":2000,"halvings":0,"cell_chars":16384,"cell_head_chars":4096},"cells_cut":0,"cells_raw":0,"read":"whole","date_system":"1900"}

{"sheet":"Blad1","index":0,"n_rows":33,"n_cols":58,"rows_kept":33,"cut":false,"hidden":false,"merged":[]}
["B","I","J","Z","E","T",null,{"$f":"MID(Blad2!E1,_xlfn.SEQUENCE(,6),1)","v":"W"},"y","t","z","e","s",{"$f":"IF( COUNTBLANK( A1:F1 ) > 0, \"\", IF(_xlfn.CONCAT(A1:F1)=_xlfn.CONCAT(_xlfn.ANCHORARRAY($H$1)),\"Snel gevonden\",\"\"))","v":""},null,{"$f":"IF(COUNTBLANK(A1:F1)>0,\"\",IF(ISNUMBER(MATCH(Q1,Blad2!$A$1:$A$500,0)),\"OK\",\"NB\"))","v":"OK"},{"$f":"_xlfn.CONCAT(A1:F1)","v":"BIJZET"},null,null,"NB",{"$f":"Blad2!E1","v":"Wytzes"},{"$f":"LEN(U1)-LEN(SUBSTITUTE(U1,\"e\",\"\"))","v":1},null,1,{"$f":"X1+30","v":31},{"$f":"Y1+30","v":61},{"$f":"Z1+30","v":91},121,151,181,211,241,271,301,331,361,391,421,451,481,null,1,{"$f":"AP1+30","v":31},{"$f":"AQ1+30","v":61},{"$f":"AR1+30","v":91},121,151,181,211,241,271,301,331,361,391,421,451,481]
[null,null,null,null,null,null,null,null,null,null,null,null,null,{"$f":"IF( COUNTBLANK( A2:F2 ) > 0, \"\", IF(_xlfn.CONCAT(A2:F2)=_xlfn.CONCAT(_xlfn.ANCHORARRAY($H$1)),\"Snel gevonden\",\"\"))","v":""},null,{"$f":"IF(COUNTBLANK(A2:F2)>0,\"\",IF(ISNUMBER(MATCH(Q2,Blad2!$A$1:$A$500,0)),\"OK\",\"NB\"))","v":""},{"$f":"_xlfn.CONCAT(A2:G2)","v":""},null,null,null,null,null,null,2,{"$f":"X2+30","v":32},62,92,122,152,182,212,242,272,{"$f":"AG2+30","v":302},332,362,392,422,452,482,null,2,{"$f":"AP2+30","v":32},62,92,122,152,182,212,242,272,302,332,362,392,422,452,482]
[null,null,null,null,null,null,null,null,null,null,null,null,null,{"$f":"IF( COUNTBLANK( A3:F3 ) > 0, \"\", IF(_xlfn.CONCAT(A3:F3)=_xlfn.CONCAT(_xlfn.ANCHORARRAY($H$1)),\"Heel goed gedaan\",\"\"))","v":""},null,{"$f":"IF(COUNTBLANK(A3:F3)>0,\"\",IF(ISNUMBER(MATCH(Q3,Blad2!$A$1:$A$500,0)),\"OK\",\"NB\"))","v":""},"",null,null,null,null,null,null,3,33,63,93,123,153,183,213,243,273,{"$f":"AG3+30","v":303},333,363,393,423,453,483,null,3,33,63,93,123,153,183,213,243,273,303,333,363,393,423,453,483]
[null,null,null,null,null,null,null,null,null,null,null,null,null,{"$f":"IF( COUNTBLANK( A4:F4 ) > 0, \"\", IF(_xlfn.CONCAT(A4:F4)=_xlfn.CONCAT(_xlfn.ANCHORARRAY($H$1)),\"Heel goed gedaan\",\"\"))","v":""},null,{"$f":"IF(COUNTBLANK(A4:F4)>0,\"\",IF(ISNUMBER(MATCH(Q4,Blad2!$A$1:$A$500,0)),\"OK\",\"NB\"))","v":""},"",null,null,null,null,null,null,4,34,64,94,124,154,184,214,244,274,{"$f":"AG4+30","v":304},334,364,394,424,454,484,null,4,34,64,94,124,154,184,214,244,274,304,334,364,394,424,454,484]
[null,null,null,null,null,null,null,70,null,null,null,null,null,"",null,{"$f":"IF(COUNTBLANK(A5:F5)>0,\"\",IF(ISNUMBER(MATCH(Q5,Blad2!$A$1:$A$500,0)),\"OK\",\"NB\"))","v":""},"",null,null,null,null,null,null,5,35,65,95,125,155,185,215,245,275,{"$f":"AG5+30","v":305},335,365,395,425,455,485,null,5,35,65,95,125,155,185,215,245,275,305,335,365,395,425,455,485]
[null,null,null,null,null,null,null,null,null,null,null,null,null,{"$f":"IF( COUNTBLANK( A6:F6 ) > 0, \"\", IF(_xlfn.CONCAT(A6:F6)=_xlfn.CONCAT(_xlfn.ANCHORARRAY($H$1)),\"Juist op tijd\",\"Woord niet gevonden.Dat was:\"& Blad2!E1 &\"\"))","v":""},null,{"$f":"IF(COUNTBLANK(A6:F6)>0,\"\",IF(ISNUMBER(MATCH(Q6,Blad2!$A$1:$A$500,0)),\"OK\",\"NB\"))","v":""},"",null,null,null,null,null,null,6,36,66,96,126,156,186,216,246,276,{"$f":"AG6+30","v":306},336,366,396,426,456,486,null,6,36,66,96,126,156,186,216,246,276,306,336,366,396,426,456,486]
[null,null,null,null,null,null,null,null,null,null,null,null,null,null,null,null,null,null,null,null,null,null,null,7,37,67,97,127,157,187,217,247,277,{"$f":"AG7+30","v":307},337,367,397,427,457,487,null,7,37,67,97,127,157,187,217,247,277,307,337,367,397,427,457,487]
["Met Hoofdletters invullen",null,null,null,null,null,null,null,null,null,null,null,null,null,null,null,null,null,null,null,null,null,null,8,38,68,98,128,158,188,218,248,278,{"$f":"AG8+30","v":308},338,368,398,428,458,488,null,8,38,68,98,128,158,188,218,248,278,308,338,368,398,428,458,488]
["Kolom P:",null,null,null,null,null,null,null,null,null,null,null,null,null,null,null,null,null,null,null,null,null,null,9,39,69,99,129,159,189,219,249,279,{"$f":"AG9+30","v":309},339,369,399,429,459,489,null,9,39,69,99,129,159,189,219,249,279,309,339,369,399,429,459,489]
["OK wil zeggen woord staat in lijst Blad 2",null,null,null,null,null,null,null,null,null,null,null,null,null,null,null,null,null,null,null,null,null,null,10,40,70,100,130,160,190,220,250,280,{"$f":"AG10+30","v":310},340,370,400,430,460,490,null,10,40,70,100,130,160,190,220,250,280,310,340,370,400,430,460,490]
["NB wil zeggen woord staat niet in lijst Blad 2",null,null,null,null,null,null,null,null,null,null,null,null,null,null,null,null,null,null,null,null,null,null,11,41,71,101,131,161,191,221,251,281,{"$f":"AG11+30","v":311},341,371,401,431,461,491,null,11,41,71,101,131,161,191,221,251,281,311,341,371,401,431,461,491]
["Typ dit dan in kolom T en druk Enter.(mag U altijd gebruiken)",null,null,null,null,null,null,null,null,null,null,null,null,null,null,null,null,null,null,null,null,null,null,12,42,72,102,132,162,192,222,252,282,{"$f":"AG12+30","v":312},342,372,402,432,462,492,null,12,42,72,102,132,162,192,222,252,282,312,342,372,402,432,462,492]
["U1 het te zoeken woord(wit gemaakt)",null,null,null,null,null,null,null,null,null,null,null,null,null,null,null,null,null,null,null,null,null,null,13,43,73,103,133,163,193,223,253,283,{"$f":"AG13+30","v":313},343,373,403,433,463,493,null,13,43,73,103,133,163,193,223,253,283,313,343,373,403,433,463,493]
["V1 formule hoeveel letters\"e\" het woord heeft.(0,1 of 2)misschien soms 3, 4 en 5  en 6 nooit",null,null,null,null,null,null,null,null,null,null,null,null,null,null,null,null,null,null,null,null,null,null,14,44,74,104,134,164,194,224,254,284,{"$f":"AG14+30","v":314},344,374,404,434,464,494,null,14,44,74,104,134,164,194,224,254,284,314,344,374,404,434,464,494]
["Geheel rechts kan U aanduiden welk cijfer U heeft gedaan.(rood(alleen ) of groen(met een ander)",null,null,null,null,null,null,null,null,null,null,null,null,null,null,null,null,null,null,null,null,null,null,15,45,75,105,135,165,195,225,255,285,{"$f":"AG15+30","v":315},345,375,405,435,465,495,null,15,45,75,105,135,165,195,225,255,285,315,345,375,405,435,465,495]
[null,null,null,null,null,null,null,null,null,null,null,null,null,null,null,null,null,null,null,null,null,null,null,16,46,76,106,136,166,196,226,256,286,{"$f":"AG16+30","v":316},346,376,406,436,466,496,null,16,46,76,106,136,166,196,226,256,286,316,346,376,406,436,466,496]
["De lange \"IJ\" telt voor twee cellen(zie voorbeeld)",null,null,null,null,null,null,null,null,null,null,null,null,null,null,null,null,null,null,null,null,null,null,17,47,77,107,137,167,197,227,257,287,{"$f":"AG17+30","v":317},347,377,407,437,467,497,null,17,47,77,107,137,167,197,227,257,287,317,347,377,407,437,467,{"$f":"BE17+30","v":497}]
[null,null,null,null,null,null,null,null,null,null,null,null,null,null,null,null,null,null,null,null,null,null,null,18,48,78,108,138,168,198,228,258,288,{"$f":"AG18+30","v":318},348,378,408,438,468,498,null,18,{"$f":"AP18+30","v":48},78,108,138,168,198,228,258,288,318,348,378,408,438,468,498]
[null,null,null,null,null,null,null,null,null,null,null,null,null,null,null,null,null,null,null,null,null,null,null,19,49,79,109,139,169,199,229,259,289,{"$f":"AG19+30","v":319},349,379,409,439,469,499,null,19,49,79,109,139,169,199,229,259,289,319,349,379,409,439,469,499]
[null,null,null,null,null,null,null,null,null,null,null,null,null,null,null,null,null,null,null,null,null,null,null,20,50,80,110,140,170,200,230,260,290,{"$f":"AG20+30","v":320},350,380,410,440,470,500,null,20,50,80,110,140,170,200,230,260,290,320,350,380,410,440,470,500]
[null,null,null,null,null,null,null,null,null,null,null,null,null,null,null,null,null,null,null,null,null,null,null,21,51,81,111,141,171,201,231,261,291,{"$f":"AG21+30","v":321},351,381,411,441,471,null,null,21,51,81,111,141,171,201,231,261,291,321,351,381,411,441,471]
[null,null,null,null,null,null,null,null,null,null,null,null,null,null,null,null,null,null,null,null,null,null,null,22,52,82,112,142,172,202,232,262,292,{"$f":"AG22+30","v":322},352,382,412,442,472,null,null,22,52,82,112,142,172,202,232,262,292,322,352,382,412,442,472]
[null,null,null,null,null,null,null,null,null,null,null,null,null,null,null,null,null,null,null,null,null,null,null,23,53,83,113,143,173,203,233,263,293,{"$f":"AG23+30","v":323},353,383,413,443,473,null,null,23,53,83,113,143,173,203,233,263,293,323,353,383,413,443,473]
[null,null,null,null,null,null,null,null,null,null,null,null,null,null,null,null,null,null,null,null,null,null,null,24,54,84,114,144,174,204,234,264,294,{"$f":"AG24+30","v":324},354,384,414,444,474,null,null,24,54,84,114,144,174,204,234,264,294,324,354,384,414,444,474]
[null,null,null,null,null,null,null,null,null,null,null,null,null,null,null,null,null,null,null,null,null,null,null,25,55,85,115,145,175,205,235,265,{"$f":"AF25+30","v":295},325,355,385,415,445,475,null,null,25,55,85,115,145,175,205,235,265,295,325,355,385,415,445,475]
[null,null,null,null,null,null,null,null,null,null,null,null,null,null,null,null,null,null,null,null,null,null,null,26,56,86,116,146,176,206,236,266,{"$f":"AF26+30","v":296},326,356,386,416,446,476,null,null,26,56,86,116,146,176,206,236,266,296,326,356,386,416,446,476]
[null,null,null,null,null,null,null,null,null,null,null,null,null,null,null,null,null,null,null,null,null,null,null,27,57,87,117,147,177,207,237,267,{"$f":"AF27+30","v":297},327,357,387,417,447,477,null,null,27,57,87,117,147,177,207,237,267,297,327,357,387,417,447,477]
[null,null,null,null,null,null,null,null,null,null,null,null,null,null,null,null,null,null,null,null,null,null,null,28,58,88,118,148,178,208,238,268,{"$f":"AF28+30","v":298},328,358,388,418,448,478,null,null,28,58,88,118,148,178,208,238,268,298,328,358,388,418,448,478]
[null,null,null,null,null,null,null,null,null,null,null,null,null,null,null,null,null,null,null,null,null,null,null,29,59,89,119,149,179,209,239,269,{"$f":"AF29+30","v":299},329,359,389,419,449,479,null,null,29,59,89,119,149,179,209,239,269,299,329,359,389,419,449,479]
[null,null,null,null,null,null,null,null,null,null,null,null,null,null,null,null,null,null,null,null,null,null,null,30,60,90,120,150,180,210,240,270,{"$f":"AF30+30","v":300},330,360,390,420,450,480,null,null,30,60,90,120,150,180,210,240,270,300,330,360,390,420,450,480]
[]
[]
[null,null,null,null,null,null,null,null,null,null,null,null,null,null,null,null,null,null,null,null,null,null,null,null,null,null,null,null,null,"ROOD"]

{"sheet":"Blad2","index":1,"n_rows":500,"n_cols":5,"rows_kept":500,"cut":false,"hidden":false,"merged":[]}
["Accept",null,{"$f":"INDEX($A:$A,RANDBETWEEN(1,COUNTA($A:$A)),1)","v":"Beauty"},null,{"$f":"INDEX($A:$A,Blad1!H5)","v":"Wytzes"}]
["Tectyl"]
["Tomboy"]
["Zwijmt"]
["Dummys"]
["Zijpad"]
["Quidam"]
["Rallyt"]
["Burcht"]
["Typist"]
["Idylle"]
["Cyclus"]
["Juicht"]
["Zwerft"]
["Afwijk"]
["Backup"]
["Elixir"]
["Huskys"]
["Thymus"]
["Hetzij"]
["Schiep"]
["Hybris"]
["Zwijnt"]
["Klacht"]
["Lollys"]
["Lexica"]
["Squash"]
["Bijzit"]
["Afzuip"]
["Hockey"]
["Vlezig"]
["Baggys"]
["Cypres"]
["Fysica"]
["Cowboy"]
["Xyleem"]
["Zwijgt"]
["Vrucht"]
["Zlotys"]
["Bubbel"]
["Jezelf"]
["Afzwom"]
["Ruwweg"]
["Calque"]
["Schift"]
["Lynxje"]
["Shanty"]
["Volley"]
["Cachet"]
["Sexyst"]
["Joyces"]
["Jersey"]
["Lijfje"]
["Maxima"]
["Bypass"]
["Mixtum"]
["Quints"]
["Pitcht"]
["Spicht"]
["Sylfen"]
["Bespuw"]
["Ghibil"]
["Bijzet"]
["Brique"]
["Gympje"]
["Tyfeus"]
["Fysici"]
["Kitsch"]
["Wicket"]
["Wytzes"]
["Chipje"]
["Exacts"]
["Grungy"]
["Rijzig"]
["Zwicht"]
["Kwibus"]
["Papzak"]
["Quizde"]
["Bijgaf"]
["Hiphop"]
["Sprayt"]
["Yusufs"]
["Cyborg"]
["Liquor"]
["Gympen"]
["Partys"]
["Kippig"]
["Wherry"]
["Funkys"]
["Schrik"]
["Scherp"]
["Wichel"]
["Bisque"]
["Cysten"]
["Bijvul"]
["Mazzel"]
["Sulkys"]
["Fysios"]
["Claque"]
["Cliffs"]
["Quasar"]
["Vlecht"]
["Wipkip"]
["Hypend"]
["Bogeys"]
["Afkick"]
["Zwever"]
["Zwierf"]
["Lijkwa"]
["Glossy"]
["Crypte"]
["Skibox"]
["Skybox"]
["Beauty"]
["Schoft"]
["Zymose"]
["Yquems"]
["Gipsys"]
["Reflex"]
["Zijzak"]
["Zonzij"]
["Quiche"]
["Schalm"]
["Bijvak"]
["Pelzig"]
["Zwikje"]
["Lychee"]
["Zwalpt"]
["Wimpel"]
["Faxjes"]
["Ijsbox"]
["Squire"]
["Floppy"]
["Scherf"]
["Climax"]
["Pifpaf"]
["Flashy"]
["Sequel"]
["Jazzys"]
["Cachot"]
["Gymjuf"]
["Gekuch"]
["Hobbyt"]
["Vijfje"]
["Maquis"]
["Onyxen"]
["Prozac"]
["Putsch"]
["Cheque"]
["Chucks"]
["Groggy"]
["Flexie"]
["Humbug"]
["Bijlap"]
["Mixage"]
["Quotum"]
["Tricky"]
["Thalys"]
["Pantry"]
["Bochel"]
["Biecht"]
["Gifpil"]
["Shimmy"]
["Thorax"]
["Tariqs"]
["Schuwe"]
["Zigzag"]
["Jockey"]
["Wijsje"]
["Clipje"]
["Kuchje"]
["Waxjes"]
["Exquis"]
["Bijval"]
["Behuwd"]
["Placht"]
["Kwezel"]
["Yuccas"]
["Kinkys"]
["Schelf"]
["Prefix"]
["Baxter"]
["Zitzak"]
["Baljuw"]
["Chicst"]
["Ceylon"]
["Blijkt"]
["Dinghy"]
["Freaky"]
["County"]
["Switch"]
["Brunch"]
["Schelm"]
["Epoque"]
["Bitcht"]
["Equipe"]
["Bijweg"]
["Glycol"]
["Clinic"]
["Kwikwi"]
["Plexus"]
["Hymnes"]
["Quitte"]
["Zachts"]
["Zwelgt"]
["Lyriek"]
["Mythen"]
["Cortex"]
["Foxjes"]
["Circus"]
["Couche"]
["Pinyin"]
["Bijbal"]
["Cloche"]
["Dizzys"]
["Quarks"]
["Pyloon"]
["Bezuip"]
["Lyceum"]
["Scotch"]
["Lycras"]
["Cijfer"]
["Hymens"]
["Schrab"]
["Royces"]
["Webcam"]
["Cyrils"]
["Gymles"]
["Whisky"]
["Cliche"]
["Zwiept"]
["Expert"]
["Wolzak"]
["Quadje"]
["Tafzij"]
["Zijweg"]
["Kylies"]
["Schuld"]
["Flyert"]
["Quorum"]
["Margay"]
["Influx"]
["Lobbys"]
["Toxica"]
["Klucht"]
["Qatjes"]
["Syrinx"]
["Zompig"]
["Zwakje"]
["Schuwt"]
["Python"]
["Tipsys"]
["Bijzin"]
["Afzwak"]
["Schrap"]
["Chintz"]
["Wrocht"]
["Vijzel"]
["Zwavel"]
["Boxjes"]
["Episch"]
["Schalk"]
["Checkt"]
["Intypt"]
["Creche"]
["Hachje"]
["Mickey"]
["Smiley"]
["Schril"]
["Gymmen"]
["Pracht"]
["Sytzes"]
["Schijf"]
["Omzwik"]
["Schulp"]
["Schild"]
["Sherry"]
["Vracht"]
["Groovy"]
["Biopic"]
["Aflach"]
["Puzzel"]
["Chique"]
["Schuim"]
["Wyatts"]
["Masque"]
["Pixels"]
["Shabby"]
["Pizzas"]
["Scholp"]
["Currys"]
["Fysiek"]
["Chappe"]
["Comedy"]
["Ferrys"]
["Kwijlt"]
["Schijt"]
["Zijvak"]
["Clique"]
["Epifyt"]
["Pickup"]
["Clicks"]
["Byssus"]
["Opzwol"]
["Pluche"]
["Pijpje"]
["Bekijf"]
["Bracht"]
["Offday"]
["Tempex"]
["Bobbys"]
["Lyncht"]
["Bijlig"]
["Mythes"]
["Export"]
["Bewijs"]
["Chicks"]
["Larynx"]
["Xyleen"]
["Folkys"]
["Lijzig"]
["Fijfel"]
["Ikzelf"]
["Square"]
["Klysma"]
["Squaws"]
["Querys"]
["Buddys"]
["Wipper"]
["Convex"]
["Cystje"]
["Quarte"]
["Couchs"]
["Typers"]
["Vlucht"]
["Wijkje"]
["Chefje"]
["Gepoch"]
["Zachte"]
["Quizje"]
["Veejay"]
["Wijfie"]
["Zijtje"]
["Kwabbe"]
["Blijft"]
["Lynxen"]
["Cherub"]
["Papyri"]
["Rugbyt"]
["Pygmee"]
["Quaker"]
["Brandy"]
["Schubt"]
["Coccus"]
["Fichus"]
["Flyers"]
["Schelp"]
["Buggys"]
["Hydras"]
["Matrix"]
["Opzwel"]
["Behulp"]
["Clickt"]
["Waffel"]
["Claxon"]
["Maxime"]
["Happys"]
["Boxers"]
["Pyriet"]
["Plicht"]
["Boytje"]
["Guppys"]
["Schijn"]
["Schouw"]
["Pafzak"]
["Kirsch"]
["Tommys"]
["Schaft"]
["Lijvig"]
["Muffig"]
["Gezwel"]
["Happig"]
["Buzzer"]
["Methyl"]
["Vieuxs"]
["Syrahs"]
["Yuppen"]
["Lobbyt"]
["Catchy"]
["Gympie"]
["Replay"]
["Willig"]
["Zijpel"]
["Paffig"]
["Embryo"]
["Beryls"]
["Gequad"]
["Schurk"]
["Slamix"]
["Wijzer"]
{"$rows_left_out":100}