{"text_format":"1","workbook":"xlsx","n_sheets":2,"sheets":["Toog en kassa","Help"],"not_rendered":{"charts":0,"images":2,"macros":1,"external_links":1,"defined_names":29,"comments":0,"pivot_tables":0},"unopened":[],"bounds":{"document_bytes":16777216,"sheet_cells":100000,"rows_first":2000,"rows_last":500,"rows_between":2000,"halvings":0,"cell_chars":16384,"cell_head_chars":4096},"cells_cut":0,"cells_raw":0,"read":"whole","date_system":"1900"}

{"sheet":"Toog en kassa","index":0,"n_rows":35,"n_cols":63,"rows_kept":35,"cut":false,"hidden":false,"merged":[[4,57,5,58],[4,61,5,62],[1,35,1,40],[7,43,7,48],[1,2,1,7],[1,10,1,15],[7,18,7,23],[1,27,1,32],[26,2,30,6],[26,27,30,31],[3,45,3,48],[4,45,4,48],[3,20,3,23],[4,20,4,23],[22,10,23,15],[22,35,23,40]]}
[]
[null,"Lucyvo","Op de poef",null,null,null,null,null,null,null,"Poef: OFWEL afgerekende consumpties",null,null,null,null,null,null,null,null,null,null,null,null,null,null,null,"Tegenstander",{"$f":"C2","v":"Op de poef"},null,null,null,null,null,null,null,{"$f":"K2","v":"Poef: OFWEL afgerekende consumpties"}]
[]
[null,1.8,{"$f":"LOOKUP( Help!C24 - N($I$4), Help!$J$24:$J$30, Help!$K$24:$K$30 )","v":0},{"$f":"LOOKUP( Help!D24 - N($I$4), Help!$J$24:$J$30, Help!$K$24:$K$30 )","v":0},{"$f":"LOOKUP( Help!E24 - N($I$4), Help!$J$24:$J$30, Help!$K$24:$K$30 )","v":0},{"$f":"LOOKUP( Help!F24 - N($I$4), Help!$J$24:$J$30, Help!$K$24:$K$30 )","v":0},{"$f":"LOOKUP( Help!G24 - N($I$4), Help!$J$24:$J$30, Help!$K$24:$K$30 )","v":0},{"$f":"LOOKUP( Help!H24 - N($I$4), Help!$J$24:$J$30, Help!$K$24:$K$30 )","v":0},{"$f":"INPUT_Stuks","v":"   st"},null,{"$f":"LOOKUP( Help!C24 - N($Q$4), Help!$J$24:$J$30, Help!$K$24:$K$30 )","v":0},{"$f":"LOOKUP( Help!D24 - N($Q$4), Help!$J$24:$J$30, Help!$K$24:$K$30 )","v":0},{"$f":"LOOKUP( Help!E24 - N($Q$4), Help!$J$24:$J$30, Help!$K$24:$K$30 )","v":0},{"$f":"LOOKUP( Help!F24 - N($Q$4), Help!$J$24:$J$30, Help!$K$24:$K$30 )","v":0},{"$f":"LOOKUP( Help!G24 - N($Q$4), Help!$J$24:$J$30, Help!$K$24:$K$30 )","v":0},{"$f":"LOOKUP( Help!H24 - N($Q$4), Help!$J$24:$J$30, Help!$K$24:$K$30 )","v":0},{"$f":"INPUT_Stuks","v":"   st"},null,{"$f":"AZ6","v":"Datum"},null,{"$f":"BB6","v":"         /         / 2019"},null,null,null,null,null,{"$f":"B4","v":1.8},{"$f":"LOOKUP( Help!C24 - N($AH$4), Help!$J$24:$J$30, Help!$K$24:$K$30 )","v":0},{"$f":"LOOKUP( Help!D24 - N($AH$4), Help!$J$24:$J$30, Help!$K$24:$K$30 )","v":0},{"$f":"LOOKUP( Help!E24 - N($AH$4), Help!$J$24:$J$30, Help!$K$24:$K$30 )","v":0},{"$f":"LOOKUP( Help!F24 - N($AH$4), Help!$J$24:$J$30, Help!$K$24:$K$30 )","v":0},{"$f":"LOOKUP( Help!G24 - N($AH$4), Help!$J$24:$J$30, Help!$K$24:$K$30 )","v":0},{"$f":"LOOKUP( Help!H24 - N($AH$4), Help!$J$24:$J$30, Help!$K$24:$K$30 )","v":0},{"$f":"INPUT_Stuks","v":"   st"},null,{"$f":"LOOKUP( Help!C24 - N($AP$4), Help!$J$24:$J$30, Help!$K$24:$K$30 )","v":0},{"$f":"LOOKUP( Help!D24 - N($AP$4), Help!$J$24:$J$30, Help!$K$24:$K$30 )","v":0},{"$f":"LOOKUP( Help!E24 - N($AP$4), Help!$J$24:$J$30, Help!$K$24:$K$30 )","v":0},{"$f":"LOOKUP( Help!F24 - N($AP$4), Help!$J$24:$J$30, Help!$K$24:$K$30 )","v":0},{"$f":"LOOKUP( Help!G24 - N($AP$4), Help!$J$24:$J$30, Help!$K$24:$K$30 )","v":0},{"$f":"LOOKUP( Help!H24 - N($AP$4), Help!$J$24:$J$30, Help!$K$24:$K$30 )","v":0},{"$f":"INPUT_Stuks","v":"   st"},null,{"$f":"AZ6","v":"Datum"},null,{"$f":"BB6","v":"         /         / 2019"},null,null,null,null,null,"Afrekening"]
[null,"Pils, Cola",{"$f":"LOOKUP( Help!C25 - N($I$4), Help!$J$24:$J$30, Help!$K$24:$K$30 )","v":0},{"$f":"LOOKUP( Help!D25 - N($I$4), Help!$J$24:$J$30, Help!$K$24:$K$30 )","v":0},{"$f":"LOOKUP( Help!E25 - N($I$4), Help!$J$24:$J$30, Help!$K$24:$K$30 )","v":0},{"$f":"LOOKUP( Help!F25 - N($I$4), Help!$J$24:$J$30, Help!$K$24:$K$30 )","v":0},{"$f":"LOOKUP( Help!G25 - N($I$4), Help!$J$24:$J$30, Help!$K$24:$K$30 )","v":0},{"$f":"LOOKUP( Help!H25 - N($I$4), Help!$J$24:$J$30, Help!$K$24:$K$30 )","v":0},null,null,{"$f":"LOOKUP( Help!C25 - N($Q$4), Help!$J$24:$J$30, Help!$K$24:$K$30 )","v":0},{"$f":"LOOKUP( Help!D25 - N($Q$4), Help!$J$24:$J$30, Help!$K$24:$K$30 )","v":0},{"$f":"LOOKUP( Help!E25 - N($Q$4), Help!$J$24:$J$30, Help!$K$24:$K$30 )","v":0},{"$f":"LOOKUP( Help!F25 - N($Q$4), Help!$J$24:$J$30, Help!$K$24:$K$30 )","v":0},{"$f":"LOOKUP( Help!G25 - N($Q$4), Help!$J$24:$J$30, Help!$K$24:$K$30 )","v":0},{"$f":"LOOKUP( Help!H25 - N($Q$4), Help!$J$24:$J$30, Help!$K$24:$K$30 )","v":0},null,null,"Match",null,{"$f":"BB7","v":"…....................................."},null,null,null,null,null,{"$f":"IF( B5 <> \"\", B5, \"\" )","v":"Pils, Cola"},{"$f":"LOOKUP( Help!C25 - N($AH$4), Help!$J$24:$J$30, Help!$K$24:$K$30 )","v":0},{"$f":"LOOKUP( Help!D25 - N($AH$4), Help!$J$24:$J$30, Help!$K$24:$K$30 )","v":0},{"$f":"LOOKUP( Help!E25 - N($AH$4), Help!$J$24:$J$30, Help!$K$24:$K$30 )","v":0},{"$f":"LOOKUP( Help!F25 - N($AH$4), Help!$J$24:$J$30, Help!$K$24:$K$30 )","v":0},{"$f":"LOOKUP( Help!G25 - N($AH$4), Help!$J$24:$J$30, Help!$K$24:$K$30 )","v":0},{"$f":"LOOKUP( Help!H25 - N($AH$4), Help!$J$24:$J$30, Help!$K$24:$K$30 )","v":0},null,null,{"$f":"LOOKUP( Help!C25 - N($AP$4), Help!$J$24:$J$30, Help!$K$24:$K$30 )","v":0},{"$f":"LOOKUP( Help!D25 - N($AP$4), Help!$J$24:$J$30, Help!$K$24:$K$30 )","v":0},{"$f":"LOOKUP( Help!E25 - N($AP$4), Help!$J$24:$J$30, Help!$K$24:$K$30 )","v":0},{"$f":"LOOKUP( Help!F25 - N($AP$4), Help!$J$24:$J$30, Help!$K$24:$K$30 )","v":0},{"$f":"LOOKUP( Help!G25 - N($AP$4), Help!$J$24:$J$30, Help!$K$24:$K$30 )","v":0},{"$f":"LOOKUP( Help!H25 - N($AP$4), Help!$J$24:$J$30, Help!$K$24:$K$30 )","v":0},null,null,"Match",null,{"$f":"BB7","v":"…....................................."},null,null,null,null,null,null,null,null,null,null,null,{"$f":"AZ9","v":"Kassa beginstand"},null,null,null,{"$f":"AZ10","v":"Kassa eindstand"}]
[null,"Sprite, Fanta",{"$f":"LOOKUP( Help!C26 - N($I$4), Help!$J$24:$J$30, Help!$K$24:$K$30 )","v":0},{"$f":"LOOKUP( Help!D26 - N($I$4), Help!$J$24:$J$30, Help!$K$24:$K$30 )","v":0},{"$f":"LOOKUP( Help!E26 - N($I$4), Help!$J$24:$J$30, Help!$K$24:$K$30 )","v":0},{"$f":"LOOKUP( Help!F26 - N($I$4), Help!$J$24:$J$30, Help!$K$24:$K$30 )","v":0},{"$f":"LOOKUP( Help!G26 - N($I$4), Help!$J$24:$J$30, Help!$K$24:$K$30 )","v":0},{"$f":"LOOKUP( Help!H26 - N($I$4), Help!$J$24:$J$30, Help!$K$24:$K$30 )","v":0},null,null,{"$f":"LOOKUP( Help!C26 - N($Q$4), Help!$J$24:$J$30, Help!$K$24:$K$30 )","v":0},{"$f":"LOOKUP( Help!D26 - N($Q$4), Help!$J$24:$J$30, Help!$K$24:$K$30 )","v":0},{"$f":"LOOKUP( Help!E26 - N($Q$4), Help!$J$24:$J$30, Help!$K$24:$K$30 )","v":0},{"$f":"LOOKUP( Help!F26 - N($Q$4), Help!$J$24:$J$30, Help!$K$24:$K$30 )","v":0},{"$f":"LOOKUP( Help!G26 - N($Q$4), Help!$J$24:$J$30, Help!$K$24:$K$30 )","v":0},{"$f":"LOOKUP( Help!H26 - N($Q$4), Help!$J$24:$J$30, Help!$K$24:$K$30 )","v":0},null,null,null,null,null,null,null,null,null,null,"Sprite, Fanta",{"$f":"LOOKUP( Help!C26 - N($AH$4), Help!$J$24:$J$30, Help!$K$24:$K$30 )","v":0},{"$f":"LOOKUP( Help!D26 - N($AH$4), Help!$J$24:$J$30, Help!$K$24:$K$30 )","v":0},{"$f":"LOOKUP( Help!E26 - N($AH$4), Help!$J$24:$J$30, Help!$K$24:$K$30 )","v":0},{"$f":"LOOKUP( Help!F26 - N($AH$4), Help!$J$24:$J$30, Help!$K$24:$K$30 )","v":0},{"$f":"LOOKUP( Help!G26 - N($AH$4), Help!$J$24:$J$30, Help!$K$24:$K$30 )","v":0},{"$f":"LOOKUP( Help!H26 - N($AH$4), Help!$J$24:$J$30, Help!$K$24:$K$30 )","v":0},null,null,{"$f":"LOOKUP( Help!C26 - N($AP$4), Help!$J$24:$J$30, Help!$K$24:$K$30 )","v":0},{"$f":"LOOKUP( Help!D26 - N($AP$4), Help!$J$24:$J$30, Help!$K$24:$K$30 )","v":0},{"$f":"LOOKUP( Help!E26 - N($AP$4), Help!$J$24:$J$30, Help!$K$24:$K$30 )","v":0},{"$f":"LOOKUP( Help!F26 - N($AP$4), Help!$J$24:$J$30, Help!$K$24:$K$30 )","v":0},{"$f":"LOOKUP( Help!G26 - N($AP$4), Help!$J$24:$J$30, Help!$K$24:$K$30 )","v":0},{"$f":"LOOKUP( Help!H26 - N($AP$4), Help!$J$24:$J$30, Help!$K$24:$K$30 )","v":0},null,null,null,null,null,null,null,null,null,null,"Datum",null,{"$f":"INPUT_Datum","v":"         /         / 2019"}]
[null,"Water, Gini",{"$f":"LOOKUP( Help!C27 - N($I$4), Help!$J$24:$J$30, Help!$K$24:$K$30 )","v":0},{"$f":"LOOKUP( Help!D27 - N($I$4), Help!$J$24:$J$30, Help!$K$24:$K$30 )","v":0},{"$f":"LOOKUP( Help!E27 - N($I$4), Help!$J$24:$J$30, Help!$K$24:$K$30 )","v":0},{"$f":"LOOKUP( Help!F27 - N($I$4), Help!$J$24:$J$30, Help!$K$24:$K$30 )","v":0},{"$f":"LOOKUP( Help!G27 - N($I$4), Help!$J$24:$J$30, Help!$K$24:$K$30 )","v":0},{"$f":"LOOKUP( Help!H27 - N($I$4), Help!$J$24:$J$30, Help!$K$24:$K$30 )","v":0},null,null,{"$f":"LOOKUP( Help!C27 - N($Q$4), Help!$J$24:$J$30, Help!$K$24:$K$30 )","v":0},{"$f":"LOOKUP( Help!D27 - N($Q$4), Help!$J$24:$J$30, Help!$K$24:$K$30 )","v":0},{"$f":"LOOKUP( Help!E27 - N($Q$4), Help!$J$24:$J$30, Help!$K$24:$K$30 )","v":0},{"$f":"LOOKUP( Help!F27 - N($Q$4), Help!$J$24:$J$30, Help!$K$24:$K$30 )","v":0},{"$f":"LOOKUP( Help!G27 - N($Q$4), Help!$J$24:$J$30, Help!$K$24:$K$30 )","v":0},{"$f":"LOOKUP( Help!H27 - N($Q$4), Help!$J$24:$J$30, Help!$K$24:$K$30 )","v":0},null,null,null,null,null,null,null,null,null,null,"Water, Gini",{"$f":"LOOKUP( Help!C27 - N($AH$4), Help!$J$24:$J$30, Help!$K$24:$K$30 )","v":0},{"$f":"LOOKUP( Help!D27 - N($AH$4), Help!$J$24:$J$30, Help!$K$24:$K$30 )","v":0},{"$f":"LOOKUP( Help!E27 - N($AH$4), Help!$J$24:$J$30, Help!$K$24:$K$30 )","v":0},{"$f":"LOOKUP( Help!F27 - N($AH$4), Help!$J$24:$J$30, Help!$K$24:$K$30 )","v":0},{"$f":"LOOKUP( Help!G27 - N($AH$4), Help!$J$24:$J$30, Help!$K$24:$K$30 )","v":0},{"$f":"LOOKUP( Help!H27 - N($AH$4), Help!$J$24:$J$30, Help!$K$24:$K$30 )","v":0},null,null,{"$f":"LOOKUP( Help!C27 - N($AP$4), Help!$J$24:$J$30, Help!$K$24:$K$30 )","v":0},{"$f":"LOOKUP( Help!D27 - N($AP$4), Help!$J$24:$J$30, Help!$K$24:$K$30 )","v":0},{"$f":"LOOKUP( Help!E27 - N($AP$4), Help!$J$24:$J$30, Help!$K$24:$K$30 )","v":0},{"$f":"LOOKUP( Help!F27 - N($AP$4), Help!$J$24:$J$30, Help!$K$24:$K$30 )","v":0},{"$f":"LOOKUP( Help!G27 - N($AP$4), Help!$J$24:$J$30, Help!$K$24:$K$30 )","v":0},{"$f":"LOOKUP( Help!H27 - N($AP$4), Help!$J$24:$J$30, Help!$K$24:$K$30 )","v":0},null,null,null,null,null,null,null,null,null,null,"Match",null,{"$f":"INPUT_Lange_Tekst","v":"…....................................."},null,null,null,"Aantal","Waarde",null,null,"Aantal","Waarde"]
[null,"Koffie, T, Soep",{"$f":"LOOKUP( Help!C28 - N($I$4), Help!$J$24:$J$30, Help!$K$24:$K$30 )","v":0},{"$f":"LOOKUP( Help!D28 - N($I$4), Help!$J$24:$J$30, Help!$K$24:$K$30 )","v":0},{"$f":"LOOKUP( Help!E28 - N($I$4), Help!$J$24:$J$30, Help!$K$24:$K$30 )","v":0},{"$f":"LOOKUP( Help!F28 - N($I$4), Help!$J$24:$J$30, Help!$K$24:$K$30 )","v":0},{"$f":"LOOKUP( Help!G28 - N($I$4), Help!$J$24:$J$30, Help!$K$24:$K$30 )","v":0},{"$f":"LOOKUP( Help!H28 - N($I$4), Help!$J$24:$J$30, Help!$K$24:$K$30 )","v":0},{"$f":"IF( COUNTIF( C4:H9, \">0\" ) > 0, SUM( C4:H9 ), INPUT_Stuks )","v":"   st"},null,{"$f":"LOOKUP( Help!C28 - N($Q$4), Help!$J$24:$J$30, Help!$K$24:$K$30 )","v":0},{"$f":"LOOKUP( Help!D28 - N($Q$4), Help!$J$24:$J$30, Help!$K$24:$K$30 )","v":0},{"$f":"LOOKUP( Help!E28 - N($Q$4), Help!$J$24:$J$30, Help!$K$24:$K$30 )","v":0},{"$f":"LOOKUP( Help!F28 - N($Q$4), Help!$J$24:$J$30, Help!$K$24:$K$30 )","v":0},{"$f":"LOOKUP( Help!G28 - N($Q$4), Help!$J$24:$J$30, Help!$K$24:$K$30 )","v":0},{"$f":"LOOKUP( Help!H28 - N($Q$4), Help!$J$24:$J$30, Help!$K$24:$K$30 )","v":0},{"$f":"IF( COUNTIF( K4:P9, \">0\" ) > 0, SUM( K4:P9 ), INPUT_Stuks )","v":"   st"},null,"Direct betaald",null,null,null,null,null,null,null,"Koffie, T, Soep",{"$f":"LOOKUP( Help!C28 - N($AH$4), Help!$J$24:$J$30, Help!$K$24:$K$30 )","v":0},{"$f":"LOOKUP( Help!D28 - N($AH$4), Help!$J$24:$J$30, Help!$K$24:$K$30 )","v":0},{"$f":"LOOKUP( Help!E28 - N($AH$4), Help!$J$24:$J$30, Help!$K$24:$K$30 )","v":0},{"$f":"LOOKUP( Help!F28 - N($AH$4), Help!$J$24:$J$30, Help!$K$24:$K$30 )","v":0},{"$f":"LOOKUP( Help!G28 - N($AH$4), Help!$J$24:$J$30, Help!$K$24:$K$30 )","v":0},{"$f":"LOOKUP( Help!H28 - N($AH$4), Help!$J$24:$J$30, Help!$K$24:$K$30 )","v":0},{"$f":"IF( COUNTIF( AB4:AG9, \">0\" ) > 0, SUM( AB4:AG9 ), INPUT_Stuks )","v":"   st"},null,{"$f":"LOOKUP( Help!C28 - N($AP$4), Help!$J$24:$J$30, Help!$K$24:$K$30 )","v":0},{"$f":"LOOKUP( Help!D28 - N($AP$4), Help!$J$24:$J$30, Help!$K$24:$K$30 )","v":0},{"$f":"LOOKUP( Help!E28 - N($AP$4), Help!$J$24:$J$30, Help!$K$24:$K$30 )","v":0},{"$f":"LOOKUP( Help!F28 - N($AP$4), Help!$J$24:$J$30, Help!$K$24:$K$30 )","v":0},{"$f":"LOOKUP( Help!G28 - N($AP$4), Help!$J$24:$J$30, Help!$K$24:$K$30 )","v":0},{"$f":"LOOKUP( Help!H28 - N($AP$4), Help!$J$24:$J$30, Help!$K$24:$K$30 )","v":0},{"$f":"IF( COUNTIF( AJ4:AO9, \">0\" ) > 0, SUM( AJ4:AO9 ), INPUT_Stuks )","v":"   st"},null,{"$f":"S8","v":"Direct betaald"},null,null,null,null,null,null,null,null,null,null,null,null,100,{"$f":"INPUT_Stuks","v":"   st"},{"$f":"IF( ISNUMBER( BF8 ), BE8 * BF8, INPUT_Kort_Bedrag )","v":"   €"},null,100,{"$f":"INPUT_Stuks","v":"   st"},{"$f":"IF( ISNUMBER( BJ8 ), BI8 * BJ8, INPUT_Kort_Bedrag )","v":"   €"}]
[null,"Choco, Chips",{"$f":"LOOKUP( Help!C29 - N($I$4), Help!$J$24:$J$30, Help!$K$24:$K$30 )","v":0},{"$f":"LOOKUP( Help!D29 - N($I$4), Help!$J$24:$J$30, Help!$K$24:$K$30 )","v":0},{"$f":"LOOKUP( Help!E29 - N($I$4), Help!$J$24:$J$30, Help!$K$24:$K$30 )","v":0},{"$f":"LOOKUP( Help!F29 - N($I$4), Help!$J$24:$J$30, Help!$K$24:$K$30 )","v":0},{"$f":"LOOKUP( Help!G29 - N($I$4), Help!$J$24:$J$30, Help!$K$24:$K$30 )","v":0},{"$f":"LOOKUP( Help!H29 - N($I$4), Help!$J$24:$J$30, Help!$K$24:$K$30 )","v":0},{"$f":"IF( COUNTIF( C4:H9, \">0\" ) > 0, $B4 * I8, INPUT_Kort_Bedrag )","v":"   €"},null,{"$f":"LOOKUP( Help!C29 - N($Q$4), Help!$J$24:$J$30, Help!$K$24:$K$30 )","v":0},{"$f":"LOOKUP( Help!D29 - N($Q$4), Help!$J$24:$J$30, Help!$K$24:$K$30 )","v":0},{"$f":"LOOKUP( Help!E29 - N($Q$4), Help!$J$24:$J$30, Help!$K$24:$K$30 )","v":0},{"$f":"LOOKUP( Help!F29 - N($Q$4), Help!$J$24:$J$30, Help!$K$24:$K$30 )","v":0},{"$f":"LOOKUP( Help!G29 - N($Q$4), Help!$J$24:$J$30, Help!$K$24:$K$30 )","v":0},{"$f":"LOOKUP( Help!H29 - N($Q$4), Help!$J$24:$J$30, Help!$K$24:$K$30 )","v":0},{"$f":"IF( COUNTIF( K4:P9, \">0\" ) > 0, $B4 * Q8, INPUT_Kort_Bedrag )","v":"   €"},null,null,null,null,null,null,null,null,null,"Choco, Chips",{"$f":"LOOKUP( Help!C29 - N($AH$4), Help!$J$24:$J$30, Help!$K$24:$K$30 )","v":0},{"$f":"LOOKUP( Help!D29 - N($AH$4), Help!$J$24:$J$30, Help!$K$24:$K$30 )","v":0},{"$f":"LOOKUP( Help!E29 - N($AH$4), Help!$J$24:$J$30, Help!$K$24:$K$30 )","v":0},{"$f":"LOOKUP( Help!F29 - N($AH$4), Help!$J$24:$J$30, Help!$K$24:$K$30 )","v":0},{"$f":"LOOKUP( Help!G29 - N($AH$4), Help!$J$24:$J$30, Help!$K$24:$K$30 )","v":0},{"$f":"LOOKUP( Help!H29 - N($AH$4), Help!$J$24:$J$30, Help!$K$24:$K$30 )","v":0},{"$f":"IF( COUNTIF( AB4:AG9, \">0\" ) > 0, $B4 * AH8, INPUT_Kort_Bedrag )","v":"   €"},null,{"$f":"LOOKUP( Help!C29 - N($AP$4), Help!$J$24:$J$30, Help!$K$24:$K$30 )","v":0},{"$f":"LOOKUP( Help!D29 - N($AP$4), Help!$J$24:$J$30, Help!$K$24:$K$30 )","v":0},{"$f":"LOOKUP( Help!E29 - N($AP$4), Help!$J$24:$J$30, Help!$K$24:$K$30 )","v":0},{"$f":"LOOKUP( Help!F29 - N($AP$4), Help!$J$24:$J$30, Help!$K$24:$K$30 )","v":0},{"$f":"LOOKUP( Help!G29 - N($AP$4), Help!$J$24:$J$30, Help!$K$24:$K$30 )","v":0},{"$f":"LOOKUP( Help!H29 - N($AP$4), Help!$J$24:$J$30, Help!$K$24:$K$30 )","v":0},{"$f":"IF( COUNTIF( AJ4:AO9, \">0\" ) > 0, $B4 * AP8, INPUT_Kort_Bedrag )","v":"   €"},null,null,null,null,null,null,null,null,null,"Kassa beginstand",null,{"$f":"IF( COUNT( BF8:BF21 ) > 0, BG23, INPUT_Lang_Bedrag )","v":"….................. €"},"-",null,50,{"$f":"INPUT_Stuks","v":"   st"},{"$f":"IF( ISNUMBER( BF9 ), BE9 * BF9, INPUT_Kort_Bedrag )","v":"   €"},null,50,{"$f":"INPUT_Stuks","v":"   st"},"   €"]
[null,null,null,null,null,null,null,null,null,null,null,null,null,null,null,null,null,null,null,null,null,null,null,null,null,null,null,null,null,null,null,null,null,null,null,null,null,null,null,null,null,null,null,null,null,null,null,null,null,null,null,"Kassa eindstand",null,{"$f":"IF( COUNT( BJ8:BJ21 ) > 0, BK23, INPUT_Lang_Bedrag )","v":"….................. €"},"+",null,20,{"$f":"INPUT_Stuks","v":"   st"},"   €",null,20,{"$f":"INPUT_Stuks","v":"   st"},"   €"]
{"$rows_left_out":26}
{"sheet":"Help","index":1,"n_rows":30,"n_cols":11,"rows_kept":30,"cut":false,"hidden":false,"merged":[]}
[]
[null,"Constanten"]
[]
[null,"INPUT_Datum",{"$f":"\"         /         / \" & YEAR( TODAY())","v":"         /         / 2019"}]
[null,"INPUT_Kort_Bedrag","   €"]
[null,"INPUT_Lang_Bedrag","….................. €"]
[null,"INPUT_Korte_Tekst","…....................."]
[null,"INPUT_Lange_Tekst","…....................................."]
[null,"INPUT_Stuks","   st"]
[]
{"$rows_left_out":20}